{"text_format":"1","workbook":"xlsx","n_sheets":3,"sheets":["Main","الفرعي","New_sheet"],"not_rendered":{"charts":0,"images":0,"macros":1,"external_links":0,"defined_names":0,"comments":0,"pivot_tables":0},"unopened":[],"bounds":{"document_bytes":16777216,"sheet_cells":100000,"rows_first":2000,"rows_last":500,"rows_between":2000,"halvings":0,"cell_chars":16384,"cell_head_chars":4096},"cells_cut":0,"cells_raw":0,"read":"whole","date_system":"1900"}

{"sheet":"Main","index":0,"n_rows":29,"n_cols":29,"rows_kept":29,"cut":false,"hidden":false,"merged":[]}
["no","a","b","name","r","d","t","fg","jh","mn","ch","yy","u","oi","kh","sa","as","qw","po","op","wq","vv","nv","zx","xz","lo","ol","mr","rt"]
[1,24,28,"محمد",36,44,48,52,60,68,72,96,68,96,100,132,100,104,108,112,116,120,24,36,40,40,44,52,56]
[2,68,32,"احمد",40,48,52,56,64,72,76,100,72,100,104,24,104,108,112,116,120,124,28,40,44,44,48,56,2]
[3,40,36,"قاسم",44,52,56,60,68,76,80,104,76,104,108,40,108,112,116,120,124,128,32,44,48,48,52,60,64]
[1,44,40,"عمرو",48,56,60,64,72,80,84,108,80,108,112,44,112,116,120,124,128,132,36,48,52,52,56,64,68]
[5,64,44,"طلعت",52,60,64,68,76,84,88,112,84,24,116,48,116,120,124,128,132,24,40,52,56,56,60,68,72]
[6,68,48,"محسن",56,60,68,72,76,84,92,96,120,92,32,124,56,124,128,132,24,28,44,56,60,60,64,72,76]
[7,72,52,"حسن",60,68,72,76,84,92,96,120,92,32,124,56,124,128,132,24,28,32,48,60,64,64,68,76,80]
[8,76,56,"كلثوم",64,72,76,80,88,96,100,124,96,36,128,60,128,132,24,28,32,36,52,64,68,68,72,80,84]
[9,24,60,"ميادة",68,76,80,84,92,100,104,128,100,40,132,64,132,24,28,32,36,40,56,68,72,72,76,84,88]
[10,28,64,"انور",72,80,84,88,96,104,108,132,52,44,24,68,24,28,32,40,40,44,60,72,76,76,80,88,92]
[11,32,68,"مهند",76,84,88,92,100,108,112,24,56,48,28,72,28,32,36,36,44,48,64,76,80,80,84,92,96]
[12,36,72,"اتوار",80,null,92,96,104,112,116,28,60,52,32,76,32,36,40,44,48,52,68,80,84,84,88,96,100]
[13,40,76,"اروى",84,92,96,100,108,116,120,32,64,56,36,80,36,40,44,48,52,56,72,84,88,88,92,100,104]
[14,44,80,"سميحة",88,96,100,null,112,120,124,36,68,60,40,84,40,44,48,52,56,60,76,88,92,92,96,104,108]
[15,48,84,"دولة",92,100,104,108,116,124,128,40,72,64,44,88,44,48,52,56,60,64,80,92,96,96,100,108,112]
[16,52,88,"علي",96,104,108,112,120,128,132,44,76,68,48,92,48,52,56,60,64,68,84,96,100,100,104,112,116]
[17,56,92,"عبدالله",100,108,112,116,124,132,24,48,80,72,52,96,52,56,60,64,68,72,88,100,104,104,108,116,120]
[18,60,96,"عبدالملك",104,112,116,120,128,24,28,52,84,76,56,100,56,60,64,68,72,76,92,104,108,108,112,120,124]
[19,64,100,"عبدالعزيز",108,116,120,124,132,28,32,56,88,80,60,104,60,64,68,72,76,80,96,108,112,112,116,124,128]
[20,68,104,"عبدالحميد",112,120,124,128,24,32,36,60,92,84,64,108,64,68,72,76,80,84,100,112,116,116,120,128,132]
[21,72,108,"شعبان",116,124,128,132,28,36,40,64,96,88,68,112,68,72,76,80,84,88,104,116,120,120,124,132,24]
[22,76,112,"مختار",120,128,132,24,32,40,44,68,100,92,72,116,72,76,80,84,88,92,108,120,124,124,128,24,28]
[23,80,116,"السيد",124,132,24,28,36,44,48,72,104,96,76,120,76,80,84,88,92,96,112,124,128,128,132,128,32]
[24,84,120,"مسعد",128,24,28,32,40,48,52,76,108,100,80,124,80,84,88,92,96,100,116,118,132,132,24,32,36]
[25,88,124,"سعيد",132,28,32,36,44,52,56,80,112,104,84,128,84,88,92,96,100,104,120,132,24,24,28,36,40]
[26,92,128,"عبدالرازق",24,32,36,40,48,56,60,84,116,108,88,132,88,92,96,100,104,108,124,24,28,28,32,40,44]
[27,96,132,"متولي",28,36,40,44,52,60,64,88,120,112,92,24,92,96,100,104,108,112,128,28,32,32,36,44,48]
[28,100,24,"عبدالوكيل",32,40,44,48,56,64,68,92,124,116,96,28,96,100,104,108,112,116,132,32,36,36,40,48,52]

{"sheet":"الفرعي","index":1,"n_rows":12,"n_cols":31,"rows_kept":12,"cut":false,"hidden":false,"merged":[]}
["no","name","oi","kh","sa","as","t","fg","jh","mn","ch","yy","po","a","b","c","r","d","vv","op","zx","fdf","nv","hgt"]
[20,{"$f":"Salim_saerch(Main!$A$2:$A$29,$A2,COLUMNS($A$1:A1))","v":68},{"$f":"Salim_saerch(Main!$A$2:$A$29,$A2,COLUMNS($A$1:B1))","v":104},{"$f":"Salim_saerch(Main!$A$2:$A$29,$A2,COLUMNS($A$1:C1))","v":"عبدالحميد"},{"$f":"Salim_saerch(Main!$A$2:$A$29,$A2,COLUMNS($A$1:D1))","v":112},{"$f":"Salim_saerch(Main!$A$2:$A$29,$A2,COLUMNS($A$1:E1))","v":120},{"$f":"Salim_saerch(Main!$A$2:$A$29,$A2,COLUMNS($A$1:F1))","v":124},{"$f":"Salim_saerch(Main!$A$2:$A$29,$A2,COLUMNS($A$1:G1))","v":128},{"$f":"Salim_saerch(Main!$A$2:$A$29,$A2,COLUMNS($A$1:H1))","v":24},{"$f":"Salim_saerch(Main!$A$2:$A$29,$A2,COLUMNS($A$1:I1))","v":32},{"$f":"Salim_saerch(Main!$A$2:$A$29,$A2,COLUMNS($A$1:J1))","v":36},{"$f":"Salim_saerch(Main!$A$2:$A$29,$A2,COLUMNS($A$1:K1))","v":60},{"$f":"Salim_saerch(Main!$A$2:$A$29,$A2,COLUMNS($A$1:L1))","v":92},{"$f":"Salim_saerch(Main!$A$2:$A$29,$A2,COLUMNS($A$1:M1))","v":84},{"$f":"Salim_saerch(Main!$A$2:$A$29,$A2,COLUMNS($A$1:N1))","v":64},{"$f":"Salim_saerch(Main!$A$2:$A$29,$A2,COLUMNS($A$1:O1))","v":108},{"$f":"Salim_saerch(Main!$A$2:$A$29,$A2,COLUMNS($A$1:P1))","v":64},{"$f":"Salim_saerch(Main!$A$2:$A$29,$A2,COLUMNS($A$1:Q1))","v":68},{"$f":"Salim_saerch(Main!$A$2:$A$29,$A2,COLUMNS($A$1:R1))","v":72},{"$f":"Salim_saerch(Main!$A$2:$A$29,$A2,COLUMNS($A$1:S1))","v":76},{"$f":"Salim_saerch(Main!$A$2:$A$29,$A2,COLUMNS($A$1:T1))","v":80},{"$f":"Salim_saerch(Main!$A$2:$A$29,$A2,COLUMNS($A$1:U1))","v":84},{"$f":"Salim_saerch(Main!$A$2:$A$29,$A2,COLUMNS($A$1:V1))","v":100},{"$f":"Salim_saerch(Main!$A$2:$A$29,$A2,COLUMNS($A$1:W1))","v":112},{"$f":"Salim_saerch(Main!$A$2:$A$29,$A2,COLUMNS($A$1:X1))","v":116},{"$f":"Salim_saerch(Main!$A$2:$A$29,$A2,COLUMNS($A$1:Y1))","v":116},{"$f":"Salim_saerch(Main!$A$2:$A$29,$A2,COLUMNS($A$1:Z1))","v":120},{"$f":"Salim_saerch(Main!$A$2:$A$29,$A2,COLUMNS($A$1:AA1))","v":128},{"$f":"Salim_saerch(Main!$A$2:$A$29,$A2,COLUMNS($A$1:AB1))","v":132},{"$f":"Salim_saerch(Main!$A$2:$A$29,$A2,COLUMNS($A$1:AC1))","v":""},{"$f":"Salim_saerch(Main!$A$2:$A$29,$A2,COLUMNS($A$1:AE1)-1)","v":""}]
[19,{"$f":"Salim_saerch(Main!$A$2:$A$29,$A3,COLUMNS($A$1:A2))","v":64},{"$f":"Salim_saerch(Main!$A$2:$A$29,$A3,COLUMNS($A$1:B2))","v":100},{"$f":"Salim_saerch(Main!$A$2:$A$29,$A3,COLUMNS($A$1:C2))","v":"عبدالعزيز"},{"$f":"Salim_saerch(Main!$A$2:$A$29,$A3,COLUMNS($A$1:D2))","v":108},{"$f":"Salim_saerch(Main!$A$2:$A$29,$A3,COLUMNS($A$1:E2))","v":116},{"$f":"Salim_saerch(Main!$A$2:$A$29,$A3,COLUMNS($A$1:F2))","v":120},{"$f":"Salim_saerch(Main!$A$2:$A$29,$A3,COLUMNS($A$1:G2))","v":124},{"$f":"Salim_saerch(Main!$A$2:$A$29,$A3,COLUMNS($A$1:H2))","v":132},{"$f":"Salim_saerch(Main!$A$2:$A$29,$A3,COLUMNS($A$1:I2))","v":28},{"$f":"Salim_saerch(Main!$A$2:$A$29,$A3,COLUMNS($A$1:J2))","v":32},{"$f":"Salim_saerch(Main!$A$2:$A$29,$A3,COLUMNS($A$1:K2))","v":56},{"$f":"Salim_saerch(Main!$A$2:$A$29,$A3,COLUMNS($A$1:L2))","v":88},{"$f":"Salim_saerch(Main!$A$2:$A$29,$A3,COLUMNS($A$1:M2))","v":80},{"$f":"Salim_saerch(Main!$A$2:$A$29,$A3,COLUMNS($A$1:N2))","v":60},{"$f":"Salim_saerch(Main!$A$2:$A$29,$A3,COLUMNS($A$1:O2))","v":104},{"$f":"Salim_saerch(Main!$A$2:$A$29,$A3,COLUMNS($A$1:P2))","v":60},{"$f":"Salim_saerch(Main!$A$2:$A$29,$A3,COLUMNS($A$1:Q2))","v":64},{"$f":"Salim_saerch(Main!$A$2:$A$29,$A3,COLUMNS($A$1:R2))","v":68},{"$f":"Salim_saerch(Main!$A$2:$A$29,$A3,COLUMNS($A$1:S2))","v":72},{"$f":"Salim_saerch(Main!$A$2:$A$29,$A3,COLUMNS($A$1:T2))","v":76},{"$f":"Salim_saerch(Main!$A$2:$A$29,$A3,COLUMNS($A$1:U2))","v":80},{"$f":"Salim_saerch(Main!$A$2:$A$29,$A3,COLUMNS($A$1:V2))","v":96},{"$f":"Salim_saerch(Main!$A$2:$A$29,$A3,COLUMNS($A$1:W2))","v":108},{"$f":"Salim_saerch(Main!$A$2:$A$29,$A3,COLUMNS($A$1:X2))","v":112},{"$f":"Salim_saerch(Main!$A$2:$A$29,$A3,COLUMNS($A$1:Y2))","v":112},{"$f":"Salim_saerch(Main!$A$2:$A$29,$A3,COLUMNS($A$1:Z2))","v":116},{"$f":"Salim_saerch(Main!$A$2:$A$29,$A3,COLUMNS($A$1:AA2))","v":124},{"$f":"Salim_saerch(Main!$A$2:$A$29,$A3,COLUMNS($A$1:AB2))","v":128}]
[null,{"$f":"Salim_saerch(Main!$A$2:$A$29,$A4,COLUMNS($A$1:A3))","v":"N/A"},{"$f":"Salim_saerch(Main!$A$2:$A$29,$A4,COLUMNS($A$1:B3))","v":"N/A"},{"$f":"Salim_saerch(Main!$A$2:$A$29,$A4,COLUMNS($A$1:C3))","v":"N/A"},{"$f":"Salim_saerch(Main!$A$2:$A$29,$A4,COLUMNS($A$1:D3))","v":"N/A"},{"$f":"Salim_saerch(Main!$A$2:$A$29,$A4,COLUMNS($A$1:E3))","v":"N/A"},{"$f":"Salim_saerch(Main!$A$2:$A$29,$A4,COLUMNS($A$1:F3))","v":"N/A"},{"$f":"Salim_saerch(Main!$A$2:$A$29,$A4,COLUMNS($A$1:G3))","v":"N/A"},{"$f":"Salim_saerch(Main!$A$2:$A$29,$A4,COLUMNS($A$1:H3))","v":"N/A"},{"$f":"Salim_saerch(Main!$A$2:$A$29,$A4,COLUMNS($A$1:I3))","v":"N/A"},{"$f":"Salim_saerch(Main!$A$2:$A$29,$A4,COLUMNS($A$1:J3))","v":"N/A"},{"$f":"Salim_saerch(Main!$A$2:$A$29,$A4,COLUMNS($A$1:K3))","v":"N/A"},{"$f":"Salim_saerch(Main!$A$2:$A$29,$A4,COLUMNS($A$1:L3))","v":"N/A"},{"$f":"Salim_saerch(Main!$A$2:$A$29,$A4,COLUMNS($A$1:M3))","v":"N/A"},{"$f":"Salim_saerch(Main!$A$2:$A$29,$A4,COLUMNS($A$1:N3))","v":"N/A"},{"$f":"Salim_saerch(Main!$A$2:$A$29,$A4,COLUMNS($A$1:O3))","v":"N/A"},{"$f":"Salim_saerch(Main!$A$2:$A$29,$A4,COLUMNS($A$1:P3))","v":"N/A"},{"$f":"Salim_saerch(Main!$A$2:$A$29,$A4,COLUMNS($A$1:Q3))","v":"N/A"},{"$f":"Salim_saerch(Main!$A$2:$A$29,$A4,COLUMNS($A$1:R3))","v":"N/A"},{"$f":"Salim_saerch(Main!$A$2:$A$29,$A4,COLUMNS($A$1:S3))","v":"N/A"},{"$f":"Salim_saerch(Main!$A$2:$A$29,$A4,COLUMNS($A$1:T3))","v":"N/A"},{"$f":"Salim_saerch(Main!$A$2:$A$29,$A4,COLUMNS($A$1:U3))","v":"N/A"},{"$f":"Salim_saerch(Main!$A$2:$A$29,$A4,COLUMNS($A$1:V3))","v":"N/A"},{"$f":"Salim_saerch(Main!$A$2:$A$29,$A4,COLUMNS($A$1:W3))","v":"N/A"},{"$f":"Salim_saerch(Main!$A$2:$A$29,$A4,COLUMNS($A$1:X3))","v":"N/A"},{"$f":"Salim_saerch(Main!$A$2:$A$29,$A4,COLUMNS($A$1:Y3))","v":"N/A"},{"$f":"Salim_saerch(Main!$A$2:$A$29,$A4,COLUMNS($A$1:Z3))","v":"N/A"},{"$f":"Salim_saerch(Main!$A$2:$A$29,$A4,COLUMNS($A$1:AA3))","v":"N/A"},{"$f":"Salim_saerch(Main!$A$2:$A$29,$A4,COLUMNS($A$1:AB3))","v":"N/A"}]
[]
[null,null,null,null,null,null,null,null," =Salim_saerch(الرئيسي!$A$2:$A$29,$A2,COLUMNS($A$1:A1))"]
[]
[null,null,null,"Change Here",null,null,null,null,"هنا انت قيدتني بعدد الصفوف والاعمدة في الرئيسي يعني لو اضفت صف جديد ضروري اعدل المعادلة اريد ان يكون من A:A"]
[]
[]
[]
[null,"في اعلى العمود مكتوب name اريده يعطني ال name من الرئيسي هنا الذي هو عبدالحميد وليس في العمود kh "]

{"sheet":"New_sheet","index":2,"n_rows":6,"n_cols":69,"rows_kept":6,"cut":false,"hidden":false,"merged":[]}
["no","name","oi","kh","sa","as","t","fg","jh","mn","ch","yy","po","a","b","c","r","d","vv","op","zx","fdf","nv","hgt"]
[20,{"$f":"Salim_saerch(Main!$A$2:$A$29,$A2,COLUMNS($A$1:A1))","v":68},{"$f":"Salim_saerch(Main!$A$2:$A$29,$A2,COLUMNS($A$1:B1))","v":104},{"$f":"Salim_saerch(Main!$A$2:$A$29,$A2,COLUMNS($A$1:C1))","v":"عبدالحميد"},{"$f":"Salim_saerch(Main!$A$2:$A$29,$A2,COLUMNS($A$1:D1))","v":112},{"$f":"Salim_saerch(Main!$A$2:$A$29,$A2,COLUMNS($A$1:E1))","v":120},{"$f":"Salim_saerch(Main!$A$2:$A$29,$A2,COLUMNS($A$1:F1))","v":124},{"$f":"Salim_saerch(Main!$A$2:$A$29,$A2,COLUMNS($A$1:G1))","v":128},{"$f":"Salim_saerch(Main!$A$2:$A$29,$A2,COLUMNS($A$1:H1))","v":24},{"$f":"Salim_saerch(Main!$A$2:$A$29,$A2,COLUMNS($A$1:I1))","v":32},{"$f":"Salim_saerch(Main!$A$2:$A$29,$A2,COLUMNS($A$1:J1))","v":36},{"$f":"Salim_saerch(Main!$A$2:$A$29,$A2,COLUMNS($A$1:K1))","v":60},{"$f":"Salim_saerch(Main!$A$2:$A$29,$A2,COLUMNS($A$1:L1))","v":92},{"$f":"Salim_saerch(Main!$A$2:$A$29,$A2,COLUMNS($A$1:M1))","v":84},{"$f":"Salim_saerch(Main!$A$2:$A$29,$A2,COLUMNS($A$1:N1))","v":64},{"$f":"Salim_saerch(Main!$A$2:$A$29,$A2,COLUMNS($A$1:O1))","v":108},{"$f":"Salim_saerch(Main!$A$2:$A$29,$A2,COLUMNS($A$1:P1))","v":64},{"$f":"Salim_saerch(Main!$A$2:$A$29,$A2,COLUMNS($A$1:Q1))","v":68},{"$f":"Salim_saerch(Main!$A$2:$A$29,$A2,COLUMNS($A$1:R1))","v":72},{"$f":"Salim_saerch(Main!$A$2:$A$29,$A2,COLUMNS($A$1:S1))","v":76},{"$f":"Salim_saerch(Main!$A$2:$A$29,$A2,COLUMNS($A$1:T1))","v":80},{"$f":"Salim_saerch(Main!$A$2:$A$29,$A2,COLUMNS($A$1:U1))","v":84},{"$f":"Salim_saerch(Main!$A$2:$A$29,$A2,COLUMNS($A$1:V1))","v":100},{"$f":"Salim_saerch(Main!$A$2:$A$29,$A2,COLUMNS($A$1:W1))","v":112},{"$f":"Salim_saerch(Main!$A$2:$A$29,$A2,COLUMNS($A$1:X1))","v":116},{"$f":"Salim_saerch(Main!$A$2:$A$29,$A2,COLUMNS($A$1:Y1))","v":116},{"$f":"Salim_saerch(Main!$A$2:$A$29,$A2,COLUMNS($A$1:Z1))","v":120},{"$f":"Salim_saerch(Main!$A$2:$A$29,$A2,COLUMNS($A$1:AA1))","v":128},{"$f":"Salim_saerch(Main!$A$2:$A$29,$A2,COLUMNS($A$1:AB1))","v":132},{"$f":"Salim_saerch(Main!$A$2:$A$29,$A2,COLUMNS($A$1:AC1))","v":""},{"$f":"Salim_saerch(Main!$A$2:$A$29,$A2,COLUMNS($A$1:AE1)-1)","v":""}]
[19,{"$f":"Salim_saerch(Main!$A$2:$A$29,$A3,COLUMNS($A$1:A2))","v":64},{"$f":"Salim_saerch(Main!$A$2:$A$29,$A3,COLUMNS($A$1:B2))","v":100},{"$f":"Salim_saerch(Main!$A$2:$A$29,$A3,COLUMNS($A$1:C2))","v":"عبدالعزيز"},{"$f":"Salim_saerch(Main!$A$2:$A$29,$A3,COLUMNS($A$1:D2))","v":108},{"$f":"Salim_saerch(Main!$A$2:$A$29,$A3,COLUMNS($A$1:E2))","v":116},{"$f":"Salim_saerch(Main!$A$2:$A$29,$A3,COLUMNS($A$1:F2))","v":120},{"$f":"Salim_saerch(Main!$A$2:$A$29,$A3,COLUMNS($A$1:G2))","v":124},{"$f":"Salim_saerch(Main!$A$2:$A$29,$A3,COLUMNS($A$1:H2))","v":132},{"$f":"Salim_saerch(Main!$A$2:$A$29,$A3,COLUMNS($A$1:I2))","v":28},{"$f":"Salim_saerch(Main!$A$2:$A$29,$A3,COLUMNS($A$1:J2))","v":32},{"$f":"Salim_saerch(Main!$A$2:$A$29,$A3,COLUMNS($A$1:K2))","v":56},{"$f":"Salim_saerch(Main!$A$2:$A$29,$A3,COLUMNS($A$1:L2))","v":88},{"$f":"Salim_saerch(Main!$A$2:$A$29,$A3,COLUMNS($A$1:M2))","v":80},{"$f":"Salim_saerch(Main!$A$2:$A$29,$A3,COLUMNS($A$1:N2))","v":60},{"$f":"Salim_saerch(Main!$A$2:$A$29,$A3,COLUMNS($A$1:O2))","v":104},{"$f":"Salim_saerch(Main!$A$2:$A$29,$A3,COLUMNS($A$1:P2))","v":60},{"$f":"Salim_saerch(Main!$A$2:$A$29,$A3,COLUMNS($A$1:Q2))","v":64},{"$f":"Salim_saerch(Main!$A$2:$A$29,$A3,COLUMNS($A$1:R2))","v":68},{"$f":"Salim_saerch(Main!$A$2:$A$29,$A3,COLUMNS($A$1:S2))","v":72},{"$f":"Salim_saerch(Main!$A$2:$A$29,$A3,COLUMNS($A$1:T2))","v":76},{"$f":"Salim_saerch(Main!$A$2:$A$29,$A3,COLUMNS($A$1:U2))","v":80},{"$f":"Salim_saerch(Main!$A$2:$A$29,$A3,COLUMNS($A$1:V2))","v":96},{"$f":"Salim_saerch(Main!$A$2:$A$29,$A3,COLUMNS($A$1:W2))","v":108},{"$f":"Salim_saerch(Main!$A$2:$A$29,$A3,COLUMNS($A$1:X2))","v":112},{"$f":"Salim_saerch(Main!$A$2:$A$29,$A3,COLUMNS($A$1:Y2))","v":112},{"$f":"Salim_saerch(Main!$A$2:$A$29,$A3,COLUMNS($A$1:Z2))","v":116},{"$f":"Salim_saerch(Main!$A$2:$A$29,$A3,COLUMNS($A$1:AA2))","v":124},{"$f":"Salim_saerch(Main!$A$2:$A$29,$A3,COLUMNS($A$1:AB2))","v":128}]
[]
[]
[20,{"$f":"IFERROR(INDEX(Main!$A$2:$BN$500,MATCH($A6,Main!$A$2:$A$500,0),MATCH(B$1,Main!$A$1:$BN$1,0)),\"\")","v":"عبدالحميد"},{"$f":"IFERROR(INDEX(Main!$A$2:$BN$500,MATCH($A6,Main!$A$2:$A$500,0),MATCH(C$1,Main!$A$1:$BN$1,0)),\"\")","v":84},{"$f":"IFERROR(INDEX(Main!$A$2:$BN$500,MATCH($A6,Main!$A$2:$A$500,0),MATCH(D$1,Main!$A$1:$BN$1,0)),\"\")","v":64},{"$f":"IFERROR(INDEX(Main!$A$2:$BN$500,MATCH($A6,Main!$A$2:$A$500,0),MATCH(E$1,Main!$A$1:$BN$1,0)),\"\")","v":108},{"$f":"IFERROR(INDEX(Main!$A$2:$BN$500,MATCH($A6,Main!$A$2:$A$500,0),MATCH(F$1,Main!$A$1:$BN$1,0)),\"\")","v":64},{"$f":"IFERROR(INDEX(Main!$A$2:$BN$500,MATCH($A6,Main!$A$2:$A$500,0),MATCH(G$1,Main!$A$1:$BN$1,0)),\"\")","v":124},{"$f":"IFERROR(INDEX(Main!$A$2:$BN$500,MATCH($A6,Main!$A$2:$A$500,0),MATCH(H$1,Main!$A$1:$BN$1,0)),\"\")","v":128},{"$f":"IFERROR(INDEX(Main!$A$2:$BN$500,MATCH($A6,Main!$A$2:$A$500,0),MATCH(I$1,Main!$A$1:$BN$1,0)),\"\")","v":24},{"$f":"IFERROR(INDEX(Main!$A$2:$BN$500,MATCH($A6,Main!$A$2:$A$500,0),MATCH(J$1,Main!$A$1:$BN$1,0)),\"\")","v":32},{"$f":"IFERROR(INDEX(Main!$A$2:$BN$500,MATCH($A6,Main!$A$2:$A$500,0),MATCH(K$1,Main!$A$1:$BN$1,0)),\"\")","v":36},{"$f":"IFERROR(INDEX(Main!$A$2:$BN$500,MATCH($A6,Main!$A$2:$A$500,0),MATCH(L$1,Main!$A$1:$BN$1,0)),\"\")","v":60},{"$f":"IFERROR(INDEX(Main!$A$2:$BN$500,MATCH($A6,Main!$A$2:$A$500,0),MATCH(M$1,Main!$A$1:$BN$1,0)),\"\")","v":72},{"$f":"IFERROR(INDEX(Main!$A$2:$BN$500,MATCH($A6,Main!$A$2:$A$500,0),MATCH(N$1,Main!$A$1:$BN$1,0)),\"\")","v":68},{"$f":"IFERROR(INDEX(Main!$A$2:$BN$500,MATCH($A6,Main!$A$2:$A$500,0),MATCH(O$1,Main!$A$1:$BN$1,0)),\"\")","v":104},{"$f":"IFERROR(INDEX(Main!$A$2:$BN$500,MATCH($A6,Main!$A$2:$A$500,0),MATCH(P$1,Main!$A$1:$BN$1,0)),\"\")","v":""},{"$f":"IFERROR(INDEX(Main!$A$2:$BN$500,MATCH($A6,Main!$A$2:$A$500,0),MATCH(Q$1,Main!$A$1:$BN$1,0)),\"\")","v":112},{"$f":"IFERROR(INDEX(Main!$A$2:$BN$500,MATCH($A6,Main!$A$2:$A$500,0),MATCH(R$1,Main!$A$1:$BN$1,0)),\"\")","v":120},{"$f":"IFERROR(INDEX(Main!$A$2:$BN$500,MATCH($A6,Main!$A$2:$A$500,0),MATCH(S$1,Main!$A$1:$BN$1,0)),\"\")","v":84},{"$f":"IFERROR(INDEX(Main!$A$2:$BN$500,MATCH($A6,Main!$A$2:$A$500,0),MATCH(T$1,Main!$A$1:$BN$1,0)),\"\")","v":76},{"$f":"IFERROR(INDEX(Main!$A$2:$BN$500,MATCH($A6,Main!$A$2:$A$500,0),MATCH(U$1,Main!$A$1:$BN$1,0)),\"\")","v":112},{"$f":"IFERROR(INDEX(Main!$A$2:$BN$500,MATCH($A6,Main!$A$2:$A$500,0),MATCH(V$1,Main!$A$1:$BN$1,0)),\"\")","v":""},{"$f":"IFERROR(INDEX(Main!$A$2:$BN$500,MATCH($A6,Main!$A$2:$A$500,0),MATCH(W$1,Main!$A$1:$BN$1,0)),\"\")","v":100},{"$f":"IFERROR(INDEX(Main!$A$2:$BN$500,MATCH($A6,Main!$A$2:$A$500,0),MATCH(X$1,Main!$A$1:$BN$1,0)),\"\")","v":""},{"$f":"IFERROR(INDEX(Main!$A$2:$BN$500,MATCH($A6,Main!$A$2:$A$500,0),MATCH(Y$1,Main!$A$1:$BN$1,0)),\"\")","v":""},21,{"$f":"IFERROR(INDEX(Main!$A$2:$BN$500,MATCH($A6,Main!$A$2:$A$500,0),MATCH(AA$1,Main!$A$1:$BN$1,0)),\"\")","v":""},{"$f":"IFERROR(INDEX(Main!$A$2:$BN$500,MATCH($A6,Main!$A$2:$A$500,0),MATCH(AB$1,Main!$A$1:$BN$1,0)),\"\")","v":""},{"$f":"IFERROR(INDEX(Main!$A$2:$BN$500,MATCH($A6,Main!$A$2:$A$500,0),MATCH(AC$1,Main!$A$1:$BN$1,0)),\"\")","v":""},{"$f":"IFERROR(INDEX(Main!$A$2:$BN$500,MATCH($A6,Main!$A$2:$A$500,0),MATCH(AD$1,Main!$A$1:$BN$1,0)),\"\")","v":""},{"$f":"IFERROR(INDEX(Main!$A$2:$BN$500,MATCH($A6,Main!$A$2:$A$500,0),MATCH(AE$1,Main!$A$1:$BN$1,0)),\"\")","v":""},{"$f":"IFERROR(INDEX(Main!$A$2:$BN$500,MATCH($A6,Main!$A$2:$A$500,0),MATCH(AF$1,Main!$A$1:$BN$1,0)),\"\")","v":""},{"$f":"IFERROR(INDEX(Main!$A$2:$BN$500,MATCH($A6,Main!$A$2:$A$500,0),MATCH(AG$1,Main!$A$1:$BN$1,0)),\"\")","v":""},{"$f":"IFERROR(INDEX(Main!$A$2:$BN$500,MATCH($A6,Main!$A$2:$A$500,0),MATCH(AH$1,Main!$A$1:$BN$1,0)),\"\")","v":""},{"$f":"IFERROR(INDEX(Main!$A$2:$BN$500,MATCH($A6,Main!$A$2:$A$500,0),MATCH(AI$1,Main!$A$1:$BN$1,0)),\"\")","v":""},{"$f":"IFERROR(INDEX(Main!$A$2:$BN$500,MATCH($A6,Main!$A$2:$A$500,0),MATCH(AJ$1,Main!$A$1:$BN$1,0)),\"\")","v":""},{"$f":"IFERROR(INDEX(Main!$A$2:$BN$500,MATCH($A6,Main!$A$2:$A$500,0),MATCH(AK$1,Main!$A$1:$BN$1,0)),\"\")","v":""},{"$f":"IFERROR(INDEX(Main!$A$2:$BN$500,MATCH($A6,Main!$A$2:$A$500,0),MATCH(AL$1,Main!$A$1:$BN$1,0)),\"\")","v":""},{"$f":"IFERROR(INDEX(Main!$A$2:$BN$500,MATCH($A6,Main!$A$2:$A$500,0),MATCH(AM$1,Main!$A$1:$BN$1,0)),\"\")","v":""},{"$f":"IFERROR(INDEX(Main!$A$2:$BN$500,MATCH($A6,Main!$A$2:$A$500,0),MATCH(AN$1,Main!$A$1:$BN$1,0)),\"\")","v":""},{"$f":"IFERROR(INDEX(Main!$A$2:$BN$500,MATCH($A6,Main!$A$2:$A$500,0),MATCH(AO$1,Main!$A$1:$BN$1,0)),\"\")","v":""},{"$f":"IFERROR(INDEX(Main!$A$2:$BN$500,MATCH($A6,Main!$A$2:$A$500,0),MATCH(AP$1,Main!$A$1:$BN$1,0)),\"\")","v":""},{"$f":"IFERROR(INDEX(Main!$A$2:$BN$500,MATCH($A6,Main!$A$2:$A$500,0),MATCH(AQ$1,Main!$A$1:$BN$1,0)),\"\")","v":""},{"$f":"IFERROR(INDEX(Main!$A$2:$BN$500,MATCH($A6,Main!$A$2:$A$500,0),MATCH(AR$1,Main!$A$1:$BN$1,0)),\"\")","v":""},{"$f":"IFERROR(INDEX(Main!$A$2:$BN$500,MATCH($A6,Main!$A$2:$A$500,0),MATCH(AS$1,Main!$A$1:$BN$1,0)),\"\")","v":""},{"$f":"IFERROR(INDEX(Main!$A$2:$BN$500,MATCH($A6,Main!$A$2:$A$500,0),MATCH(AT$1,Main!$A$1:$BN$1,0)),\"\")","v":""},{"$f":"IFERROR(INDEX(Main!$A$2:$BN$500,MATCH($A6,Main!$A$2:$A$500,0),MATCH(AU$1,Main!$A$1:$BN$1,0)),\"\")","v":""},{"$f":"IFERROR(INDEX(Main!$A$2:$BN$500,MATCH($A6,Main!$A$2:$A$500,0),MATCH(AV$1,Main!$A$1:$BN$1,0)),\"\")","v":""},{"$f":"IFERROR(INDEX(Main!$A$2:$BN$500,MATCH($A6,Main!$A$2:$A$500,0),MATCH(AW$1,Main!$A$1:$BN$1,0)),\"\")","v":""},{"$f":"IFERROR(INDEX(Main!$A$2:$BN$500,MATCH($A6,Main!$A$2:$A$500,0),MATCH(AX$1,Main!$A$1:$BN$1,0)),\"\")","v":""},22,{"$f":"IFERROR(INDEX(Main!$A$2:$BN$500,MATCH($A6,Main!$A$2:$A$500,0),MATCH(AZ$1,Main!$A$1:$BN$1,0)),\"\")","v":""},{"$f":"IFERROR(INDEX(Main!$A$2:$BN$500,MATCH($A6,Main!$A$2:$A$500,0),MATCH(BA$1,Main!$A$1:$BN$1,0)),\"\")","v":""},{"$f":"IFERROR(INDEX(Main!$A$2:$BN$500,MATCH($A6,Main!$A$2:$A$500,0),MATCH(BB$1,Main!$A$1:$BN$1,0)),\"\")","v":""},{"$f":"IFERROR(INDEX(Main!$A$2:$BN$500,MATCH($A6,Main!$A$2:$A$500,0),MATCH(BC$1,Main!$A$1:$BN$1,0)),\"\")","v":""},{"$f":"IFERROR(INDEX(Main!$A$2:$BN$500,MATCH($A6,Main!$A$2:$A$500,0),MATCH(BD$1,Main!$A$1:$BN$1,0)),\"\")","v":""},{"$f":"IFERROR(INDEX(Main!$A$2:$BN$500,MATCH($A6,Main!$A$2:$A$500,0),MATCH(BE$1,Main!$A$1:$BN$1,0)),\"\")","v":""},{"$f":"IFERROR(INDEX(Main!$A$2:$BN$500,MATCH($A6,Main!$A$2:$A$500,0),MATCH(BF$1,Main!$A$1:$BN$1,0)),\"\")","v":""},{"$f":"IFERROR(INDEX(Main!$A$2:$BN$500,MATCH($A6,Main!$A$2:$A$500,0),MATCH(BG$1,Main!$A$1:$BN$1,0)),\"\")","v":""},{"$f":"IFERROR(INDEX(Main!$A$2:$BN$500,MATCH($A6,Main!$A$2:$A$500,0),MATCH(BH$1,Main!$A$1:$BN$1,0)),\"\")","v":""},{"$f":"IFERROR(INDEX(Main!$A$2:$BN$500,MATCH($A6,Main!$A$2:$A$500,0),MATCH(BI$1,Main!$A$1:$BN$1,0)),\"\")","v":""},{"$f":"IFERROR(INDEX(Main!$A$2:$BN$500,MATCH($A6,Main!$A$2:$A$500,0),MATCH(BJ$1,Main!$A$1:$BN$1,0)),\"\")","v":""},{"$f":"IFERROR(INDEX(Main!$A$2:$BN$500,MATCH($A6,Main!$A$2:$A$500,0),MATCH(BK$1,Main!$A$1:$BN$1,0)),\"\")","v":""},{"$f":"IFERROR(INDEX(Main!$A$2:$BN$500,MATCH($A6,Main!$A$2:$A$500,0),MATCH(BL$1,Main!$A$1:$BN$1,0)),\"\")","v":""},{"$f":"IFERROR(INDEX(Main!$A$2:$BN$500,MATCH($A6,Main!$A$2:$A$500,0),MATCH(BM$1,Main!$A$1:$BN$1,0)),\"\")","v":""},{"$f":"IFERROR(INDEX(Main!$A$2:$BN$500,MATCH($A6,Main!$A$2:$A$500,0),MATCH(BN$1,Main!$A$1:$BN$1,0)),\"\")","v":""},{"$f":"IFERROR(INDEX(Main!$A$2:$BN$500,MATCH($A6,Main!$A$2:$A$500,0),MATCH(BO$1,Main!$A$1:$BN$1,0)),\"\")","v":""},{"$f":"IFERROR(INDEX(Main!$A$2:$BN$500,MATCH($A6,Main!$A$2:$A$500,0),MATCH(BP$1,Main!$A$1:$BN$1,0)),\"\")","v":""},{"$f":"IFERROR(INDEX(Main!$A$2:$BN$500,MATCH($A6,Main!$A$2:$A$500,0),MATCH(BQ$1,Main!$A$1:$BN$1,0)),\"\")","v":""}]