{"text_format":"1","workbook":"xlsx","n_sheets":5,"sheets":["Main","دخول","لياقة","كشف احتياطي","Target"],"not_rendered":{"charts":0,"images":0,"macros":1,"external_links":0,"defined_names":1,"comments":0,"pivot_tables":0},"unopened":[],"bounds":{"document_bytes":16777216,"sheet_cells":100000,"rows_first":2000,"rows_last":500,"rows_between":2000,"halvings":0,"cell_chars":16384,"cell_head_chars":4096},"cells_cut":0,"cells_raw":0,"read":"whole","date_system":"1900"}

{"sheet":"Main","index":0,"n_rows":38,"n_cols":13,"rows_kept":38,"cut":false,"hidden":false,"merged":[]}
[1,2,3]
[]
[null,"الرقم الداخلي","الاسم","الفرية","الفرع","درجة اختبار الدخول 40","درجة اختبار اللياقة 40","درجة اختبار\n المهارة 40","درجة اختبار الحاسب","عدد الحصص المتغيب عنها","المخالفات","الإجمالي","What"]
[1,10410,"ديماركوس هيربست",1,1,{"$f":"VLOOKUP(B4,دخول!$B$2:$D$38,3,FALSE)","v":0},{"$f":"VLOOKUP(B4,لياقة!$B$2:$D$39,3,FALSE)","v":29},24,4,3,0,null,{"$f":"VLOOKUP(B4,دخول!$B$2:$D$38,3,FALSE)","v":0}]
[2,48614,"روندا مولفيهيل",1,3,{"$f":"VLOOKUP(B5,دخول!$B$2:$D$38,3,FALSE)","v":33},{"$f":"VLOOKUP(B5,لياقة!$B$2:$D$39,3,FALSE)","v":8},14,14,1,0,null,{"$f":"VLOOKUP(B5,دخول!$B$2:$D$38,3,FALSE)","v":33}]
[3,40127,"ميتسو سيمون",1,2,{"$f":"VLOOKUP(B6,دخول!$B$2:$D$38,3,FALSE)","v":30},{"$f":"VLOOKUP(B6,لياقة!$B$2:$D$39,3,FALSE)","v":0},21,35,0,1,null,{"$f":"VLOOKUP(B6,دخول!$B$2:$D$38,3,FALSE)","v":30}]
[4,46887,"أوديليا كوتشمان",1,4,{"$f":"VLOOKUP(B7,دخول!$B$2:$D$38,3,FALSE)","v":0},{"$f":"VLOOKUP(B7,لياقة!$B$2:$D$39,3,FALSE)","v":32},29,23,2,1,null,{"$f":"VLOOKUP(B7,دخول!$B$2:$D$38,3,FALSE)","v":0}]
[5,11934,"أفيلينا هيستي",1,1,{"$f":"VLOOKUP(B8,دخول!$B$2:$D$38,3,FALSE)","v":0},{"$f":"VLOOKUP(B8,لياقة!$B$2:$D$39,3,FALSE)","v":32},11,7,3,1,null,{"$f":"VLOOKUP(B8,دخول!$B$2:$D$38,3,FALSE)","v":0}]
[6,6653,"كارولينا ميرز",1,5,{"$f":"VLOOKUP(B9,دخول!$B$2:$D$38,3,FALSE)","v":4},{"$f":"VLOOKUP(B9,لياقة!$B$2:$D$39,3,FALSE)","v":18},15,24,3,0,null,{"$f":"VLOOKUP(B9,دخول!$B$2:$D$38,3,FALSE)","v":4}]
[7,30671,"بيرتي هاريج",1,6,{"$f":"VLOOKUP(B10,دخول!$B$2:$D$38,3,FALSE)","v":0},{"$f":"VLOOKUP(B10,لياقة!$B$2:$D$39,3,FALSE)","v":13},11,39,2,0,null,{"$f":"VLOOKUP(B10,دخول!$B$2:$D$38,3,FALSE)","v":0}]
[8,30486,"ساري بولدينج",1,3,{"$f":"VLOOKUP(B11,دخول!$B$2:$D$38,3,FALSE)","v":20},{"$f":"VLOOKUP(B11,لياقة!$B$2:$D$39,3,FALSE)","v":18},6,25,0,1,null,{"$f":"VLOOKUP(B11,دخول!$B$2:$D$38,3,FALSE)","v":20}]
[9,23797,"فرانسيس فورسير",1,2,{"$f":"VLOOKUP(B12,دخول!$B$2:$D$38,3,FALSE)","v":30},{"$f":"VLOOKUP(B12,لياقة!$B$2:$D$39,3,FALSE)","v":23},37,1,0,0,null,{"$f":"VLOOKUP(B12,دخول!$B$2:$D$38,3,FALSE)","v":30}]
[10,41535,"ستانفورد بانيلا",1,3,{"$f":"VLOOKUP(B13,دخول!$B$2:$D$38,3,FALSE)","v":28},{"$f":"VLOOKUP(B13,لياقة!$B$2:$D$39,3,FALSE)","v":26},28,36,3,0,null,{"$f":"VLOOKUP(B13,دخول!$B$2:$D$38,3,FALSE)","v":28}]
[11,9046,"كولتون كارجيل",1,4,{"$f":"VLOOKUP(B14,دخول!$B$2:$D$38,3,FALSE)","v":28},{"$f":"VLOOKUP(B14,لياقة!$B$2:$D$39,3,FALSE)","v":3},16,3,2,0,null,{"$f":"VLOOKUP(B14,دخول!$B$2:$D$38,3,FALSE)","v":28}]
[12,6870,"إلفينا إثيرتون",1,2,{"$f":"VLOOKUP(B15,دخول!$B$2:$D$38,3,FALSE)","v":0},{"$f":"VLOOKUP(B15,لياقة!$B$2:$D$39,3,FALSE)","v":32},11,15,1,1,null,{"$f":"VLOOKUP(B15,دخول!$B$2:$D$38,3,FALSE)","v":0}]
[13,47867,"سيرينا منصور",1,1,{"$f":"VLOOKUP(B16,دخول!$B$2:$D$38,3,FALSE)","v":9},{"$f":"VLOOKUP(B16,لياقة!$B$2:$D$39,3,FALSE)","v":28},31,33,3,0,null,{"$f":"VLOOKUP(B16,دخول!$B$2:$D$38,3,FALSE)","v":9}]
[14,5329,"كريسي كراوث",1,5,{"$f":"VLOOKUP(B17,دخول!$B$2:$D$38,3,FALSE)","v":31},{"$f":"VLOOKUP(B17,لياقة!$B$2:$D$39,3,FALSE)","v":4},31,20,3,1,null,{"$f":"VLOOKUP(B17,دخول!$B$2:$D$38,3,FALSE)","v":31}]
[15,50540,"إستيبان شوجارت",1,4,{"$f":"VLOOKUP(B18,دخول!$B$2:$D$38,3,FALSE)","v":0},{"$f":"VLOOKUP(B18,لياقة!$B$2:$D$39,3,FALSE)","v":12},36,20,1,1,null,{"$f":"VLOOKUP(B18,دخول!$B$2:$D$38,3,FALSE)","v":0}]
[16,15449,"جوي فونك",1,3,{"$f":"VLOOKUP(B19,دخول!$B$2:$D$38,3,FALSE)","v":0},{"$f":"VLOOKUP(B19,لياقة!$B$2:$D$39,3,FALSE)","v":30},24,21,0,0,null,{"$f":"VLOOKUP(B19,دخول!$B$2:$D$38,3,FALSE)","v":0}]
[17,33392,"توماسين فيسيو",1,5,{"$f":"VLOOKUP(B20,دخول!$B$2:$D$38,3,FALSE)","v":0},{"$f":"VLOOKUP(B20,لياقة!$B$2:$D$39,3,FALSE)","v":10},3,34,3,1,null,{"$f":"VLOOKUP(B20,دخول!$B$2:$D$38,3,FALSE)","v":0}]
[18,32613,"شينا إنجلهارت",1,2,{"$f":"VLOOKUP(B21,دخول!$B$2:$D$38,3,FALSE)","v":4},{"$f":"VLOOKUP(B21,لياقة!$B$2:$D$39,3,FALSE)","v":27},20,18,1,0,null,{"$f":"VLOOKUP(B21,دخول!$B$2:$D$38,3,FALSE)","v":4}]
[19,6105,"كلارا بيرجمان",1,2,{"$f":"VLOOKUP(B22,دخول!$B$2:$D$38,3,FALSE)","v":10},{"$f":"VLOOKUP(B22,لياقة!$B$2:$D$39,3,FALSE)","v":13},37,32,2,0,null,{"$f":"VLOOKUP(B22,دخول!$B$2:$D$38,3,FALSE)","v":10}]
[20,34751,"لينا كيسان",1,3,{"$f":"VLOOKUP(B23,دخول!$B$2:$D$38,3,FALSE)","v":27},{"$f":"VLOOKUP(B23,لياقة!$B$2:$D$39,3,FALSE)","v":5},38,2,2,1,null,{"$f":"VLOOKUP(B23,دخول!$B$2:$D$38,3,FALSE)","v":27}]
[21,45870,"فالنتينا غريبو",1,3,{"$f":"VLOOKUP(B24,دخول!$B$2:$D$38,3,FALSE)","v":10},{"$f":"VLOOKUP(B24,لياقة!$B$2:$D$39,3,FALSE)","v":10},32,31,0,0,null,{"$f":"VLOOKUP(B24,دخول!$B$2:$D$38,3,FALSE)","v":10}]
[22,47118,"روزلين رابوزو",1,2,{"$f":"VLOOKUP(B25,دخول!$B$2:$D$38,3,FALSE)","v":0},{"$f":"VLOOKUP(B25,لياقة!$B$2:$D$39,3,FALSE)","v":39},32,27,2,1,null,{"$f":"VLOOKUP(B25,دخول!$B$2:$D$38,3,FALSE)","v":0}]
[23,32336,"جيرمين إيسيس",1,1,{"$f":"VLOOKUP(B26,دخول!$B$2:$D$38,3,FALSE)","v":0},{"$f":"VLOOKUP(B26,لياقة!$B$2:$D$39,3,FALSE)","v":22},1,36,0,0,null,{"$f":"VLOOKUP(B26,دخول!$B$2:$D$38,3,FALSE)","v":0}]
[24,10026,"إداليا كايل",1,4,{"$f":"VLOOKUP(B27,دخول!$B$2:$D$38,3,FALSE)","v":6},{"$f":"VLOOKUP(B27,لياقة!$B$2:$D$39,3,FALSE)","v":1},31,33,2,0,null,{"$f":"VLOOKUP(B27,دخول!$B$2:$D$38,3,FALSE)","v":6}]
[25,20421,"علاء سيموندس",1,1,{"$f":"VLOOKUP(B28,دخول!$B$2:$D$38,3,FALSE)","v":3},{"$f":"VLOOKUP(B28,لياقة!$B$2:$D$39,3,FALSE)","v":0},39,3,3,1,null,{"$f":"VLOOKUP(B28,دخول!$B$2:$D$38,3,FALSE)","v":3}]
[26,40526,"روزي بلوف",1,5,{"$f":"VLOOKUP(B29,دخول!$B$2:$D$38,3,FALSE)","v":0},{"$f":"VLOOKUP(B29,لياقة!$B$2:$D$39,3,FALSE)","v":40},2,30,2,1,null,{"$f":"VLOOKUP(B29,دخول!$B$2:$D$38,3,FALSE)","v":0}]
[27,41116,"ايرا سكودر",1,4,{"$f":"VLOOKUP(B30,دخول!$B$2:$D$38,3,FALSE)","v":14},{"$f":"VLOOKUP(B30,لياقة!$B$2:$D$39,3,FALSE)","v":9},1,13,0,0,null,{"$f":"VLOOKUP(B30,دخول!$B$2:$D$38,3,FALSE)","v":14}]
[28,29772,"تشاد فرايز",1,4,{"$f":"VLOOKUP(B31,دخول!$B$2:$D$38,3,FALSE)","v":0},{"$f":"VLOOKUP(B31,لياقة!$B$2:$D$39,3,FALSE)","v":30},20,10,2,0,null,{"$f":"VLOOKUP(B31,دخول!$B$2:$D$38,3,FALSE)","v":0}]
[29,36198,"جاكلين لاندري",1,3,{"$f":"VLOOKUP(B32,دخول!$B$2:$D$38,3,FALSE)","v":0},{"$f":"VLOOKUP(B32,لياقة!$B$2:$D$39,3,FALSE)","v":36},6,26,2,0,null,{"$f":"VLOOKUP(B32,دخول!$B$2:$D$38,3,FALSE)","v":0}]
[30,39590,"شاميكا نولتون",1,1,{"$f":"VLOOKUP(B33,دخول!$B$2:$D$38,3,FALSE)","v":39},{"$f":"VLOOKUP(B33,لياقة!$B$2:$D$39,3,FALSE)","v":1},30,24,3,1,null,{"$f":"VLOOKUP(B33,دخول!$B$2:$D$38,3,FALSE)","v":39}]
[31,49447,"اليشا بيناليس",1,1,{"$f":"VLOOKUP(B34,دخول!$B$2:$D$38,3,FALSE)","v":16},{"$f":"VLOOKUP(B34,لياقة!$B$2:$D$39,3,FALSE)","v":15},22,26,3,0,null,{"$f":"VLOOKUP(B34,دخول!$B$2:$D$38,3,FALSE)","v":16}]
[32,33953,"أنتونيت بينر",1,2,{"$f":"VLOOKUP(B35,دخول!$B$2:$D$38,3,FALSE)","v":0},{"$f":"VLOOKUP(B35,لياقة!$B$2:$D$39,3,FALSE)","v":0},19,22,3,0,null,{"$f":"VLOOKUP(B35,دخول!$B$2:$D$38,3,FALSE)","v":0}]
[33,19820,"ديدري بيجلي",1,2,{"$f":"VLOOKUP(B36,دخول!$B$2:$D$38,3,FALSE)","v":0},{"$f":"VLOOKUP(B36,لياقة!$B$2:$D$39,3,FALSE)","v":40},0,13,0,1,null,{"$f":"VLOOKUP(B36,دخول!$B$2:$D$38,3,FALSE)","v":0}]
[34,6780,"روما ميزر",1,3,{"$f":"VLOOKUP(B37,دخول!$B$2:$D$38,3,FALSE)","v":16},{"$f":"VLOOKUP(B37,لياقة!$B$2:$D$39,3,FALSE)","v":20},19,33,3,0,null,{"$f":"VLOOKUP(B37,دخول!$B$2:$D$38,3,FALSE)","v":16}]
[35,47988,"إلسورث سواتالسكي",1,2,{"$f":"VLOOKUP(B38,دخول!$B$2:$D$38,3,FALSE)","v":0},{"$f":"VLOOKUP(B38,لياقة!$B$2:$D$39,3,FALSE)","v":17},1,21,2,0,null,{"$f":"VLOOKUP(B38,دخول!$B$2:$D$38,3,FALSE)","v":0}]

{"sheet":"دخول","index":1,"n_rows":39,"n_cols":4,"rows_kept":39,"cut":false,"hidden":false,"merged":[]}
[null,"الرقم العسكري","الاسم","درجة اختبار المشاة 40"]
[1,49447,"اليشا بيناليس",16]
[2,41116,"ايرا سكودر",14]
[3,10026,"إداليا كايل",6]
[4,50540,"إستيبان شوجارت",0]
[5,47988,"إلسورث سواتالسكي",0]
[6,6870,"إلفينا إثيرتون",0]
[7,11934,"أفيلينا هيستي",0]
[8,33953,"أنتونيت بينر",0]
[9,46887,"أوديليا كوتشمان",0]
[10,30671,"بيرتي هاريج",0]
[11,29772,"تشاد فرايز",0]
[12,33392,"توماسين فيسيو",0]
[13,45435,"ثيودورا فابيان",0]
[14,36198,"جاكلين لاندري",0]
[15,15449,"جوي فونك",0]
[16,32336,"جيرمين إيسيس",0]
[17,19820,"ديدري بيجلي",0]
[18,10410,"ديماركوس هيربست",0]
[19,47118,"روزلين رابوزو",0]
[20,40526,"روزي بلوف",0]
[21,6780,"روما ميزر",16]
[22,48614,"روندا مولفيهيل",33]
[23,30486,"ساري بولدينج",20]
[24,41535,"ستانفورد بانيلا",28]
[25,14091,"سونا لورانجر",35]
[26,47867,"سيرينا منصور",9]
[27,39590,"شاميكا نولتون",39]
[28,32613,"شينا إنجلهارت",4]
[29,20421,"علاء سيموندس",3]
[30,45870,"فالنتينا غريبو",10]
[31,23797,"فرانسيس فورسير",30]
[32,6653,"كارولينا ميرز",4]
[33,5329,"كريسي كراوث",31]
[34,6105,"كلارا بيرجمان",10]
[35,9046,"كولتون كارجيل",28]
[36,34751,"لينا كيسان",27]
[37,40127,"ميتسو سيمون",30]
[null,"هولمان الألماني",22]

{"sheet":"لياقة","index":2,"n_rows":39,"n_cols":4,"rows_kept":39,"cut":false,"hidden":false,"merged":[]}
["التسلسل","الرقم الداخلي","الاسم","درجة اختبار اللياقة 40"]
[1,10410,"ديماركوس هيربست",29]
[2,48614,"روندا مولفيهيل",8]
[3,40127,"ميتسو سيمون",0]
[4,46887,"أوديليا كوتشمان",32]
[5,11934,"أفيلينا هيستي",32]
[6,6653,"كارولينا ميرز",18]
[7,30671,"بيرتي هاريج",13]
[8,30486,"ساري بولدينج",18]
[9,23797,"فرانسيس فورسير",23]
[10,41535,"ستانفورد بانيلا",26]
[11,9046,"كولتون كارجيل",3]
[12,6870,"إلفينا إثيرتون",32]
[13,47867,"سيرينا منصور",28]
[14,5329,"كريسي كراوث",4]
[15,50540,"إستيبان شوجارت",12]
[16,15449,"جوي فونك",30]
[17,33392,"توماسين فيسيو",10]
[18,32613,"شينا إنجلهارت",27]
[19,6105,"كلارا بيرجمان",13]
[20,34751,"لينا كيسان",5]
[21,45870,"فالنتينا غريبو",10]
[22,47118,"روزلين رابوزو",39]
[23,32336,"جيرمين إيسيس",22]
[24,10026,"إداليا كايل",1]
[25,20421,"علاء سيموندس",0]
[26,40526,"روزي بلوف",40]
[27,41116,"ايرا سكودر",9]
[28,29772,"تشاد فرايز",30]
[29,36198,"جاكلين لاندري",36]
[30,39590,"شاميكا نولتون",1]
[31,49447,"اليشا بيناليس",15]
[32,33953,"أنتونيت بينر",0]
[33,19820,"ديدري بيجلي",40]
[34,6780,"روما ميزر",20]
[35,47988,"إلسورث سواتالسكي",17]
[36,51430,"هولمان الألماني",20]
[37,14091,"سونا لورانجر",10]
[38,45435,"ثيودورا فابيان",32]

{"sheet":"كشف احتياطي","index":3,"n_rows":41,"n_cols":13,"rows_kept":41,"cut":false,"hidden":false,"merged":[[0,1,1,8]]}
[]
[]
[null,"الرقم الداخلي","الاسم","الفرية","الفرع","درجة اختبار الدخول 40","درجة اختبار اللياقة 40","درجة اختبار المهارة 40","درجة اختبار الحاسب","عدد الحصص المتغيب عنها","المخالفات","الإجمالي"]
[1,10410,"ديماركوس هيربست",1,1,{"$f":"VLOOKUP(B4,دخول!$B$2:$D$38,3,FALSE)","v":0},{"$f":"VLOOKUP(B4,لياقة!$B$2:$D$39,3,FALSE)","v":29},24,4,3,0,null,{"$f":"VLOOKUP(B4,دخول!$B$2:$D$38,3,FALSE)","v":0}]
[2,48614,"روندا مولفيهيل",1,3,{"$f":"VLOOKUP(B5,دخول!$B$2:$D$38,3,FALSE)","v":33},{"$f":"VLOOKUP(B5,لياقة!$B$2:$D$39,3,FALSE)","v":8},14,14,1,0,null,{"$f":"VLOOKUP(B5,دخول!$B$2:$D$38,3,FALSE)","v":33}]
[3,40127,"ميتسو سيمون",1,2,{"$f":"VLOOKUP(B6,دخول!$B$2:$D$38,3,FALSE)","v":30},{"$f":"VLOOKUP(B6,لياقة!$B$2:$D$39,3,FALSE)","v":0},21,35,0,1,null,{"$f":"VLOOKUP(B6,دخول!$B$2:$D$38,3,FALSE)","v":30}]
[4,46887,"أوديليا كوتشمان",1,4,{"$f":"VLOOKUP(B7,دخول!$B$2:$D$38,3,FALSE)","v":0},{"$f":"VLOOKUP(B7,لياقة!$B$2:$D$39,3,FALSE)","v":32},29,23,2,1,null,{"$f":"VLOOKUP(B7,دخول!$B$2:$D$38,3,FALSE)","v":0}]
[5,11934,"أفيلينا هيستي",1,1,{"$f":"VLOOKUP(B8,دخول!$B$2:$D$38,3,FALSE)","v":0},{"$f":"VLOOKUP(B8,لياقة!$B$2:$D$39,3,FALSE)","v":32},11,7,3,1,null,{"$f":"VLOOKUP(B8,دخول!$B$2:$D$38,3,FALSE)","v":0}]
[6,6653,"كارولينا ميرز",1,5,{"$f":"VLOOKUP(B9,دخول!$B$2:$D$38,3,FALSE)","v":4},{"$f":"VLOOKUP(B9,لياقة!$B$2:$D$39,3,FALSE)","v":18},15,24,3,0,null,{"$f":"VLOOKUP(B9,دخول!$B$2:$D$38,3,FALSE)","v":4}]
[7,30671,"بيرتي هاريج",1,6,{"$f":"VLOOKUP(B10,دخول!$B$2:$D$38,3,FALSE)","v":0},{"$f":"VLOOKUP(B10,لياقة!$B$2:$D$39,3,FALSE)","v":13},11,39,2,0,null,{"$f":"VLOOKUP(B10,دخول!$B$2:$D$38,3,FALSE)","v":0}]
[8,30486,"ساري بولدينج",1,3,{"$f":"VLOOKUP(B11,دخول!$B$2:$D$38,3,FALSE)","v":20},{"$f":"VLOOKUP(B11,لياقة!$B$2:$D$39,3,FALSE)","v":18},6,25,0,1,null,{"$f":"VLOOKUP(B11,دخول!$B$2:$D$38,3,FALSE)","v":20}]
[9,23797,"فرانسيس فورسير",1,2,{"$f":"VLOOKUP(B12,دخول!$B$2:$D$38,3,FALSE)","v":30},{"$f":"VLOOKUP(B12,لياقة!$B$2:$D$39,3,FALSE)","v":23},37,1,0,0,null,{"$f":"VLOOKUP(B12,دخول!$B$2:$D$38,3,FALSE)","v":30}]
[10,41535,"ستانفورد بانيلا",1,3,{"$f":"VLOOKUP(B13,دخول!$B$2:$D$38,3,FALSE)","v":28},{"$f":"VLOOKUP(B13,لياقة!$B$2:$D$39,3,FALSE)","v":26},28,36,3,0,null,{"$f":"VLOOKUP(B13,دخول!$B$2:$D$38,3,FALSE)","v":28}]
[11,9046,"كولتون كارجيل",1,4,{"$f":"VLOOKUP(B14,دخول!$B$2:$D$38,3,FALSE)","v":28},{"$f":"VLOOKUP(B14,لياقة!$B$2:$D$39,3,FALSE)","v":3},16,3,2,0,null,{"$f":"VLOOKUP(B14,دخول!$B$2:$D$38,3,FALSE)","v":28}]
[12,6870,"إلفينا إثيرتون",1,2,{"$f":"VLOOKUP(B15,دخول!$B$2:$D$38,3,FALSE)","v":0},{"$f":"VLOOKUP(B15,لياقة!$B$2:$D$39,3,FALSE)","v":32},11,15,1,1,null,{"$f":"VLOOKUP(B15,دخول!$B$2:$D$38,3,FALSE)","v":0}]
[13,47867,"سيرينا منصور",1,1,{"$f":"VLOOKUP(B16,دخول!$B$2:$D$38,3,FALSE)","v":9},{"$f":"VLOOKUP(B16,لياقة!$B$2:$D$39,3,FALSE)","v":28},31,33,3,0,null,{"$f":"VLOOKUP(B16,دخول!$B$2:$D$38,3,FALSE)","v":9}]
[14,5329,"كريسي كراوث",1,5,{"$f":"VLOOKUP(B17,دخول!$B$2:$D$38,3,FALSE)","v":31},{"$f":"VLOOKUP(B17,لياقة!$B$2:$D$39,3,FALSE)","v":4},31,20,3,1,null,{"$f":"VLOOKUP(B17,دخول!$B$2:$D$38,3,FALSE)","v":31}]
[15,50540,"إستيبان شوجارت",1,4,{"$f":"VLOOKUP(B18,دخول!$B$2:$D$38,3,FALSE)","v":0},{"$f":"VLOOKUP(B18,لياقة!$B$2:$D$39,3,FALSE)","v":12},36,20,1,1,null,{"$f":"VLOOKUP(B18,دخول!$B$2:$D$38,3,FALSE)","v":0}]
[16,15449,"جوي فونك",1,3,{"$f":"VLOOKUP(B19,دخول!$B$2:$D$38,3,FALSE)","v":0},{"$f":"VLOOKUP(B19,لياقة!$B$2:$D$39,3,FALSE)","v":30},24,21,0,0,null,{"$f":"VLOOKUP(B19,دخول!$B$2:$D$38,3,FALSE)","v":0}]
[17,33392,"توماسين فيسيو",1,5,{"$f":"VLOOKUP(B20,دخول!$B$2:$D$38,3,FALSE)","v":0},{"$f":"VLOOKUP(B20,لياقة!$B$2:$D$39,3,FALSE)","v":10},3,34,3,1,null,{"$f":"VLOOKUP(B20,دخول!$B$2:$D$38,3,FALSE)","v":0}]
[18,32613,"شينا إنجلهارت",1,2,{"$f":"VLOOKUP(B21,دخول!$B$2:$D$38,3,FALSE)","v":4},{"$f":"VLOOKUP(B21,لياقة!$B$2:$D$39,3,FALSE)","v":27},20,18,1,0,null,{"$f":"VLOOKUP(B21,دخول!$B$2:$D$38,3,FALSE)","v":4}]
[19,6105,"كلارا بيرجمان",1,2,{"$f":"VLOOKUP(B22,دخول!$B$2:$D$38,3,FALSE)","v":10},{"$f":"VLOOKUP(B22,لياقة!$B$2:$D$39,3,FALSE)","v":13},37,32,2,0,null,{"$f":"VLOOKUP(B22,دخول!$B$2:$D$38,3,FALSE)","v":10}]
[20,34751,"لينا كيسان",1,3,{"$f":"VLOOKUP(B23,دخول!$B$2:$D$38,3,FALSE)","v":27},{"$f":"VLOOKUP(B23,لياقة!$B$2:$D$39,3,FALSE)","v":5},38,2,2,1,null,{"$f":"VLOOKUP(B23,دخول!$B$2:$D$38,3,FALSE)","v":27}]
[21,45870,"فالنتينا غريبو",1,3,{"$f":"VLOOKUP(B24,دخول!$B$2:$D$38,3,FALSE)","v":10},{"$f":"VLOOKUP(B24,لياقة!$B$2:$D$39,3,FALSE)","v":10},32,31,0,0,null,{"$f":"VLOOKUP(B24,دخول!$B$2:$D$38,3,FALSE)","v":10}]
[22,47118,"روزلين رابوزو",1,2,{"$f":"VLOOKUP(B25,دخول!$B$2:$D$38,3,FALSE)","v":0},{"$f":"VLOOKUP(B25,لياقة!$B$2:$D$39,3,FALSE)","v":39},32,27,2,1,null,{"$f":"VLOOKUP(B25,دخول!$B$2:$D$38,3,FALSE)","v":0}]
[23,32336,"جيرمين إيسيس",1,1,{"$f":"VLOOKUP(B26,دخول!$B$2:$D$38,3,FALSE)","v":0},{"$f":"VLOOKUP(B26,لياقة!$B$2:$D$39,3,FALSE)","v":22},1,36,0,0,null,{"$f":"VLOOKUP(B26,دخول!$B$2:$D$38,3,FALSE)","v":0}]
[24,10026,"إداليا كايل",1,4,{"$f":"VLOOKUP(B27,دخول!$B$2:$D$38,3,FALSE)","v":6},{"$f":"VLOOKUP(B27,لياقة!$B$2:$D$39,3,FALSE)","v":1},31,33,2,0,null,{"$f":"VLOOKUP(B27,دخول!$B$2:$D$38,3,FALSE)","v":6}]
[25,20421,"علاء سيموندس",1,1,{"$f":"VLOOKUP(B28,دخول!$B$2:$D$38,3,FALSE)","v":3},{"$f":"VLOOKUP(B28,لياقة!$B$2:$D$39,3,FALSE)","v":0},39,3,3,1,null,{"$f":"VLOOKUP(B28,دخول!$B$2:$D$38,3,FALSE)","v":3}]
[26,40526,"روزي بلوف",1,5,{"$f":"VLOOKUP(B29,دخول!$B$2:$D$38,3,FALSE)","v":0},{"$f":"VLOOKUP(B29,لياقة!$B$2:$D$39,3,FALSE)","v":40},2,30,2,1,null,{"$f":"VLOOKUP(B29,دخول!$B$2:$D$38,3,FALSE)","v":0}]
[27,41116,"ايرا سكودر",1,4,{"$f":"VLOOKUP(B30,دخول!$B$2:$D$38,3,FALSE)","v":14},{"$f":"VLOOKUP(B30,لياقة!$B$2:$D$39,3,FALSE)","v":9},1,13,0,0,null,{"$f":"VLOOKUP(B30,دخول!$B$2:$D$38,3,FALSE)","v":14}]
[28,29772,"تشاد فرايز",1,4,{"$f":"VLOOKUP(B31,دخول!$B$2:$D$38,3,FALSE)","v":0},{"$f":"VLOOKUP(B31,لياقة!$B$2:$D$39,3,FALSE)","v":30},20,10,2,0,null,{"$f":"VLOOKUP(B31,دخول!$B$2:$D$38,3,FALSE)","v":0}]
[29,36198,"جاكلين لاندري",1,3,{"$f":"VLOOKUP(B32,دخول!$B$2:$D$38,3,FALSE)","v":0},{"$f":"VLOOKUP(B32,لياقة!$B$2:$D$39,3,FALSE)","v":36},6,26,2,0,null,{"$f":"VLOOKUP(B32,دخول!$B$2:$D$38,3,FALSE)","v":0}]
[30,39590,"شاميكا نولتون",1,1,{"$f":"VLOOKUP(B33,دخول!$B$2:$D$38,3,FALSE)","v":39},{"$f":"VLOOKUP(B33,لياقة!$B$2:$D$39,3,FALSE)","v":1},30,24,3,1,null,{"$f":"VLOOKUP(B33,دخول!$B$2:$D$38,3,FALSE)","v":39}]
[31,49447,"اليشا بيناليس",1,1,{"$f":"VLOOKUP(B34,دخول!$B$2:$D$38,3,FALSE)","v":16},{"$f":"VLOOKUP(B34,لياقة!$B$2:$D$39,3,FALSE)","v":15},22,26,3,0,null,{"$f":"VLOOKUP(B34,دخول!$B$2:$D$38,3,FALSE)","v":16}]
[32,33953,"أنتونيت بينر",1,2,{"$f":"VLOOKUP(B35,دخول!$B$2:$D$38,3,FALSE)","v":0},{"$f":"VLOOKUP(B35,لياقة!$B$2:$D$39,3,FALSE)","v":0},19,22,3,0,null,{"$f":"VLOOKUP(B35,دخول!$B$2:$D$38,3,FALSE)","v":0}]
[33,19820,"ديدري بيجلي",1,2,{"$f":"VLOOKUP(B36,دخول!$B$2:$D$38,3,FALSE)","v":0},{"$f":"VLOOKUP(B36,لياقة!$B$2:$D$39,3,FALSE)","v":40},0,13,0,1,null,{"$f":"VLOOKUP(B36,دخول!$B$2:$D$38,3,FALSE)","v":0}]
[34,6780,"روما ميزر",1,3,{"$f":"VLOOKUP(B37,دخول!$B$2:$D$38,3,FALSE)","v":16},{"$f":"VLOOKUP(B37,لياقة!$B$2:$D$39,3,FALSE)","v":20},19,33,3,0,null,{"$f":"VLOOKUP(B37,دخول!$B$2:$D$38,3,FALSE)","v":16}]
[35,47988,"إلسورث سواتالسكي",1,2,{"$f":"VLOOKUP(B38,دخول!$B$2:$D$38,3,FALSE)","v":0},{"$f":"VLOOKUP(B38,لياقة!$B$2:$D$39,3,FALSE)","v":17},1,21,2,0,null,{"$f":"VLOOKUP(B38,دخول!$B$2:$D$38,3,FALSE)","v":0}]
[36,51430,"هولمان الألماني",1,4,{"$f":"VLOOKUP(B39,دخول!$B$2:$D$38,3,FALSE)","v":{"$error":"#N/A"}},{"$f":"VLOOKUP(B39,لياقة!$B$2:$D$39,3,FALSE)","v":20},2,37,1,1,null,{"$f":"VLOOKUP(B39,دخول!$B$2:$D$38,3,FALSE)","v":{"$error":"#N/A"}}]
[37,14091,"سونا لورانجر",1,1,{"$f":"VLOOKUP(B40,دخول!$B$2:$D$38,3,FALSE)","v":35},{"$f":"VLOOKUP(B40,لياقة!$B$2:$D$39,3,FALSE)","v":10},3,33,1,1,null,{"$f":"VLOOKUP(B40,دخول!$B$2:$D$38,3,FALSE)","v":35}]
[38,45435,"ثيودورا فابيان",1,3,{"$f":"VLOOKUP(B41,دخول!$B$2:$D$38,3,FALSE)","v":0},{"$f":"VLOOKUP(B41,لياقة!$B$2:$D$39,3,FALSE)","v":32},37,22,3,0,null,{"$f":"VLOOKUP(B41,دخول!$B$2:$D$38,3,FALSE)","v":0}]

{"sheet":"Target","index":4,"n_rows":29,"n_cols":17,"rows_kept":29,"cut":false,"hidden":false,"merged":[]}
["الحاسب",null,null,"choose Criteria then Press Run",null,null,null,null,null,null,null,null,null,null,null,"الدخول","F"]
[null,null,null,null,null,null,null,null,null,null,null,null,null,null,null,"اللياقة","G"]
[null,null,"الرقم الداخلي","الاسم","الفرية","الفرع","درجة اختبار\n الدخول 40","درجة اختبار\n اللياقة 40","درجة اختبار\n المهارة 40","درجة اختبار الحاسب","عدد الحصص المتغيب عنها","المخالفات","الإجمالي","What",null,"المهارة","H"]
[null,1,10410,"ديماركوس هيربست",1,1,0,29,24,4,3,0,null,0,null,"الحاسب","I"]
[null,2,48614,"روندا مولفيهيل",1,3,33,8,14,14,1,0,null,33]
[null,5,11934,"أفيلينا هيستي",1,1,0,32,11,7,3,1,null,0]
[null,9,23797,"فرانسيس فورسير",1,2,30,23,37,1,0,0,null,30]
[null,11,9046,"كولتون كارجيل",1,4,28,3,16,3,2,0,null,28]
[null,12,6870,"إلفينا إثيرتون",1,2,0,32,11,15,1,1,null,0]
[null,18,32613,"شينا إنجلهارت",1,2,4,27,20,18,1,0,null,4]
[null,20,34751,"لينا كيسان",1,3,27,5,38,2,2,1,null,27]
[null,25,20421,"علاء سيموندس",1,1,3,0,39,3,3,1,null,3]
[null,27,41116,"ايرا سكودر",1,4,14,9,1,13,0,0,null,14]
[null,28,29772,"تشاد فرايز",1,4,0,30,20,10,2,0,null,0]
[null,33,19820,"ديدري بيجلي",1,2,0,40,0,13,0,1,null,0]
[null,null,null,null,null,null,null,null,null,null,null,null,null,10]
[null,null,null,null,null,null,null,null,null,null,null,null,null,0]
[null,null,null,null,null,null,null,null,null,null,null,null,null,0]
[null,null,null,null,null,null,null,null,null,null,null,null,null,6]
[null,null,null,null,null,null,null,null,null,null,null,null,null,3]
[null,null,null,null,null,null,null,null,null,null,null,null,null,0]
[null,null,null,null,null,null,null,null,null,null,null,null,null,14]
[null,null,null,null,null,null,null,null,null,null,null,null,null,0]
[null,null,null,null,null,null,null,null,null,null,null,null,null,0]
[null,null,null,null,null,null,null,null,null,null,null,null,null,16]
[null,null,null,null,null,null,null,null,null,null,null,null,null,0]
[null,null,null,null,null,null,null,null,null,null,null,null,null,0]
[null,null,null,null,null,null,null,null,null,null,null,null,null,16]
[null,null,null,null,null,null,null,null,null,null,null,null,null,0]