{"text_format":"1","workbook":"xlsx","n_sheets":3,"sheets":["Data","Search student","Search class"],"not_rendered":{"charts":0,"images":0,"macros":1,"external_links":0,"defined_names":9,"comments":0,"pivot_tables":0},"unopened":[],"bounds":{"document_bytes":16777216,"sheet_cells":100000,"rows_first":2000,"rows_last":500,"rows_between":2000,"halvings":0,"cell_chars":16384,"cell_head_chars":4096},"cells_cut":0,"cells_raw":0,"read":"whole","date_system":"1900"}

{"sheet":"Data","index":0,"n_rows":17,"n_cols":18,"rows_kept":17,"cut":false,"hidden":false,"merged":[[1,11,1,12]]}
["وزارة التربية والتعليم"]
["إدارة النعليم الفني والمهني",null,null,null,null,null,null,null,null,null,"التاريخ :",{"$f":"TODAY()","v":"2020-12-31"}]
["مدرسة جدحفص الثانوية الصناعية للبنين"]
[]
["م","رقم الطالب","اسم الطالب","ت1","ت2","ت3","ت4","ت5","ت6","ت7","المجموع 100%","ملاحظات","صف","مادة","معلم","نقال1","نقال2","عنوان"]
[1,2001,"Name1",13,10,10,10,10,14,2,40,0,"Class2","انجليزي1","Maiter1","A1","B1","الرياض"]
[2,2002,"Name2",4,6,10,10,10,4,13,26,0,"Class3","انجليزي2","Maiter2","A2","B2","جده"]
[3,2003,"Name3",9,10,10,9,10,7,4,39,0,"Class1","اسلاميات","Maiter2","A3","B3","الرياض"]
[4,2004,"Name4",14,10,9,10,10,12,11,39,0,"Class2","رياضيات","Maiter2","A4","B4","جده"]
[5,2005,"Name5",14,10,9,10,10,7,11,29,0,"Class3","عربي","Maiter2","A5","B5","الدمام"]
[6,2006,"Name6",5,9,8,8,10,11,13,35,0,"Class2","علوم","Maiter1","A6","B6","حائل"]
[7,2007,"Name7",15,9,10,10,10,5,7,39,0,"Class2","اجتماعيات","Maiter3","A7","B7","الخبر"]
[8,2008,"Name8",7,10,10,10,10,5,12,40,0,"Class1","حاسوب","Maiter3","A8","B8","الرياض"]
[9,2009,"Name9",14,6,10,10,12,5,5,26,0,"Class1","مجالات","Maiter3","A9","B9","جده"]
[10,2010,"Name10",8,10,10,9,10,5,3,39,0,"Class1","رياضة","Maiter3","A10","B10","الرياض"]
[11,2011,"Name11",7,10,9,10,10,6,9,39,0,"Class3","تقنيات","Maiter1","A11","B11","جده"]
[12,2012,"Name12",8,10,9,10,13,2,1,29,0,"Class1","ارشاد","Maiter3","A12","B12","الدمام"]

{"sheet":"Search student","index":1,"n_rows":6,"n_cols":18,"rows_kept":6,"cut":false,"hidden":false,"merged":[]}
[]
[null,null,"Name3",null,null,null,null,null,null,"change Here"]
[]
[]
["م","رقم الطالب","اسم الطالب","م1","م2","م3","م4","م5","م6","م7","المجموع 100%","ملاحظات","صف","مادة","معلم","ش","ت","عنوان"]
[{"$f":"IF(ISNA(MATCH($C$2,Data!$C$6:$C$100,0)),\"\",INDEX(Data!A$6:A$100,MATCH($C$2,Data!$C$6:$C$100,0)))","v":3},{"$f":"IF(ISNA(MATCH($C$2,Data!$C$6:$C$100,0)),\"\",INDEX(Data!B$6:B$100,MATCH($C$2,Data!$C$6:$C$100,0)))","v":2003},{"$f":"IF(ISNA(MATCH($C$2,Data!$C$6:$C$100,0)),\"\",INDEX(Data!C$6:C$100,MATCH($C$2,Data!$C$6:$C$100,0)))","v":"Name3"},{"$f":"IF(ISNA(MATCH($C$2,Data!$C$6:$C$100,0)),\"\",INDEX(Data!D$6:D$100,MATCH($C$2,Data!$C$6:$C$100,0)))","v":9},{"$f":"IF(ISNA(MATCH($C$2,Data!$C$6:$C$100,0)),\"\",INDEX(Data!E$6:E$100,MATCH($C$2,Data!$C$6:$C$100,0)))","v":10},{"$f":"IF(ISNA(MATCH($C$2,Data!$C$6:$C$100,0)),\"\",INDEX(Data!F$6:F$100,MATCH($C$2,Data!$C$6:$C$100,0)))","v":10},{"$f":"IF(ISNA(MATCH($C$2,Data!$C$6:$C$100,0)),\"\",INDEX(Data!G$6:G$100,MATCH($C$2,Data!$C$6:$C$100,0)))","v":9},{"$f":"IF(ISNA(MATCH($C$2,Data!$C$6:$C$100,0)),\"\",INDEX(Data!H$6:H$100,MATCH($C$2,Data!$C$6:$C$100,0)))","v":10},{"$f":"IF(ISNA(MATCH($C$2,Data!$C$6:$C$100,0)),\"\",INDEX(Data!I$6:I$100,MATCH($C$2,Data!$C$6:$C$100,0)))","v":7},{"$f":"IF(ISNA(MATCH($C$2,Data!$C$6:$C$100,0)),\"\",INDEX(Data!J$6:J$100,MATCH($C$2,Data!$C$6:$C$100,0)))","v":4},{"$f":"IF(ISNA(MATCH($C$2,Data!$C$6:$C$100,0)),\"\",INDEX(Data!K$6:K$100,MATCH($C$2,Data!$C$6:$C$100,0)))","v":39},{"$f":"IF(ISNA(MATCH($C$2,Data!$C$6:$C$100,0)),\"\",INDEX(Data!L$6:L$100,MATCH($C$2,Data!$C$6:$C$100,0)))","v":0},{"$f":"IF(ISNA(MATCH($C$2,Data!$C$6:$C$100,0)),\"\",INDEX(Data!M$6:M$100,MATCH($C$2,Data!$C$6:$C$100,0)))","v":"Class1"},{"$f":"IF(ISNA(MATCH($C$2,Data!$C$6:$C$100,0)),\"\",INDEX(Data!N$6:N$100,MATCH($C$2,Data!$C$6:$C$100,0)))","v":"اسلاميات"},{"$f":"IF(ISNA(MATCH($C$2,Data!$C$6:$C$100,0)),\"\",INDEX(Data!O$6:O$100,MATCH($C$2,Data!$C$6:$C$100,0)))","v":"Maiter2"},{"$f":"IF(ISNA(MATCH($C$2,Data!$C$6:$C$100,0)),\"\",INDEX(Data!P$6:P$100,MATCH($C$2,Data!$C$6:$C$100,0)))","v":"A3"},{"$f":"IF(ISNA(MATCH($C$2,Data!$C$6:$C$100,0)),\"\",INDEX(Data!Q$6:Q$100,MATCH($C$2,Data!$C$6:$C$100,0)))","v":"B3"},{"$f":"IF(ISNA(MATCH($C$2,Data!$C$6:$C$100,0)),\"\",INDEX(Data!R$6:R$100,MATCH($C$2,Data!$C$6:$C$100,0)))","v":"الرياض"}]

{"sheet":"Search class","index":2,"n_rows":10,"n_cols":20,"rows_kept":10,"cut":false,"hidden":false,"merged":[]}
[null,null,null,"صف",null,null,null,null,null,null,null,null,null,null,null,null,null,null,null,"Class1"]
[null,null,null,"Class2",null,null,null,null,"change Here",null,null,null,null,null,null,null,null,null,null,"Class2"]
[null,null,null,null,null,null,null,null,null,null,null,null,null,null,null,null,null,null,null,"Class3"]
[]
[]
["م","رقم الطالب","اسم الطالب","ت1","ت2","ت3","ت4","ت5","ت6","ت7","المجموع 100%","ملاحظات","صف","مادة","معلم","نقال1","نقال2","عنوان"]
[1,2001,"Name1",13,10,10,10,10,14,2,40,0,"Class2","انجليزي1","Maiter1","A1","B1","الرياض"]
[4,2004,"Name4",14,10,9,10,10,12,11,39,0,"Class2","رياضيات","Maiter2","A4","B4","جده"]
[6,2006,"Name6",5,9,8,8,10,11,13,35,0,"Class2","علوم","Maiter1","A6","B6","حائل"]
[7,2007,"Name7",15,9,10,10,10,5,7,39,0,"Class2","اجتماعيات","Maiter3","A7","B7","الخبر"]