{"text_format":"1","workbook":"xlsx","n_sheets":4,"sheets":["دليل الحسابـــــــــــــات ","يومية التسويات يناير 2020","يومية التسويات فبراير 2020","كشف الحساب"],"not_rendered":{"charts":0,"images":0,"macros":1,"external_links":6,"defined_names":21,"comments":0,"pivot_tables":0},"unopened":[],"bounds":{"document_bytes":16777216,"sheet_cells":100000,"rows_first":2000,"rows_last":500,"rows_between":2000,"halvings":0,"cell_chars":16384,"cell_head_chars":4096},"cells_cut":0,"cells_raw":0,"read":"whole","date_system":"1900"}

{"sheet":"دليل الحسابـــــــــــــات ","index":0,"n_rows":122,"n_cols":11,"rows_kept":122,"cut":false,"hidden":false,"merged":[[1,0,1,10]]}
[]
["دليل الحسابـــــــــــــات"]
[]
["رقم مسلسل","رقـــــم الحساب"," إسم  الحســـــــــــاب","رقم المجموعة الفرعية","إســـم المجموعة الفرعية","رقم المجموعة الفرعية","إســـم المجموعة الفرعية","رقم المجموعة الرئيسية","اسم  المجموعة الرئيسية","القوائم"," الحساب الختامى"]
["No","Codes","Account","Subgroup number","Subgroup Name","Subgroup number","Subgroup Name","Main group number","Main group name","Lists","Final account"]
[1,1111,"أرض 1",111,"أراضي ومباني",11,"الأصول الثابته",1,"الأصـــــــــــــــول","الميزانية ","الميزانية "]
[2,1121,"أثاث مكاتب",112,"أثاث وتجهيزات",11,"الأصول الثابته",1,"الأصـــــــــــــــول","الميزانية ","الميزانية "]
[3,1122,"سجاجيد",112,"أثاث وتجهيزات",11,"الأصول الثابته",1,"الأصـــــــــــــــول","الميزانية ","الميزانية "]
[4,1123,"خزائن",112,"أثاث وتجهيزات",11,"الأصول الثابته",1,"الأصـــــــــــــــول","الميزانية ","الميزانية "]
[5,1124,"نجف وأبليكات",112,"أثاث وتجهيزات",11,"الأصول الثابته",1,"الأصـــــــــــــــول","الميزانية ","الميزانية "]
[6,1125,"أنتريهات",112,"أثاث وتجهيزات",11,"الأصول الثابته",1,"الأصـــــــــــــــول","الميزانية ","الميزانية "]
[7,1126,"ستائـــــــــــر",112,"أثاث وتجهيزات",11,"الأصول الثابته",1,"الأصـــــــــــــــول","الميزانية ","الميزانية "]
[8,1129,"تجهيزات مكاتب أخرى",112,"أثاث وتجهيزات",11,"الأصول الثابته",1,"الأصـــــــــــــــول","الميزانية ","الميزانية "]
[9,1131,"تكييفات ومراوح",113,"الات ومعدات",11,"الأصول الثابته",1,"الأصـــــــــــــــول","الميزانية ","الميزانية "]
[10,1132,"أجهزة موبايل",113,"الات ومعدات",11,"الأصول الثابته",1,"الأصـــــــــــــــول","الميزانية ","الميزانية "]
[11,1133,"ماكينات تصوير",113,"الات ومعدات",11,"الأصول الثابته",1,"الأصـــــــــــــــول","الميزانية ","الميزانية "]
[12,1134,"أجهزة كمبيوتر",113,"الات ومعدات",11,"الأصول الثابته",1,"الأصـــــــــــــــول","الميزانية ","الميزانية "]
[13,1135,"معدات كمبيوتر",113,"الات ومعدات",11,"الأصول الثابته",1,"الأصـــــــــــــــول","الميزانية ","الميزانية "]
[14,1136,"موقع الشركه",113,"الات ومعدات",11,"الأصول الثابته",1,"الأصـــــــــــــــول","الميزانية ","الميزانية "]
[15,1141,"سياره 1",114,"سيارات",11,"الأصول الثابته",1,"الأصـــــــــــــــول","الميزانية ","الميزانية "]
[16,1151,"إستثمار طويل الأجل 1",115,"استثمارات طويلة الاجل",11,"الأصول الثابته",1,"الأصـــــــــــــــول","الميزانية ","الميزانية "]
[17,1211,"خزينة الشركه - جنيه مصري",121,"الخزينة",12,"الاصول المتداولة",1,"الأصـــــــــــــــول","الميزانية ","الميزانية "]
[18,1212,"خزينة الشركه - دولار أمريكي",121,"الخزينة",12,"الاصول المتداولة",1,"الأصـــــــــــــــول","الميزانية ","الميزانية "]
[24,1235,"بنك مصر ( دولار)",123,"بنــــــــــــــوك",12,"الاصول المتداولة",1,"الأصـــــــــــــــول","الميزانية ","الميزانية "]
[25,1236,"بنك مصر ( ريال سعودي)",123,"بنــــــــــــــوك",12,"الاصول المتداولة",1,"الأصـــــــــــــــول","الميزانية ","الميزانية "]
[26,1237,"بنك مصر ( جنيه مصري )",123,"بنــــــــــــــوك",12,"الاصول المتداولة",1,"الأصـــــــــــــــول","الميزانية ","الميزانية "]
[28,1241,"وديعة بنك 1",124,"استثمارات قصيرة الاجل",12,"الاصول المتداولة",1,"الأصـــــــــــــــول","الميزانية ","الميزانية "]
[29,1311,"عملاء الشركه",131,"عمـــــــــــــــــــــلاء",13,"مدينون وحسابات قبض",1,"الأصـــــــــــــــول","الميزانية ","الميزانية "]
[30,1312,"عمــــــلاء وكالات",131,"عمـــــــــــــــــــــلاء",13,"مدينون وحسابات قبض",1,"الأصـــــــــــــــول","الميزانية ","الميزانية "]
[31,1313,"عمــــــلاء حجز كاش ",131,"عمـــــــــــــــــــــلاء",13,"مدينون وحسابات قبض",1,"الأصـــــــــــــــول","الميزانية ","الميزانية "]
[32,1314,"عملاء بيع خارجي Corprate",131,"عمـــــــــــــــــــــلاء",13,"مدينون وحسابات قبض",1,"الأصـــــــــــــــول","الميزانية ","الميزانية "]
[33,1321,"عهـد موظفين",132,"عهــــــــــــــد",13,"مدينون وحسابات قبض",1,"الأصـــــــــــــــول","الميزانية ","الميزانية "]
[34,1322,"عهــــد إداره",132,"عهــــــــــــــد",13,"مدينون وحسابات قبض",1,"الأصـــــــــــــــول","الميزانية ","الميزانية "]
[35,1323,"عهد وكالات",132,"عهــــــــــــــد",13,"مدينون وحسابات قبض",1,"الأصـــــــــــــــول","الميزانية ","الميزانية "]
[36,1331,"سلــــــف موظفين",133,"سلـــــف",13,"مدينون وحسابات قبض",1,"الأصـــــــــــــــول","الميزانية ","الميزانية "]
[37,1332,"سلــــــف إداره",133,"سلـــــف",13,"مدينون وحسابات قبض",1,"الأصـــــــــــــــول","الميزانية ","الميزانية "]
[38,1341,"تأمينات لدى الغير",134,"مدفوعات مقدمه",13,"مدينون وحسابات قبض",1,"الأصـــــــــــــــول","الميزانية ","الميزانية "]
[39,1351,"مصروفات مدفوعه مقدماً",135,"أرصده مدينه أخرى",13,"مدينون وحسابات قبض",1,"الأصـــــــــــــــول","الميزانية ","الميزانية "]
[40,1352,"إيرادات مستحقه",135,"أرصده مدينه أخرى",13,"مدينون وحسابات قبض",1,"الأصـــــــــــــــول","الميزانية ","الميزانية "]
[41,1353,"جاري شركاء مدين يوسف الدخيل",135,"أرصده مدينه أخرى",13,"مدينون وحسابات قبض",1,"الأصـــــــــــــــول","الميزانية ","الميزانية "]
{"$rows_left_out":83}
{"sheet":"يومية التسويات يناير 2020","index":1,"n_rows":74,"n_cols":10,"rows_kept":74,"cut":false,"hidden":false,"merged":[[43,4,43,5],[43,8,43,9],[47,8,47,9],[47,4,47,5],[70,4,70,5],[70,8,70,9],[64,4,64,5],[64,8,64,9],[67,4,67,5],[67,8,67,9],[59,4,59,5],[59,8,59,9],[1,4,1,5],[21,4,21,5],[29,4,29,5],[29,8,29,9],[26,4,26,5],[2,1,2,5],[39,4,39,5],[39,8,39,9],[26,8,26,9],[34,4,34,5],[34,8,34,9],[21,8,21,9],[73,4,73,5],[73,8,73,9],[50,4,50,5],[50,8,50,9],[53,4,53,5],[53,8,53,9]]}
[]
[]
[null,"يومية التسويات عن شهر    ",null,null,null,null,"  يناير 2020"]
[]
[null,"رقم القيد","التاريخ","عنوان القيد ","رقـــــم الحساب"," إسم  الحســـــــــــاب","مدين","دائن","بيــــــــان","ملاحظـــــــــــات"]
[null,null,"Date",null,"Codes","Account","Debit.","Credit.","Explanation","Notes"]
[null,1,"2020-01-01","قيمة مصاريف الخزينه عن شهر يناير 2020",{"$f":"IF(F7=\"\",\"\",INDEX('دليل الحسابـــــــــــــات '!$B:$B,MATCH($F7,'دليل الحسابـــــــــــــات '!$C:$C,0)))","v":32705},"مصاريف صيانه عموميه",{"$f":"400+500+1000+20","v":1920}]
[null,1,"2020-01-01","قيمة مصاريف الخزينه عن شهر يناير 2020",{"$f":"IF(F8=\"\",\"\",INDEX('دليل الحسابـــــــــــــات '!$B:$B,MATCH($F8,'دليل الحسابـــــــــــــات '!$C:$C,0)))","v":32703},"مصاريف مكتب أخرى عموميه",{"$f":"135+40+110","v":285}]
[null,1,"2020-01-01","قيمة مصاريف الخزينه عن شهر يناير 2020",{"$f":"IF(F9=\"\",\"\",INDEX('دليل الحسابـــــــــــــات '!$B:$B,MATCH($F9,'دليل الحسابـــــــــــــات '!$C:$C,0)))","v":32709},"مصاريف نظافه",{"$f":"106+50+97+50","v":303}]
[null,1,"2020-01-01","قيمة مصاريف الخزينه عن شهر يناير 2020",{"$f":"IF(F10=\"\",\"\",INDEX('دليل الحسابـــــــــــــات '!$B:$B,MATCH($F10,'دليل الحسابـــــــــــــات '!$C:$C,0)))","v":3251},"مصاريف بوفيه",{"$f":"40+10+32+67+49+51+29+48+87","v":413}]
[null,1,"2020-01-01","قيمة مصاريف الخزينه عن شهر يناير 2020",{"$f":"IF(F11=\"\",\"\",INDEX('دليل الحسابـــــــــــــات '!$B:$B,MATCH($F11,'دليل الحسابـــــــــــــات '!$C:$C,0)))","v":3128},"مصاريف كمبيوتر وشبكات ",{"$f":"125+124+124+124+124+124+124+125","v":994}]
[null,1,"2020-01-01","قيمة مصاريف الخزينه عن شهر يناير 2020",{"$f":"IF(F12=\"\",\"\",INDEX('دليل الحسابـــــــــــــات '!$B:$B,MATCH($F12,'دليل الحسابـــــــــــــات '!$C:$C,0)))","v":32706},"إكراميات عموميه",250,null,"قيمة الإكراميه الشهريه لموظفي أمن العماره"]
[null,1,"2020-01-01","قيمة مصاريف الخزينه عن شهر يناير 2020",{"$f":"IF(F13=\"\",\"\",INDEX('دليل الحسابـــــــــــــات '!$B:$B,MATCH($F13,'دليل الحسابـــــــــــــات '!$C:$C,0)))","v":2641},"مرتبات مستحقه",69839]
[null,1,"2020-01-01","قيمة مصاريف الخزينه عن شهر يناير 2020",{"$f":"IF(F14=\"\",\"\",INDEX('دليل الحسابـــــــــــــات '!$B:$B,MATCH($F14,'دليل الحسابـــــــــــــات '!$C:$C,0)))","v":3182},"مصاريف مطبوعات ",1800,null,"قيمة مطبوعات مستندات الشركه"]
[null,1,"2020-01-01","قيمة مصاريف الخزينه عن شهر يناير 2020",{"$f":"IF(F15=\"\",\"\",INDEX('دليل الحسابـــــــــــــات '!$B:$B,MATCH($F15,'دليل الحسابـــــــــــــات '!$C:$C,0)))","v":1331},"سلــــــف موظفين",{"$f":"200+700+200+500","v":1600},null,"نذير إسحاق700 +900سلفة جانيت أحمد"]
[null,1,"2020-01-01","قيمة مصاريف الخزينه عن شهر يناير 2020",{"$f":"IF(F16=\"\",\"\",INDEX('دليل الحسابـــــــــــــات '!$B:$B,MATCH($F16,'دليل الحسابـــــــــــــات '!$C:$C,0)))","v":3232},"مصاريف كهرباء عموميه",210,null,"فاتورة كهرباء شهر يناير ( ديسمبر)"]
[null,1,"2020-01-01","قيمة مصاريف الخزينه عن شهر يناير 2020",{"$f":"IF(F17=\"\",\"\",INDEX('دليل الحسابـــــــــــــات '!$B:$B,MATCH($F17,'دليل الحسابـــــــــــــات '!$C:$C,0)))","v":3262},"مصاريف إنتقالات موظفين عموميه",25,null,"مصاريف إنتقال من مول الكمبيوتر للشركه"]
[null,1,"2020-01-01","قيمة مصاريف الخزينه عن شهر يناير 2020",{"$f":"IF(F18=\"\",\"\",INDEX('دليل الحسابـــــــــــــات '!$B:$B,MATCH($F18,'دليل الحسابـــــــــــــات '!$C:$C,0)))","v":32704},"مصاريف أدوات كتابيه عموميه",140,null,"شراء 2روزمة ورق تصوير"]
[null,1,"2020-01-01","قيمة مصاريف الخزينه عن شهر يناير 2020",{"$f":"IF(F19=\"\",\"\",INDEX('دليل الحسابـــــــــــــات '!$B:$B,MATCH($F19,'دليل الحسابـــــــــــــات '!$C:$C,0)))","v":3241},"مصاريف إيجار",8750,null,"إيجار الشركه عن شهر يناير 2020"]
[null,1,"2020-01-01","قيمة مصاريف الخزينه عن شهر يناير 2020",{"$f":"IF(F20=\"\",\"\",INDEX('دليل الحسابـــــــــــــات '!$B:$B,MATCH($F20,'دليل الحسابـــــــــــــات '!$C:$C,0)))","v":32713},"مصاريف رسوم إداريه",200,null,"إشتراك الغزفه التجاريه 2020"]
[null,1,"2020-01-01","قيمة مصاريف الخزينه عن شهر يناير 2020",{"$f":"IF(F21=\"\",\"\",INDEX('دليل الحسابـــــــــــــات '!$B:$B,MATCH($F21,'دليل الحسابـــــــــــــات '!$C:$C,0)))","v":1211},"خزينة الشركه - جنيه مصري",null,86729]
[null,null,null,null,"الإجمــــــــــــــــــالي",null,{"$f":"SUM(G7:G21)","v":86729},{"$f":"SUM(H7:H21)","v":86729}]
[null,2,"2020-01-31","تسوية سداد مستحقات أحمد الرويس وأمينه خالد من الحساب الشخصي ليوسف الدخيل",{"$f":"IF(F23=\"\",\"\",INDEX('دليل الحسابـــــــــــــات '!$B:$B,MATCH($F23,'دليل الحسابـــــــــــــات '!$C:$C,0)))","v":2641},"مرتبات مستحقه",10000]
[null,2,"2020-01-31","تسوية سداد مستحقات أحمد الرويس وأمينه خالد من الحساب الشخصي ليوسف الدخيل",{"$f":"IF(F24=\"\",\"\",INDEX('دليل الحسابـــــــــــــات '!$B:$B,MATCH($F24,'دليل الحسابـــــــــــــات '!$C:$C,0)))","v":2641},"مرتبات مستحقه",1000]
[null,2,"2020-01-31","تسوية سداد مستحقات أحمد الرويس وأمينه خالد من الحساب الشخصي ليوسف الدخيل",{"$f":"IF(F25=\"\",\"\",INDEX('دليل الحسابـــــــــــــات '!$B:$B,MATCH($F25,'دليل الحسابـــــــــــــات '!$C:$C,0)))","v":2641},"مرتبات مستحقه",750]
[null,2,"2020-01-31","تسوية سداد مستحقات أحمد الرويس وأمينه خالد من الحساب الشخصي ليوسف الدخيل",{"$f":"IF(F26=\"\",\"\",INDEX('دليل الحسابـــــــــــــات '!$B:$B,MATCH($F26,'دليل الحسابـــــــــــــات '!$C:$C,0)))","v":2631},"جاري شركــــــــاء دائن  يوسف الدخيل",null,11750]
[null,null,null,null,"الإجمــــــــــــــــــالي",null,{"$f":"SUM(G23:G26)","v":11750},{"$f":"SUM(H23:H26)","v":11750}]
[null,3,"2020-01-03","إيراد حجز العميل 1 في فندق رمادا ميلان فايل 1",{"$f":"IF(F28=\"\",\"\",INDEX('دليل الحسابـــــــــــــات '!$B:$B,MATCH($F28,'دليل الحسابـــــــــــــات '!$C:$C,0)))","v":1311},"عملاء الشركه",{"$f":"2856.13*16","v":45698.080000000002},null,null,2856.13]
[null,3,"2020-01-03","إيراد حجز العميل 1 في فندق رمادا ميلان فايل 1",{"$f":"IF(F29=\"\",\"\",INDEX('دليل الحسابـــــــــــــات '!$B:$B,MATCH($F29,'دليل الحسابـــــــــــــات '!$C:$C,0)))","v":4211},"إيرادات حجز فنادق عملاء مدفوعه",null,{"$f":"2856.13*16","v":45698.080000000002},null,2856.13]
[null,null,null,null,"الإجمــــــــــــــــــالي",null,{"$f":"SUM(G28:G29)","v":45698.080000000002},{"$f":"SUM(H28:H29)","v":45698.080000000002}]
[null,4,"2020-01-03","مصروف حجز العميل 1 في فندق رمادا ميلان فايل 1",{"$f":"IF(F31=\"\",\"\",INDEX('دليل الحسابـــــــــــــات '!$B:$B,MATCH($F31,'دليل الحسابـــــــــــــات '!$C:$C,0)))","v":3131},"مصاريف حجز فنادق عملاء مدفوعه",{"$f":"2655*16","v":42480},null,null,2655]
[null,4,"2020-01-03","مصروف حجز العميل 1 في فندق رمادا ميلان فايل 1",{"$f":"IF(F32=\"\",\"\",INDEX('دليل الحسابـــــــــــــات '!$B:$B,MATCH($F32,'دليل الحسابـــــــــــــات '!$C:$C,0)))","v":3132},"مصاريف حجز طيران عملاء مدفوعه",{"$f":"117.2*16","v":1875.2},null,null,117.2]
[null,4,"2020-01-03","مصروف حجز العميل 1 في فندق رمادا ميلان فايل 1",{"$f":"IF(F33=\"\",\"\",INDEX('دليل الحسابـــــــــــــات '!$B:$B,MATCH($F33,'دليل الحسابـــــــــــــات '!$C:$C,0)))","v":2512},"موردين شركات سياحه",null,{"$f":"2655*16","v":42480},null,2655]
[null,4,"2020-01-03","مصروف حجز العميل 1 في فندق رمادا ميلان فايل 1",{"$f":"IF(F34=\"\",\"\",INDEX('دليل الحسابـــــــــــــات '!$B:$B,MATCH($F34,'دليل الحسابـــــــــــــات '!$C:$C,0)))","v":2631},"جاري شركــــــــاء دائن  يوسف الدخيل",null,{"$f":"117.2*16","v":1875.2},null,117.2]
[null,null,null,null,"الإجمــــــــــــــــــالي",null,{"$f":"SUM(G31:G34)","v":44355.199999999997},{"$f":"SUM(H31:H34)","v":44355.199999999997}]
[null,5,"2020-01-06","إيراد حجز العميل 2 في فندق راديسون بلو الكويت فايل 2",{"$f":"IF(F36=\"\",\"\",INDEX('دليل الحسابـــــــــــــات '!$B:$B,MATCH($F36,'دليل الحسابـــــــــــــات '!$C:$C,0)))","v":1235},"بنك مصر ( دولار)",{"$f":"251.16*16","v":4018.56},null,null,"257/251.16"]
[null,5,"2020-01-06","إيراد حجز العميل 2 في فندق راديسون بلو الكويت فايل 2",{"$f":"IF(F37=\"\",\"\",INDEX('دليل الحسابـــــــــــــات '!$B:$B,MATCH($F37,'دليل الحسابـــــــــــــات '!$C:$C,0)))","v":1311},"عملاء الشركه",null,{"$f":"251.16*16","v":4018.56},null,"257/251.16"]
[null,5,"2020-01-06","إيراد حجز العميل 2 في فندق راديسون بلو الكويت فايل 2",{"$f":"IF(F38=\"\",\"\",INDEX('دليل الحسابـــــــــــــات '!$B:$B,MATCH($F38,'دليل الحسابـــــــــــــات '!$C:$C,0)))","v":1311},"عملاء الشركه",{"$f":"251.16*16","v":4018.56},null,null,"257/251.16"]
[null,5,"2020-01-06","إيراد حجز العميل 2 في فندق راديسون بلو الكويت فايل 2",{"$f":"IF(F39=\"\",\"\",INDEX('دليل الحسابـــــــــــــات '!$B:$B,MATCH($F39,'دليل الحسابـــــــــــــات '!$C:$C,0)))","v":4211},"إيرادات حجز فنادق عملاء مدفوعه",null,{"$f":"251.16*16","v":4018.56},null,"257/251.16"]
[null,null,null,null,"الإجمــــــــــــــــــالي",null,{"$f":"SUM(G36:G39)","v":8037.12},{"$f":"SUM(H36:H39)","v":8037.12}]
{"$rows_left_out":35}
{"sheet":"يومية التسويات فبراير 2020","index":2,"n_rows":74,"n_cols":10,"rows_kept":74,"cut":false,"hidden":false,"merged":[[1,4,1,5],[2,1,2,5],[21,4,21,5],[21,8,21,9],[26,4,26,5],[26,8,26,9],[29,4,29,5],[29,8,29,9],[34,4,34,5],[34,8,34,9],[39,4,39,5],[39,8,39,9],[43,4,43,5],[43,8,43,9],[47,4,47,5],[47,8,47,9],[50,4,50,5],[50,8,50,9],[53,4,53,5],[53,8,53,9],[59,4,59,5],[59,8,59,9],[64,4,64,5],[64,8,64,9],[67,4,67,5],[67,8,67,9],[70,4,70,5],[70,8,70,9],[73,4,73,5],[73,8,73,9]]}
[]
[]
[null,"يومية التسويات عن شهر    ",null,null,null,null,"  فبراير 2020"]
[]
[null,"رقم القيد","التاريخ","عنوان القيد ","رقـــــم الحساب"," إسم  الحســـــــــــاب","مدين","دائن","بيــــــــان","ملاحظـــــــــــات"]
[null,null,"Date",null,"Codes","Account","Debit.","Credit.","Explanation","Notes"]
[null,1,"2020-01-01","قيمة مصاريف الخزينه عن شهر يناير 2020",{"$f":"IF(F7=\"\",\"\",INDEX('دليل الحسابـــــــــــــات '!$B:$B,MATCH($F7,'دليل الحسابـــــــــــــات '!$C:$C,0)))","v":32705},"مصاريف صيانه عموميه",765]
[null,1,"2020-01-01","قيمة مصاريف الخزينه عن شهر يناير 2020",{"$f":"IF(F8=\"\",\"\",INDEX('دليل الحسابـــــــــــــات '!$B:$B,MATCH($F8,'دليل الحسابـــــــــــــات '!$C:$C,0)))","v":32703},"مصاريف مكتب أخرى عموميه",187]
[null,1,"2020-01-01","قيمة مصاريف الخزينه عن شهر يناير 2020",{"$f":"IF(F9=\"\",\"\",INDEX('دليل الحسابـــــــــــــات '!$B:$B,MATCH($F9,'دليل الحسابـــــــــــــات '!$C:$C,0)))","v":32709},"مصاريف نظافه",800]
[null,1,"2020-01-01","قيمة مصاريف الخزينه عن شهر يناير 2020",{"$f":"IF(F10=\"\",\"\",INDEX('دليل الحسابـــــــــــــات '!$B:$B,MATCH($F10,'دليل الحسابـــــــــــــات '!$C:$C,0)))","v":3251},"مصاريف بوفيه",676]
[null,1,"2020-01-01","قيمة مصاريف الخزينه عن شهر يناير 2020",{"$f":"IF(F11=\"\",\"\",INDEX('دليل الحسابـــــــــــــات '!$B:$B,MATCH($F11,'دليل الحسابـــــــــــــات '!$C:$C,0)))","v":3128},"مصاريف كمبيوتر وشبكات ",888]
[null,1,"2020-01-01","قيمة مصاريف الخزينه عن شهر يناير 2020",{"$f":"IF(F12=\"\",\"\",INDEX('دليل الحسابـــــــــــــات '!$B:$B,MATCH($F12,'دليل الحسابـــــــــــــات '!$C:$C,0)))","v":32706},"إكراميات عموميه",1000,null,"قيمة الإكراميه الشهريه لموظفي أمن العماره"]
[null,1,"2020-01-01","قيمة مصاريف الخزينه عن شهر يناير 2020",{"$f":"IF(F13=\"\",\"\",INDEX('دليل الحسابـــــــــــــات '!$B:$B,MATCH($F13,'دليل الحسابـــــــــــــات '!$C:$C,0)))","v":2641},"مرتبات مستحقه",71687]
[null,1,"2020-01-01","قيمة مصاريف الخزينه عن شهر يناير 2020",{"$f":"IF(F14=\"\",\"\",INDEX('دليل الحسابـــــــــــــات '!$B:$B,MATCH($F14,'دليل الحسابـــــــــــــات '!$C:$C,0)))","v":3182},"مصاريف مطبوعات ",3000,null,"قيمة مطبوعات مستندات الشركه"]
[null,1,"2020-01-01","قيمة مصاريف الخزينه عن شهر يناير 2020",{"$f":"IF(F15=\"\",\"\",INDEX('دليل الحسابـــــــــــــات '!$B:$B,MATCH($F15,'دليل الحسابـــــــــــــات '!$C:$C,0)))","v":1331},"سلــــــف موظفين",4300,null,"نذير إسحاق700 +900سلفة جانيت أحمد"]
[null,1,"2020-01-01","قيمة مصاريف الخزينه عن شهر يناير 2020",{"$f":"IF(F16=\"\",\"\",INDEX('دليل الحسابـــــــــــــات '!$B:$B,MATCH($F16,'دليل الحسابـــــــــــــات '!$C:$C,0)))","v":3232},"مصاريف كهرباء عموميه",876,null,"فاتورة كهرباء شهر يناير ( ديسمبر)"]
[null,1,"2020-01-01","قيمة مصاريف الخزينه عن شهر يناير 2020",{"$f":"IF(F17=\"\",\"\",INDEX('دليل الحسابـــــــــــــات '!$B:$B,MATCH($F17,'دليل الحسابـــــــــــــات '!$C:$C,0)))","v":3262},"مصاريف إنتقالات موظفين عموميه",100,null,"مصاريف إنتقال من مول الكمبيوتر للشركه"]
[null,1,"2020-01-01","قيمة مصاريف الخزينه عن شهر يناير 2020",{"$f":"IF(F18=\"\",\"\",INDEX('دليل الحسابـــــــــــــات '!$B:$B,MATCH($F18,'دليل الحسابـــــــــــــات '!$C:$C,0)))","v":32704},"مصاريف أدوات كتابيه عموميه",199,null,"شراء 2روزمة ورق تصوير"]
[null,1,"2020-01-01","قيمة مصاريف الخزينه عن شهر يناير 2020",{"$f":"IF(F19=\"\",\"\",INDEX('دليل الحسابـــــــــــــات '!$B:$B,MATCH($F19,'دليل الحسابـــــــــــــات '!$C:$C,0)))","v":3241},"مصاريف إيجار",8750,null,"إيجار الشركه عن شهر يناير 2020"]
[null,1,"2020-01-01","قيمة مصاريف الخزينه عن شهر يناير 2020",{"$f":"IF(F20=\"\",\"\",INDEX('دليل الحسابـــــــــــــات '!$B:$B,MATCH($F20,'دليل الحسابـــــــــــــات '!$C:$C,0)))","v":32713},"مصاريف رسوم إداريه",100,null,"إشتراك الغزفه التجاريه 2020"]
[null,1,"2020-01-01","قيمة مصاريف الخزينه عن شهر يناير 2020",{"$f":"IF(F21=\"\",\"\",INDEX('دليل الحسابـــــــــــــات '!$B:$B,MATCH($F21,'دليل الحسابـــــــــــــات '!$C:$C,0)))","v":1211},"خزينة الشركه - جنيه مصري",null,93328]
[null,null,null,null,"الإجمــــــــــــــــــالي",null,{"$f":"SUM(G7:G21)","v":93328},{"$f":"SUM(H7:H21)","v":93328}]
[null,2,"2020-01-31","تسوية سداد مستحقات أحمد الرويس وأمينه خالد من الحساب الشخصي ليوسف الدخيل",{"$f":"IF(F23=\"\",\"\",INDEX('دليل الحسابـــــــــــــات '!$B:$B,MATCH($F23,'دليل الحسابـــــــــــــات '!$C:$C,0)))","v":2641},"مرتبات مستحقه",11000]
[null,2,"2020-01-31","تسوية سداد مستحقات أحمد الرويس وأمينه خالد من الحساب الشخصي ليوسف الدخيل",{"$f":"IF(F24=\"\",\"\",INDEX('دليل الحسابـــــــــــــات '!$B:$B,MATCH($F24,'دليل الحسابـــــــــــــات '!$C:$C,0)))","v":2641},"مرتبات مستحقه",800]
[null,2,"2020-01-31","تسوية سداد مستحقات أحمد الرويس وأمينه خالد من الحساب الشخصي ليوسف الدخيل",{"$f":"IF(F25=\"\",\"\",INDEX('دليل الحسابـــــــــــــات '!$B:$B,MATCH($F25,'دليل الحسابـــــــــــــات '!$C:$C,0)))","v":2641},"مرتبات مستحقه",1000]
[null,2,"2020-01-31","تسوية سداد مستحقات أحمد الرويس وأمينه خالد من الحساب الشخصي ليوسف الدخيل",{"$f":"IF(F26=\"\",\"\",INDEX('دليل الحسابـــــــــــــات '!$B:$B,MATCH($F26,'دليل الحسابـــــــــــــات '!$C:$C,0)))","v":2631},"جاري شركــــــــاء دائن  يوسف الدخيل",null,12800]
[null,null,null,null,"الإجمــــــــــــــــــالي",null,{"$f":"SUM(G23:G26)","v":12800},{"$f":"SUM(H23:H26)","v":12800}]
[null,3,"2020-01-03","إيراد حجز العميل 1 في فندق رمادا ميلان فايل 1",{"$f":"IF(F28=\"\",\"\",INDEX('دليل الحسابـــــــــــــات '!$B:$B,MATCH($F28,'دليل الحسابـــــــــــــات '!$C:$C,0)))","v":1311},"عملاء الشركه",16000,null,null,1000]
[null,3,"2020-01-03","إيراد حجز العميل 1 في فندق رمادا ميلان فايل 1",{"$f":"IF(F29=\"\",\"\",INDEX('دليل الحسابـــــــــــــات '!$B:$B,MATCH($F29,'دليل الحسابـــــــــــــات '!$C:$C,0)))","v":4211},"إيرادات حجز فنادق عملاء مدفوعه",null,16000,null,1000]
[null,null,null,null,"الإجمــــــــــــــــــالي",null,{"$f":"SUM(G28:G29)","v":16000},{"$f":"SUM(H28:H29)","v":16000}]
[null,4,"2020-01-03","مصروف حجز العميل 1 في فندق رمادا ميلان فايل 1",{"$f":"IF(F31=\"\",\"\",INDEX('دليل الحسابـــــــــــــات '!$B:$B,MATCH($F31,'دليل الحسابـــــــــــــات '!$C:$C,0)))","v":3131},"مصاريف حجز فنادق عملاء مدفوعه",{"$f":"2655*16","v":42480},null,null,2655]
[null,4,"2020-01-03","مصروف حجز العميل 1 في فندق رمادا ميلان فايل 1",{"$f":"IF(F32=\"\",\"\",INDEX('دليل الحسابـــــــــــــات '!$B:$B,MATCH($F32,'دليل الحسابـــــــــــــات '!$C:$C,0)))","v":3132},"مصاريف حجز طيران عملاء مدفوعه",{"$f":"117.2*16","v":1875.2},null,null,117.2]
[null,4,"2020-01-03","مصروف حجز العميل 1 في فندق رمادا ميلان فايل 1",{"$f":"IF(F33=\"\",\"\",INDEX('دليل الحسابـــــــــــــات '!$B:$B,MATCH($F33,'دليل الحسابـــــــــــــات '!$C:$C,0)))","v":2512},"موردين شركات سياحه",null,{"$f":"2655*16","v":42480},null,2655]
[null,4,"2020-01-03","مصروف حجز العميل 1 في فندق رمادا ميلان فايل 1",{"$f":"IF(F34=\"\",\"\",INDEX('دليل الحسابـــــــــــــات '!$B:$B,MATCH($F34,'دليل الحسابـــــــــــــات '!$C:$C,0)))","v":2631},"جاري شركــــــــاء دائن  يوسف الدخيل",null,{"$f":"117.2*16","v":1875.2},null,117.2]
[null,null,null,null,"الإجمــــــــــــــــــالي",null,{"$f":"SUM(G31:G34)","v":44355.199999999997},{"$f":"SUM(H31:H34)","v":44355.199999999997}]
[null,5,"2020-01-06","إيراد حجز العميل 2 في فندق راديسون بلو الكويت فايل 2",{"$f":"IF(F36=\"\",\"\",INDEX('دليل الحسابـــــــــــــات '!$B:$B,MATCH($F36,'دليل الحسابـــــــــــــات '!$C:$C,0)))","v":1235},"بنك مصر ( دولار)",{"$f":"251.16*16","v":4018.56},null,null,"257/251.16"]
[null,5,"2020-01-06","إيراد حجز العميل 2 في فندق راديسون بلو الكويت فايل 2",{"$f":"IF(F37=\"\",\"\",INDEX('دليل الحسابـــــــــــــات '!$B:$B,MATCH($F37,'دليل الحسابـــــــــــــات '!$C:$C,0)))","v":1311},"عملاء الشركه",null,{"$f":"251.16*16","v":4018.56},null,"257/251.16"]
[null,5,"2020-01-06","إيراد حجز العميل 2 في فندق راديسون بلو الكويت فايل 2",{"$f":"IF(F38=\"\",\"\",INDEX('دليل الحسابـــــــــــــات '!$B:$B,MATCH($F38,'دليل الحسابـــــــــــــات '!$C:$C,0)))","v":1311},"عملاء الشركه",{"$f":"251.16*16","v":4018.56},null,null,"257/251.16"]
[null,5,"2020-01-06","إيراد حجز العميل 2 في فندق راديسون بلو الكويت فايل 2",{"$f":"IF(F39=\"\",\"\",INDEX('دليل الحسابـــــــــــــات '!$B:$B,MATCH($F39,'دليل الحسابـــــــــــــات '!$C:$C,0)))","v":4211},"إيرادات حجز فنادق عملاء مدفوعه",null,{"$f":"251.16*16","v":4018.56},null,"257/251.16"]
[null,null,null,null,"الإجمــــــــــــــــــالي",null,{"$f":"SUM(G36:G39)","v":8037.12},{"$f":"SUM(H36:H39)","v":8037.12}]
{"$rows_left_out":35}
{"sheet":"كشف الحساب","index":3,"n_rows":6,"n_cols":8,"rows_kept":6,"cut":false,"hidden":false,"merged":[]}
[]
[]
[]
[null,null,null,null,null,{"$f":"IF(G4=\"\",\"\",INDEX('دليل الحسابـــــــــــــات '!$B:$B,MATCH($G4,'دليل الحسابـــــــــــــات '!$C:$C,0)))","v":1131},"تكييفات ومراوح","المطلوب عند كتابة إسم الحساب تنزل البيانات المكتوبه باللون الأخضر لكل شهر "]
[]
[null,"رقم التسويه","تاريخ التسويه","بيان التسويه","مدين","دائن","بيان ","ملاحظات"]