{"text_format":"1","workbook":"xlsx","n_sheets":2,"sheets":["Main","Report"],"not_rendered":{"charts":0,"images":0,"macros":0,"external_links":0,"defined_names":1,"comments":0,"pivot_tables":0},"unopened":[],"bounds":{"document_bytes":16777216,"sheet_cells":100000,"rows_first":2000,"rows_last":500,"rows_between":2000,"halvings":0,"cell_chars":16384,"cell_head_chars":4096},"cells_cut":0,"cells_raw":0,"read":"whole","date_system":"1900"}

{"sheet":"Main","index":0,"n_rows":224,"n_cols":43,"rows_kept":224,"cut":false,"hidden":false,"merged":[[0,35,0,42],[223,35,223,40],[0,0,0,2],[0,3,0,25],[0,26,0,30],[0,32,0,34]]}
["Participating",null,null,"Ticket",null,null,null,null,null,null,null,null,null,null,null,null,null,null,null,null,null,null,null,null,null,null,"Prices",null,null,null,null,"Codes","Cancel",null,null,"Collection"]
["Adl","Chd","Baby","Muh Kullanıcı","Muhasebe Tarih","Zarf","Accounting","Ödeme Beklenen","Sale Type","SlipNo","Slip Tutarı","Free","Tour Name","Voucher","Tour Date","Guide Name","Customer Package","Packet","Colection Control","Hotel","Suppliers","Sale Date","Trans Region Name","Remark","Lock","Ticket No","Tour Price","Discount","Ekstra Price","Net Amount","Collection",null,"Adl","Chd","Baby","Date","Process","Type","Receipt No","Curr","Exchange","Amount","Remark"]
[null,null,null,null,null,null,null,null,null,null,null,null,null,null,null,"Said Reda",null,null,null,null,null,null,null,null,null,1000055,null,null,null,195]
[null,null,null,null,null,null,null,null,null,null,null,null,null,null,null,"Said Reda",null,null,null,null,null,null,null,null,null,1000057,null,null,null,60]
[null,null,null,null,null,null,null,null,null,null,null,null,null,null,null,"Said Reda",null,null,null,null,null,null,null,null,null,1000058,null,null,null,70]
[null,null,null,null,null,null,null,null,null,null,null,null,"Shopping",null,null,"Said Reda",null,null,null,null,null,null,null,null,null,1000059,null,null,null,0]
[null,null,null,null,null,null,null,null,null,null,null,null,null,null,null,"Said Reda",null,null,null,null,null,null,null,null,null,1000060,null,null,null,160]
[null,null,null,null,null,null,null,null,null,null,null,null,null,null,null,"Said Reda",null,null,null,null,null,null,null,null,null,1000061,null,null,null,110]
[null,null,null,null,null,null,null,null,null,null,null,null,null,null,null,"Said Reda",null,null,null,null,null,null,null,null,null,1000062,null,null,null,60]
[null,null,null,null,null,null,null,null,null,null,null,null,"Shopping",null,null,"Said Reda",null,null,null,null,null,null,null,null,null,1000063,null,null,null,0]
[null,null,null,null,null,null,null,null,null,null,null,null,null,null,null,"Said Reda",null,null,null,null,null,null,null,null,null,1000064,null,null,null,80]
[null,null,null,null,null,null,null,null,null,null,null,null,null,null,null,"Said Reda",null,null,null,null,null,null,null,null,null,1000065,null,null,null,60]
[null,null,null,null,null,null,null,null,null,null,null,null,null,null,null,"Said Reda",null,null,null,null,null,null,null,null,null,1000066,null,null,null,75]
[null,null,null,null,null,null,null,null,null,null,null,null,"Shopping",null,null,"Said Reda",null,null,null,null,null,null,null,null,null,1000067,null,null,null,0]
[null,null,null,null,null,null,null,null,null,null,null,null,"Shopping",null,null,"Said Reda",null,null,null,null,null,null,null,null,null,1000069,null,null,null,0]
[null,null,null,null,null,null,null,null,null,null,null,null,"Shopping",null,null,"Said Reda",null,null,null,null,null,null,null,null,null,1000070,null,null,null,0]
[null,null,null,null,null,null,null,null,null,null,null,null,null,null,null,"Said Reda",null,null,null,null,null,null,null,null,null,1000072,null,null,null,60]
[null,null,null,null,null,null,null,null,null,null,null,null,"Shopping",null,null,"Said Reda",null,null,null,null,null,null,null,null,null,1000073,null,null,null,0]
[null,null,null,null,null,null,null,null,null,null,null,null,"Shopping",null,null,"Said Reda",null,null,null,null,null,null,null,null,null,1000074,null,null,null,0]
[null,null,null,null,null,null,null,null,null,null,null,null,null,null,null,"Said Reda",null,null,null,null,null,null,null,null,null,1000075,null,null,null,70]
[null,null,null,null,null,null,null,null,null,null,null,null,null,null,null,"Said Reda",null,null,null,null,null,null,null,null,null,1000077,null,null,null,90]
[null,null,null,null,null,null,null,null,null,null,null,null,null,null,null,"Said Reda",null,null,null,null,null,null,null,null,null,1000078,null,null,null,200]
[null,null,null,null,null,null,null,null,null,null,null,null,null,null,null,"Said Reda",null,null,null,null,null,null,null,null,null,1000079,null,null,null,100]
[null,null,null,null,null,null,null,null,null,null,null,null,null,null,null,"Said Reda",null,null,null,null,null,null,null,null,null,1000080,null,null,null,60]
[null,null,null,null,null,null,null,null,null,null,null,null,null,null,null,"Said Reda",null,null,null,null,null,null,null,null,null,1000081,null,null,null,160]
[null,null,null,null,null,null,null,null,null,null,null,null,"Shopping",null,null,"Said Reda",null,null,null,null,null,null,null,null,null,1000082,null,null,null,0]
[null,null,null,null,null,null,null,null,null,null,null,null,null,null,null,"Said Reda",null,null,null,null,null,null,null,null,null,1000083,null,null,null,80]
[null,null,null,null,null,null,null,null,null,null,null,null,null,null,null,"Samir Fouad",null,null,null,null,null,null,null,null,null,1000217,null,null,null,110]
[null,null,null,null,null,null,null,null,null,null,null,null,null,null,null,"Samir Fouad",null,null,null,null,null,null,null,null,null,1000218,null,null,null,60]
[null,null,null,null,null,null,null,null,null,null,null,null,null,null,null,"Samir Fouad",null,null,null,null,null,null,null,null,null,1000219,null,null,null,110]
[null,null,null,null,null,null,null,null,null,null,null,null,null,null,null,"Samir Fouad",null,null,null,null,null,null,null,null,null,1000220,null,null,null,60]
[null,null,null,null,null,null,null,null,null,null,null,null,null,null,null,"Samir Fouad",null,null,null,null,null,null,null,null,null,1000223,null,null,null,110]
[null,null,null,null,null,null,null,null,null,null,null,null,null,null,null,"Samir Fouad",null,null,null,null,null,null,null,null,null,1000224,null,null,null,60]
[null,null,null,null,null,null,null,null,null,null,null,null,null,null,null,"Samir Fouad",null,null,null,null,null,null,null,null,null,1000226,null,null,null,70]
[null,null,null,null,null,null,null,null,null,null,null,null,"20 $ Discount",null,null,"Samir Fouad",null,null,null,null,null,null,null,null,null,1000228,null,null,null,110]
[null,null,null,null,null,null,null,null,null,null,null,null,"10 $ Discount",null,null,"Samir Fouad",null,null,null,null,null,null,null,null,null,1000229,null,null,null,50]
[null,null,null,null,null,null,null,null,null,null,null,null,null,null,null,"Samir Fouad",null,null,null,null,null,null,null,null,null,1000233,null,null,null,30]
[null,null,null,null,null,null,null,null,null,null,null,null,"10 $ Discount",null,null,"Samir Fouad",null,null,null,null,null,null,null,null,null,1000234,null,null,null,60]
[null,null,null,null,null,null,null,null,null,null,null,null,"10 $ Discount",null,null,"Samir Fouad",null,null,null,null,null,null,null,null,null,1000238,null,null,null,60]
[null,null,null,null,null,null,null,null,null,null,null,null,"Shopping",null,null,"Samir Fouad",null,null,null,null,null,null,null,null,null,1000239,null,null,null,0]
{"$rows_left_out":185}
{"sheet":"Report","index":1,"n_rows":245,"n_cols":13,"rows_kept":245,"cut":false,"hidden":false,"merged":[[207,0,207,4],[242,0,242,1],[244,0,244,4],[21,10,22,15],[162,0,162,4],[164,0,164,1],[164,4,165,4],[166,0,166,4],[201,0,201,1],[203,0,203,4],[205,0,205,1],[205,4,206,4],[160,0,160,1],[123,0,123,1],[123,4,124,4],[125,0,125,4],[119,0,119,1],[121,0,121,4],[78,0,78,1],[80,0,80,4],[82,0,82,1],[82,4,83,4],[84,0,84,4],[39,0,39,4],[41,0,41,1],[41,4,42,4],[43,0,43,4],[37,0,37,1],[0,0,0,1],[0,4,1,4],[2,0,2,4]]}
[{"$f":"TODAY()","v":"2021-01-20"},null,null,null,1]
[]
["Company :Safari Company",null,null,null,null,null,null,null,null,null,null,null,"Said Reda"]
[null,null,null,null,null,null,null,null,null,null,null,null,"Omar Nagy"]
["Guide Name:",{"$f":"$G$5","v":"Said Reda"},null,null,null,null,"Said Reda",null,null,null,null,null,"Samir Fouad"]
[]
["No.","Voucher no.","Cash",null,"Remarks"]
[{"$f":"IF(B8=\"\",\"\",SUBTOTAL(3,$B$8:B8))","v":1},{"$f":"IFERROR(INDEX(Main!$Z$3:$Z$223,SMALL(IF((Report!$G$5=Main!$P$3:$P$223),ROW(Main!$P$3:$P$223)-2),ROW(A1))),\"\")","v":1000055},{"$f":"IFERROR(INDEX(Main!$AD$3:$AD$223,SMALL(IF((Report!$G$5=Main!$P$3:$P$223),ROW(Main!$P$3:$P$223)-2),ROW(A1))),\"\")","v":195},null,{"$f":"IFERROR(INDEX(Main!$M$3:$M$223,SMALL(IF((Report!$G$5=Main!$P$3:$P$223),ROW(Main!$P$3:$P$223)-2),ROW(A1))),\"\")","v":0}]
[{"$f":"IF(B9=\"\",\"\",SUBTOTAL(3,$B$8:B9))","v":2},{"$f":"IFERROR(INDEX(Main!$Z$3:$Z$223,SMALL(IF((Report!$G$5=Main!$P$3:$P$223),ROW(Main!$P$3:$P$223)-2),ROW(A2))),\"\")","v":1000057},{"$f":"IFERROR(INDEX(Main!$AD$3:$AD$223,SMALL(IF((Report!$G$5=Main!$P$3:$P$223),ROW(Main!$P$3:$P$223)-2),ROW(A2))),\"\")","v":60},null,{"$f":"IFERROR(INDEX(Main!$M$3:$M$223,SMALL(IF((Report!$G$5=Main!$P$3:$P$223),ROW(Main!$P$3:$P$223)-2),ROW(A2))),\"\")","v":0}]
[{"$f":"IF(B10=\"\",\"\",SUBTOTAL(3,$B$8:B10))","v":3},{"$f":"IFERROR(INDEX(Main!$Z$3:$Z$223,SMALL(IF((Report!$G$5=Main!$P$3:$P$223),ROW(Main!$P$3:$P$223)-2),ROW(A3))),\"\")","v":1000058},{"$f":"IFERROR(INDEX(Main!$AD$3:$AD$223,SMALL(IF((Report!$G$5=Main!$P$3:$P$223),ROW(Main!$P$3:$P$223)-2),ROW(A3))),\"\")","v":70},null,{"$f":"IFERROR(INDEX(Main!$M$3:$M$223,SMALL(IF((Report!$G$5=Main!$P$3:$P$223),ROW(Main!$P$3:$P$223)-2),ROW(A3))),\"\")","v":0}]
[{"$f":"IF(B11=\"\",\"\",SUBTOTAL(3,$B$8:B11))","v":4},{"$f":"IFERROR(INDEX(Main!$Z$3:$Z$223,SMALL(IF((Report!$G$5=Main!$P$3:$P$223),ROW(Main!$P$3:$P$223)-2),ROW(A4))),\"\")","v":1000059},{"$f":"IFERROR(INDEX(Main!$AD$3:$AD$223,SMALL(IF((Report!$G$5=Main!$P$3:$P$223),ROW(Main!$P$3:$P$223)-2),ROW(A4))),\"\")","v":0},null,{"$f":"IFERROR(INDEX(Main!$M$3:$M$223,SMALL(IF((Report!$G$5=Main!$P$3:$P$223),ROW(Main!$P$3:$P$223)-2),ROW(A4))),\"\")","v":"Shopping"}]
[{"$f":"IF(B12=\"\",\"\",SUBTOTAL(3,$B$8:B12))","v":5},{"$f":"IFERROR(INDEX(Main!$Z$3:$Z$223,SMALL(IF((Report!$G$5=Main!$P$3:$P$223),ROW(Main!$P$3:$P$223)-2),ROW(A5))),\"\")","v":1000060},{"$f":"IFERROR(INDEX(Main!$AD$3:$AD$223,SMALL(IF((Report!$G$5=Main!$P$3:$P$223),ROW(Main!$P$3:$P$223)-2),ROW(A5))),\"\")","v":160},null,{"$f":"IFERROR(INDEX(Main!$M$3:$M$223,SMALL(IF((Report!$G$5=Main!$P$3:$P$223),ROW(Main!$P$3:$P$223)-2),ROW(A5))),\"\")","v":0}]
[{"$f":"IF(B13=\"\",\"\",SUBTOTAL(3,$B$8:B13))","v":6},{"$f":"IFERROR(INDEX(Main!$Z$3:$Z$223,SMALL(IF((Report!$G$5=Main!$P$3:$P$223),ROW(Main!$P$3:$P$223)-2),ROW(A6))),\"\")","v":1000061},{"$f":"IFERROR(INDEX(Main!$AD$3:$AD$223,SMALL(IF((Report!$G$5=Main!$P$3:$P$223),ROW(Main!$P$3:$P$223)-2),ROW(A6))),\"\")","v":110},null,{"$f":"IFERROR(INDEX(Main!$M$3:$M$223,SMALL(IF((Report!$G$5=Main!$P$3:$P$223),ROW(Main!$P$3:$P$223)-2),ROW(A6))),\"\")","v":0}]
[{"$f":"IF(B14=\"\",\"\",SUBTOTAL(3,$B$8:B14))","v":7},{"$f":"IFERROR(INDEX(Main!$Z$3:$Z$223,SMALL(IF((Report!$G$5=Main!$P$3:$P$223),ROW(Main!$P$3:$P$223)-2),ROW(A7))),\"\")","v":1000062},{"$f":"IFERROR(INDEX(Main!$AD$3:$AD$223,SMALL(IF((Report!$G$5=Main!$P$3:$P$223),ROW(Main!$P$3:$P$223)-2),ROW(A7))),\"\")","v":60},null,{"$f":"IFERROR(INDEX(Main!$M$3:$M$223,SMALL(IF((Report!$G$5=Main!$P$3:$P$223),ROW(Main!$P$3:$P$223)-2),ROW(A7))),\"\")","v":0}]
[{"$f":"IF(B15=\"\",\"\",SUBTOTAL(3,$B$8:B15))","v":8},{"$f":"IFERROR(INDEX(Main!$Z$3:$Z$223,SMALL(IF((Report!$G$5=Main!$P$3:$P$223),ROW(Main!$P$3:$P$223)-2),ROW(A8))),\"\")","v":1000063},{"$f":"IFERROR(INDEX(Main!$AD$3:$AD$223,SMALL(IF((Report!$G$5=Main!$P$3:$P$223),ROW(Main!$P$3:$P$223)-2),ROW(A8))),\"\")","v":0},null,{"$f":"IFERROR(INDEX(Main!$M$3:$M$223,SMALL(IF((Report!$G$5=Main!$P$3:$P$223),ROW(Main!$P$3:$P$223)-2),ROW(A8))),\"\")","v":"Shopping"}]
[{"$f":"IF(B16=\"\",\"\",SUBTOTAL(3,$B$8:B16))","v":9},{"$f":"IFERROR(INDEX(Main!$Z$3:$Z$223,SMALL(IF((Report!$G$5=Main!$P$3:$P$223),ROW(Main!$P$3:$P$223)-2),ROW(A9))),\"\")","v":1000064},{"$f":"IFERROR(INDEX(Main!$AD$3:$AD$223,SMALL(IF((Report!$G$5=Main!$P$3:$P$223),ROW(Main!$P$3:$P$223)-2),ROW(A9))),\"\")","v":80},null,{"$f":"IFERROR(INDEX(Main!$M$3:$M$223,SMALL(IF((Report!$G$5=Main!$P$3:$P$223),ROW(Main!$P$3:$P$223)-2),ROW(A9))),\"\")","v":0}]
[{"$f":"IF(B17=\"\",\"\",SUBTOTAL(3,$B$8:B17))","v":10},{"$f":"IFERROR(INDEX(Main!$Z$3:$Z$223,SMALL(IF((Report!$G$5=Main!$P$3:$P$223),ROW(Main!$P$3:$P$223)-2),ROW(A10))),\"\")","v":1000065},{"$f":"IFERROR(INDEX(Main!$AD$3:$AD$223,SMALL(IF((Report!$G$5=Main!$P$3:$P$223),ROW(Main!$P$3:$P$223)-2),ROW(A10))),\"\")","v":60},null,{"$f":"IFERROR(INDEX(Main!$M$3:$M$223,SMALL(IF((Report!$G$5=Main!$P$3:$P$223),ROW(Main!$P$3:$P$223)-2),ROW(A10))),\"\")","v":0}]
[{"$f":"IF(B18=\"\",\"\",SUBTOTAL(3,$B$8:B18))","v":11},{"$f":"IFERROR(INDEX(Main!$Z$3:$Z$223,SMALL(IF((Report!$G$5=Main!$P$3:$P$223),ROW(Main!$P$3:$P$223)-2),ROW(A11))),\"\")","v":1000066},{"$f":"IFERROR(INDEX(Main!$AD$3:$AD$223,SMALL(IF((Report!$G$5=Main!$P$3:$P$223),ROW(Main!$P$3:$P$223)-2),ROW(A11))),\"\")","v":75},null,{"$f":"IFERROR(INDEX(Main!$M$3:$M$223,SMALL(IF((Report!$G$5=Main!$P$3:$P$223),ROW(Main!$P$3:$P$223)-2),ROW(A11))),\"\")","v":0}]
[{"$f":"IF(B19=\"\",\"\",SUBTOTAL(3,$B$8:B19))","v":12},{"$f":"IFERROR(INDEX(Main!$Z$3:$Z$223,SMALL(IF((Report!$G$5=Main!$P$3:$P$223),ROW(Main!$P$3:$P$223)-2),ROW(A12))),\"\")","v":1000067},{"$f":"IFERROR(INDEX(Main!$AD$3:$AD$223,SMALL(IF((Report!$G$5=Main!$P$3:$P$223),ROW(Main!$P$3:$P$223)-2),ROW(A12))),\"\")","v":0},null,{"$f":"IFERROR(INDEX(Main!$M$3:$M$223,SMALL(IF((Report!$G$5=Main!$P$3:$P$223),ROW(Main!$P$3:$P$223)-2),ROW(A12))),\"\")","v":"Shopping"}]
[{"$f":"IF(B20=\"\",\"\",SUBTOTAL(3,$B$8:B20))","v":13},{"$f":"IFERROR(INDEX(Main!$Z$3:$Z$223,SMALL(IF((Report!$G$5=Main!$P$3:$P$223),ROW(Main!$P$3:$P$223)-2),ROW(A13))),\"\")","v":1000069},{"$f":"IFERROR(INDEX(Main!$AD$3:$AD$223,SMALL(IF((Report!$G$5=Main!$P$3:$P$223),ROW(Main!$P$3:$P$223)-2),ROW(A13))),\"\")","v":0},null,{"$f":"IFERROR(INDEX(Main!$M$3:$M$223,SMALL(IF((Report!$G$5=Main!$P$3:$P$223),ROW(Main!$P$3:$P$223)-2),ROW(A13))),\"\")","v":"Shopping"}]
[{"$f":"IF(B21=\"\",\"\",SUBTOTAL(3,$B$8:B21))","v":14},{"$f":"IFERROR(INDEX(Main!$Z$3:$Z$223,SMALL(IF((Report!$G$5=Main!$P$3:$P$223),ROW(Main!$P$3:$P$223)-2),ROW(A14))),\"\")","v":1000070},{"$f":"IFERROR(INDEX(Main!$AD$3:$AD$223,SMALL(IF((Report!$G$5=Main!$P$3:$P$223),ROW(Main!$P$3:$P$223)-2),ROW(A14))),\"\")","v":0},null,{"$f":"IFERROR(INDEX(Main!$M$3:$M$223,SMALL(IF((Report!$G$5=Main!$P$3:$P$223),ROW(Main!$P$3:$P$223)-2),ROW(A14))),\"\")","v":"Shopping"}]
[{"$f":"IF(B22=\"\",\"\",SUBTOTAL(3,$B$8:B22))","v":15},{"$f":"IFERROR(INDEX(Main!$Z$3:$Z$223,SMALL(IF((Report!$G$5=Main!$P$3:$P$223),ROW(Main!$P$3:$P$223)-2),ROW(A15))),\"\")","v":1000072},{"$f":"IFERROR(INDEX(Main!$AD$3:$AD$223,SMALL(IF((Report!$G$5=Main!$P$3:$P$223),ROW(Main!$P$3:$P$223)-2),ROW(A15))),\"\")","v":60},null,{"$f":"IFERROR(INDEX(Main!$M$3:$M$223,SMALL(IF((Report!$G$5=Main!$P$3:$P$223),ROW(Main!$P$3:$P$223)-2),ROW(A15))),\"\")","v":0},null,null,null,null,null,"هذه شكل النتائج المطلوبة والبيانات المطلوب ترحيلها \nمن صفحة Main"]
[{"$f":"IF(B23=\"\",\"\",SUBTOTAL(3,$B$8:B23))","v":16},{"$f":"IFERROR(INDEX(Main!$Z$3:$Z$223,SMALL(IF((Report!$G$5=Main!$P$3:$P$223),ROW(Main!$P$3:$P$223)-2),ROW(A16))),\"\")","v":1000073},{"$f":"IFERROR(INDEX(Main!$AD$3:$AD$223,SMALL(IF((Report!$G$5=Main!$P$3:$P$223),ROW(Main!$P$3:$P$223)-2),ROW(A16))),\"\")","v":0},null,{"$f":"IFERROR(INDEX(Main!$M$3:$M$223,SMALL(IF((Report!$G$5=Main!$P$3:$P$223),ROW(Main!$P$3:$P$223)-2),ROW(A16))),\"\")","v":"Shopping"}]
[{"$f":"IF(B24=\"\",\"\",SUBTOTAL(3,$B$8:B24))","v":17},{"$f":"IFERROR(INDEX(Main!$Z$3:$Z$223,SMALL(IF((Report!$G$5=Main!$P$3:$P$223),ROW(Main!$P$3:$P$223)-2),ROW(A17))),\"\")","v":1000074},{"$f":"IFERROR(INDEX(Main!$AD$3:$AD$223,SMALL(IF((Report!$G$5=Main!$P$3:$P$223),ROW(Main!$P$3:$P$223)-2),ROW(A17))),\"\")","v":0},null,{"$f":"IFERROR(INDEX(Main!$M$3:$M$223,SMALL(IF((Report!$G$5=Main!$P$3:$P$223),ROW(Main!$P$3:$P$223)-2),ROW(A17))),\"\")","v":"Shopping"}]
[{"$f":"IF(B25=\"\",\"\",SUBTOTAL(3,$B$8:B25))","v":18},{"$f":"IFERROR(INDEX(Main!$Z$3:$Z$223,SMALL(IF((Report!$G$5=Main!$P$3:$P$223),ROW(Main!$P$3:$P$223)-2),ROW(A18))),\"\")","v":1000075},{"$f":"IFERROR(INDEX(Main!$AD$3:$AD$223,SMALL(IF((Report!$G$5=Main!$P$3:$P$223),ROW(Main!$P$3:$P$223)-2),ROW(A18))),\"\")","v":70},null,{"$f":"IFERROR(INDEX(Main!$M$3:$M$223,SMALL(IF((Report!$G$5=Main!$P$3:$P$223),ROW(Main!$P$3:$P$223)-2),ROW(A18))),\"\")","v":0}]
[{"$f":"IF(B26=\"\",\"\",SUBTOTAL(3,$B$8:B26))","v":19},{"$f":"IFERROR(INDEX(Main!$Z$3:$Z$223,SMALL(IF((Report!$G$5=Main!$P$3:$P$223),ROW(Main!$P$3:$P$223)-2),ROW(A19))),\"\")","v":1000077},{"$f":"IFERROR(INDEX(Main!$AD$3:$AD$223,SMALL(IF((Report!$G$5=Main!$P$3:$P$223),ROW(Main!$P$3:$P$223)-2),ROW(A19))),\"\")","v":90},null,{"$f":"IFERROR(INDEX(Main!$M$3:$M$223,SMALL(IF((Report!$G$5=Main!$P$3:$P$223),ROW(Main!$P$3:$P$223)-2),ROW(A19))),\"\")","v":0}]
[{"$f":"IF(B27=\"\",\"\",SUBTOTAL(3,$B$8:B27))","v":20},{"$f":"IFERROR(INDEX(Main!$Z$3:$Z$223,SMALL(IF((Report!$G$5=Main!$P$3:$P$223),ROW(Main!$P$3:$P$223)-2),ROW(A20))),\"\")","v":1000078},{"$f":"IFERROR(INDEX(Main!$AD$3:$AD$223,SMALL(IF((Report!$G$5=Main!$P$3:$P$223),ROW(Main!$P$3:$P$223)-2),ROW(A20))),\"\")","v":200},null,{"$f":"IFERROR(INDEX(Main!$M$3:$M$223,SMALL(IF((Report!$G$5=Main!$P$3:$P$223),ROW(Main!$P$3:$P$223)-2),ROW(A20))),\"\")","v":0}]
[{"$f":"IF(B28=\"\",\"\",SUBTOTAL(3,$B$8:B28))","v":21},{"$f":"IFERROR(INDEX(Main!$Z$3:$Z$223,SMALL(IF((Report!$G$5=Main!$P$3:$P$223),ROW(Main!$P$3:$P$223)-2),ROW(A21))),\"\")","v":1000079},{"$f":"IFERROR(INDEX(Main!$AD$3:$AD$223,SMALL(IF((Report!$G$5=Main!$P$3:$P$223),ROW(Main!$P$3:$P$223)-2),ROW(A21))),\"\")","v":100},null,{"$f":"IFERROR(INDEX(Main!$M$3:$M$223,SMALL(IF((Report!$G$5=Main!$P$3:$P$223),ROW(Main!$P$3:$P$223)-2),ROW(A21))),\"\")","v":0}]
[{"$f":"IF(B29=\"\",\"\",SUBTOTAL(3,$B$8:B29))","v":22},{"$f":"IFERROR(INDEX(Main!$Z$3:$Z$223,SMALL(IF((Report!$G$5=Main!$P$3:$P$223),ROW(Main!$P$3:$P$223)-2),ROW(A22))),\"\")","v":1000080},{"$f":"IFERROR(INDEX(Main!$AD$3:$AD$223,SMALL(IF((Report!$G$5=Main!$P$3:$P$223),ROW(Main!$P$3:$P$223)-2),ROW(A22))),\"\")","v":60},null,{"$f":"IFERROR(INDEX(Main!$M$3:$M$223,SMALL(IF((Report!$G$5=Main!$P$3:$P$223),ROW(Main!$P$3:$P$223)-2),ROW(A22))),\"\")","v":0}]
[{"$f":"IF(B30=\"\",\"\",SUBTOTAL(3,$B$8:B30))","v":23},{"$f":"IFERROR(INDEX(Main!$Z$3:$Z$223,SMALL(IF((Report!$G$5=Main!$P$3:$P$223),ROW(Main!$P$3:$P$223)-2),ROW(A23))),\"\")","v":1000081},{"$f":"IFERROR(INDEX(Main!$AD$3:$AD$223,SMALL(IF((Report!$G$5=Main!$P$3:$P$223),ROW(Main!$P$3:$P$223)-2),ROW(A23))),\"\")","v":160},null,{"$f":"IFERROR(INDEX(Main!$M$3:$M$223,SMALL(IF((Report!$G$5=Main!$P$3:$P$223),ROW(Main!$P$3:$P$223)-2),ROW(A23))),\"\")","v":0}]
[{"$f":"IF(B31=\"\",\"\",SUBTOTAL(3,$B$8:B31))","v":24},{"$f":"IFERROR(INDEX(Main!$Z$3:$Z$223,SMALL(IF((Report!$G$5=Main!$P$3:$P$223),ROW(Main!$P$3:$P$223)-2),ROW(A24))),\"\")","v":1000082},{"$f":"IFERROR(INDEX(Main!$AD$3:$AD$223,SMALL(IF((Report!$G$5=Main!$P$3:$P$223),ROW(Main!$P$3:$P$223)-2),ROW(A24))),\"\")","v":0},null,{"$f":"IFERROR(INDEX(Main!$M$3:$M$223,SMALL(IF((Report!$G$5=Main!$P$3:$P$223),ROW(Main!$P$3:$P$223)-2),ROW(A24))),\"\")","v":"Shopping"}]
[{"$f":"IF(B32=\"\",\"\",SUBTOTAL(3,$B$8:B32))","v":25},{"$f":"IFERROR(INDEX(Main!$Z$3:$Z$223,SMALL(IF((Report!$G$5=Main!$P$3:$P$223),ROW(Main!$P$3:$P$223)-2),ROW(A25))),\"\")","v":1000083},{"$f":"IFERROR(INDEX(Main!$AD$3:$AD$223,SMALL(IF((Report!$G$5=Main!$P$3:$P$223),ROW(Main!$P$3:$P$223)-2),ROW(A25))),\"\")","v":80},null,{"$f":"IFERROR(INDEX(Main!$M$3:$M$223,SMALL(IF((Report!$G$5=Main!$P$3:$P$223),ROW(Main!$P$3:$P$223)-2),ROW(A25))),\"\")","v":0}]
[{"$f":"IF(B33=\"\",\"\",SUBTOTAL(3,$B$8:B33))","v":""},{"$f":"IFERROR(INDEX(Main!$Z$3:$Z$223,SMALL(IF((Report!$G$5=Main!$P$3:$P$223),ROW(Main!$P$3:$P$223)-2),ROW(A26))),\"\")","v":""},{"$f":"IFERROR(INDEX(Main!$AD$3:$AD$223,SMALL(IF((Report!$G$5=Main!$P$3:$P$223),ROW(Main!$P$3:$P$223)-2),ROW(A26))),\"\")","v":""},null,{"$f":"IFERROR(INDEX(Main!$M$3:$M$223,SMALL(IF((Report!$G$5=Main!$P$3:$P$223),ROW(Main!$P$3:$P$223)-2),ROW(A26))),\"\")","v":""}]
[{"$f":"IF(B34=\"\",\"\",SUBTOTAL(3,$B$8:B34))","v":""},{"$f":"IFERROR(INDEX(Main!$Z$3:$Z$223,SMALL(IF((Report!$G$5=Main!$P$3:$P$223),ROW(Main!$P$3:$P$223)-2),ROW(A27))),\"\")","v":""},{"$f":"IFERROR(INDEX(Main!$AD$3:$AD$223,SMALL(IF((Report!$G$5=Main!$P$3:$P$223),ROW(Main!$P$3:$P$223)-2),ROW(A27))),\"\")","v":""},null,{"$f":"IFERROR(INDEX(Main!$M$3:$M$223,SMALL(IF((Report!$G$5=Main!$P$3:$P$223),ROW(Main!$P$3:$P$223)-2),ROW(A27))),\"\")","v":""}]
[{"$f":"IF(B35=\"\",\"\",SUBTOTAL(3,$B$8:B35))","v":""},{"$f":"IFERROR(INDEX(Main!$Z$3:$Z$223,SMALL(IF((Report!$G$5=Main!$P$3:$P$223),ROW(Main!$P$3:$P$223)-2),ROW(A28))),\"\")","v":""},{"$f":"IFERROR(INDEX(Main!$AD$3:$AD$223,SMALL(IF((Report!$G$5=Main!$P$3:$P$223),ROW(Main!$P$3:$P$223)-2),ROW(A28))),\"\")","v":""},null,{"$f":"IFERROR(INDEX(Main!$M$3:$M$223,SMALL(IF((Report!$G$5=Main!$P$3:$P$223),ROW(Main!$P$3:$P$223)-2),ROW(A28))),\"\")","v":""}]
[{"$f":"IF(B36=\"\",\"\",SUBTOTAL(3,$B$8:B36))","v":""},{"$f":"IFERROR(INDEX(Main!$Z$3:$Z$223,SMALL(IF((Report!$G$5=Main!$P$3:$P$223),ROW(Main!$P$3:$P$223)-2),ROW(A29))),\"\")","v":""},{"$f":"IFERROR(INDEX(Main!$AD$3:$AD$223,SMALL(IF((Report!$G$5=Main!$P$3:$P$223),ROW(Main!$P$3:$P$223)-2),ROW(A29))),\"\")","v":""},null,{"$f":"IFERROR(INDEX(Main!$M$3:$M$223,SMALL(IF((Report!$G$5=Main!$P$3:$P$223),ROW(Main!$P$3:$P$223)-2),ROW(A29))),\"\")","v":""}]
[{"$f":"IF(B37=\"\",\"\",SUBTOTAL(3,$B$8:B37))","v":""},{"$f":"IFERROR(INDEX(Main!$Z$3:$Z$223,SMALL(IF((Report!$G$5=Main!$P$3:$P$223),ROW(Main!$P$3:$P$223)-2),ROW(A30))),\"\")","v":""},{"$f":"IFERROR(INDEX(Main!$AD$3:$AD$223,SMALL(IF((Report!$G$5=Main!$P$3:$P$223),ROW(Main!$P$3:$P$223)-2),ROW(A30))),\"\")","v":""},null,{"$f":"IFERROR(INDEX(Main!$M$3:$M$223,SMALL(IF((Report!$G$5=Main!$P$3:$P$223),ROW(Main!$P$3:$P$223)-2),ROW(A30))),\"\")","v":""}]
["Total :",null,{"$f":"SUM(C8:C37)","v":1690}]
[]
["Guide Signature :…………………………………………………………………………………………………….."]
{"$rows_left_out":205}