{"text_format":"1","workbook":"xlsx","n_sheets":3,"sheets":["Main","استعلام","Sheet1"],"not_rendered":{"charts":0,"images":0,"macros":1,"external_links":0,"defined_names":1,"comments":0,"pivot_tables":0},"unopened":[],"bounds":{"document_bytes":16777216,"sheet_cells":100000,"rows_first":2000,"rows_last":500,"rows_between":2000,"halvings":0,"cell_chars":16384,"cell_head_chars":4096},"cells_cut":0,"cells_raw":0,"read":"whole","date_system":"1900"}

{"sheet":"Main","index":0,"n_rows":11,"n_cols":9,"rows_kept":11,"cut":false,"hidden":false,"merged":[]}
["المسلسل","الاسم","جلوس 2020","الرقم القومى","الفرقة","فترة الامتحان","الساعة","رقم اللجنة","مكان اللجنة"]
[1,"اخلاص عبد الناصر احمد عبد الحليم",1,30202022602108,"الاولى اصول الدين","الفترة الصباحية","من 9 : 11",56,"مدرج السيدة فاطمة الزهراء الطابق الثانى"]
[2,"اروى ممدوح محمد عباس",2,30204262600563,"الاولى اصول الدين","الفترة الصباحية","من 9 : 11",56,"مدرج السيدة فاطمة الزهراء الطابق الثانى"]
[3,"اسراء الصافى احمد ابراهيم",3,30303182602423,"الاولى اصول الدين","الفترة الصباحية","من 9 : 11",56,"مدرج السيدة فاطمة الزهراء الطابق الثانى"]
[4,"اسراء عبد الناصر البدرى حافظ",4,30211042601042,"الاولى اصول الدين","الفترة الصباحية","من 9 : 11",56,"مدرج السيدة فاطمة الزهراء الطابق الثانى"]
[5,"اسراء محمد محمود ابراهيم",5,30210012614143,"الاولى اصول الدين","الفترة الصباحية","من 9 : 11",56,"مدرج السيدة فاطمة الزهراء الطابق الثانى"]
[6,"اسراء محمود عبد اللطيف احمد",6,30011152605265,"الاولى اصول الدين","الفترة الصباحية","من 9 : 11",56,"مدرج السيدة فاطمة الزهراء الطابق الثانى"]
[7,"اسماء اشرف اسماعيل محمد",7,30211011900041,"الاولى اصول الدين","الفترة الصباحية","من 9 : 11",56,"مدرج السيدة فاطمة الزهراء الطابق الثانى"]
[8,"اسماء حماده زكى عبد اللطيف",8,30201162601741,"الاولى اصول الدين","الفترة الصباحية","من 9 : 11",56,"مدرج السيدة فاطمة الزهراء الطابق الثانى"]
[9,"اسماء سيد حموده سنوسى",9,30112153200146,"الاولى اصول الدين","الفترة الصباحية","من 9 : 11",56,"مدرج السيدة فاطمة الزهراء الطابق الثانى"]
[10,"اسماء عاطف اسماعيل احمد",10,30207032601403,"الاولى اصول الدين","الفترة الصباحية","من 9 : 11",56,"مدرج السيدة فاطمة الزهراء الطابق الثانى"]

{"sheet":"استعلام","index":1,"n_rows":16,"n_cols":9,"rows_kept":16,"cut":false,"hidden":true,"merged":[[3,2,3,6],[7,2,7,6],[10,2,10,6],[12,2,12,6],[15,2,15,6]]}
[]
[]
[]
[null,null,"من فضلك إدخل الرقم القومى المكون من 14 رقم فى هذه الخانة ",null,null,null,null,null,30207032601403]
[]
[]
[]
[null,null,"رقم الجلوس",null,null,null,null,null,{"$f":"IFERROR(IF(I4<>\"\",VLOOKUP(I4,Main!D2:E11,3,FALSE),\"\"),\"غير موجود\")","v":"غير موجود"}]
[]
[]
[null,null,"رقم اللجنة"]
[]
[null,null,"مكان اللجنة"]
[]
[]
[null,null,"الفترة الامتحانية"]

{"sheet":"Sheet1","index":2,"n_rows":12,"n_cols":5,"rows_kept":12,"cut":false,"hidden":false,"merged":[]}
[]
[]
[30204262600563,null,null,"Choose Her"]
[]
[]
[null,null,"المسلسل","الاسم","جلوس 2020"]
[null,null,{"$f":"INDEX(Main!A$2:A$50,MATCH($A$3,Main!$D$2:$D$500,0))","v":2},{"$f":"INDEX(Main!B$2:B$50,MATCH($A$3,Main!$D$2:$D$500,0))","v":"اروى ممدوح محمد عباس"},{"$f":"INDEX(Main!C$2:C$50,MATCH($A$3,Main!$D$2:$D$500,0))","v":2}]
[]
[null,null,"الرقم القومى","الفرقة","فترة الامتحان"]
[null,null,{"$f":"INDEX(Main!D$2:D$50,MATCH($A$3,Main!$D$2:$D$500,0))","v":30204262600563},{"$f":"INDEX(Main!E$2:E$50,MATCH($A$3,Main!$D$2:$D$500,0))","v":"الاولى اصول الدين"},{"$f":"INDEX(Main!F$2:F$50,MATCH($A$3,Main!$D$2:$D$500,0))","v":"الفترة الصباحية"}]
[null,null,"الساعة","رقم اللجنة","مكان اللجنة"]
[null,null,{"$f":"INDEX(Main!G$2:G$50,MATCH($A$3,Main!$D$2:$D$500,0))","v":"من 9 : 11"},{"$f":"INDEX(Main!H$2:H$50,MATCH($A$3,Main!$D$2:$D$500,0))","v":56},{"$f":"INDEX(Main!I$2:I$50,MATCH($A$3,Main!$D$2:$D$500,0))","v":"مدرج السيدة فاطمة الزهراء الطابق الثانى"}]