{"text_format":"1","workbook":"xlsx","n_sheets":18,"sheets":["م الحضور ","التصفية","haneen","اسماء الكتاب النهائية ","ش حمادة","ش احمد","ش حجاج ","رامي","صالح","ش عبد الله","علي"," ش عمرو ","ام طلحة","ام عمر ","ام نسبية","ام عبيدة","تقي","ولاء"],"not_rendered":{"charts":0,"images":0,"macros":1,"external_links":0,"defined_names":4,"comments":0,"pivot_tables":0},"unopened":[],"bounds":{"document_bytes":16777216,"sheet_cells":100000,"rows_first":2000,"rows_last":500,"rows_between":2000,"halvings":0,"cell_chars":16384,"cell_head_chars":4096},"cells_cut":0,"cells_raw":0,"read":"whole","date_system":"1900"}

{"sheet":"م الحضور ","index":0,"n_rows":33,"n_cols":28,"rows_kept":33,"cut":false,"hidden":false,"merged":[[2,12,2,16],[2,2,2,6],[2,22,2,26],[0,0,0,27],[1,0,1,27],[2,17,2,21],[2,0,2,1],[2,7,2,11]]}
["بسم الله الرحمن الرحيم "]
["كشف بالاسماء لكل مُحفّظ / مُحفّظة "]
["الأسبوع",null,"الأسبوع الأول",null,null,null,null,"الأسبوع الثاني",null,null,null,null,"الأسبوع الثالث",null,null,null,null,"الأسبوع الرابع",null,null,null,null,"الأسبوع الخامس"]
[null,null,"السبت","الأحد","الاثنين","الثلاثاء","الأربعاء","السبت","الأحد","الاثنين","الثلاثاء","الأربعاء","السبت","الأحد","الاثنين","الثلاثاء","الأربعاء","السبت","الأحد","الاثنين","الثلاثاء","الأربعاء","السبت","الأحد","الاثنين","الثلاثاء","الأربعاء"]
["م","ألأسم","حضور/ غياب","حضور/ غياب","حضور/ غياب","حضور/ غياب","حضور/ غياب","حضور/ غياب","حضور/ غياب","حضور/ غياب","حضور/ غياب","حضور/ غياب","حضور/ غياب","حضور/ غياب","حضور/ غياب","حضور/ غياب","حضور/ غياب","حضور/ غياب","حضور/ غياب","حضور/ غياب","حضور/ غياب","حضور/ غياب","حضور/ غياب","حضور/ غياب","حضور/ غياب","حضور/ غياب","حضور/ غياب","ملاحظات / ( أذن )"]
[1]
[2]
[3]
[4]
[5]
{"$rows_left_out":24}
{"sheet":"التصفية","index":1,"n_rows":56,"n_cols":7,"rows_kept":56,"cut":false,"hidden":false,"merged":[[0,2,0,5]]}
[null,null,"التصفية"]
["م","الاسم","غائب","العمر ","طالب/\nطالبة","رقم التليفون","مُحفّظ /\n مُحفّظة "]
[1,"منسة نادي",null,null,"طالبة",null,"ام عمار"]
[2,"محمد حمدي احمد","غائب",null,"طالب ",null,"حمادة"]
[3,"يمني علاء فتحي","غائب",null,"طالبة",null,"حجاج"]
[4,"حازم سامح عبد الله","غائب",null,"طالب ",null,"حجاج"]
[5,"مصطفي محمد","غائب",null,"طالب ",null,"حجاج"]
[6,"عبدالرحمن ربيع عمار ",null,null,"طالب",null,"الشيخ حسين "]
[7,"محمد عبدالدايم عبدالواحد ",null,null,"طالب",null,"الشيخ حسين "]
[8,"حبيبة محمد فرج",null,null,"طالبة",null,"ام طلحة"]
{"$rows_left_out":47}
{"sheet":"haneen","index":2,"n_rows":34,"n_cols":26,"rows_kept":34,"cut":false,"hidden":false,"merged":[[3,14,4,14],[3,15,4,15],[3,9,3,10],[3,4,3,5],[0,0,0,16],[3,1,4,1],[3,2,4,2],[3,12,4,12],[3,16,4,16],[3,7,4,7],[3,3,4,3],[3,8,4,8],[3,0,4,0],[3,13,4,13],[3,6,4,6],[3,11,4,11],[2,11,2,13],[33,3,33,4],[33,9,33,10],[30,9,30,10],[31,3,31,4],[31,9,31,10]]}
["مكتب تحفيظ القرآن الكريم بمسجد خلوصي "]
[null,"     إستمارة متابعة لشهر / ",null,"مارس",null,null,null,1,"عام / 2021",null,"أسم الحلقة/",{"$f":"VLOOKUP(H2,'اسماء الكتاب النهائية '!A:F,5,0)","v":"عثمان بن عفان"},null,null,null,null,null,null,null,null,null,null,null,null,null,{"$f":"COUNTA('اسماء الكتاب النهائية '!$A$3:$A$1034)-1","v":338}]
[null,"    اسم الطالب / ",{"$f":"VLOOKUP(H2,'اسماء الكتاب النهائية '!A:F,2,0)","v":"محمد محسن عبد التواب"},null,null,null,null,null,null,"المُحفّظ / المُحفّظة / ",null,{"$f":"VLOOKUP(H2,'اسماء الكتاب النهائية '!A:F,6,0)","v":" الشيخ حمادة"}]
["م","الأيـــام","التاريخ","السورة","مراجعة",null,"عدد ايآت المراجعة","المستوى","السورة","حـفـظ",null,"عدد ايآت الحفظ","المستوى","حضور","الصلاوات الخمس","اذكار الصياح والمساء ","ملاحظات"]
[null,null,null,null,"من الآية","إلى الآية",null,null,null,"من الآية","إلى الآية"]
[1,"السبت"]
[2,"الأحد"]
[3,"الاثنين","2021-03-01",null,null,null,null,null," "]
[4,"الثلاثاء","2021-03-02"]
[5,"الأربعاء","2021-03-03"]
{"$rows_left_out":25}
{"sheet":"اسماء الكتاب النهائية ","index":3,"n_rows":341,"n_cols":6,"rows_kept":341,"cut":false,"hidden":false,"merged":[[0,1,0,5]]}
[null,"أسماء طلاب وطالبات مكتب تحفيظ القرآن الكريم بمسجد خلوصي "]
["م","الاسم","طالب/\nطالبة","طريقة الحفظ","أسم الحلقة/","مُحفّظ /\n مُحفّظة "]
[1,"محمد محسن عبد التواب","طالب","عدد الآيات","عثمان بن عفان"," الشيخ حمادة"]
[2,"محمد رحومة جودة","طالب","عدد الآيات","عثمان بن عفان"," الشيخ حمادة"]
[3,"محمود سالم عبد ربة","طالب","عدد الآيات","عثمان بن عفان"," الشيخ حمادة"]
[4,"حازم معوض شحات","طالب","عدد الآيات","عثمان بن عفان"," الشيخ حمادة"]
[5,"محمد ممدوح محمود","طالب","عدد الآيات","عثمان بن عفان"," الشيخ حمادة"]
[6,"يوسف رمضان عبد الله","طالب","عدد الآيات","عثمان بن عفان"," الشيخ حمادة"]
[7,"رامي هاني كامل","طالب","عدد الآيات","عثمان بن عفان"," الشيخ حمادة"]
[8,"احمد عبد الوهاب فوزي","طالب","عدد الآيات","عثمان بن عفان"," الشيخ حمادة"]
{"$rows_left_out":332}
{"sheet":"ش حمادة","index":4,"n_rows":33,"n_cols":30,"rows_kept":33,"cut":false,"hidden":false,"merged":[[3,27,4,27],[3,28,4,28],[1,3,1,4],[0,0,0,29],[2,0,2,1],[2,2,2,6],[2,7,2,11],[2,12,2,16],[2,17,2,21],[2,22,2,26]]}
[" مكتب تحفيظ القرآن الكريم بمسجد خلوصي "]
["شهر ","فبراير",null,2021,null,null,null,null,"كشف بالاسماء لكل مُحفّظ / الشيخ حمادة",null,null,null,null,null,null,null,null,"اسم الحلقة /",null,null,null,"عثمان بن عفان"]
["الأسبوع",null,"الأسبوع الأول",null,null,null,null,"الأسبوع الثاني",null,null,null,null,"الأسبوع الثالث",null,null,null,null,"الأسبوع الرابع",null,null,null,null,"الأسبوع الخامس"]
[null,null,"السبت","الأحد","الاثنين","الثلاثاء","الأربعاء","السبت","الأحد","الاثنين","الثلاثاء","الأربعاء","السبت","الأحد","الاثنين","الثلاثاء","الأربعاء","السبت","الأحد","الاثنين","الثلاثاء","الأربعاء","السبت","الأحد","الاثنين","الثلاثاء","الأربعاء","الصلاوات الخمس","اذكار الصياح والمساء "]
["م","ألأسم","حضور/ غياب","حضور/ غياب","حضور/ غياب","حضور/ غياب","حضور/ غياب","حضور/ غياب","حضور/ غياب","حضور/ غياب","حضور/ غياب","حضور/ غياب","حضور/ غياب","حضور/ غياب","حضور/ غياب","حضور/ غياب","حضور/ غياب","حضور/ غياب","حضور/ غياب","حضور/ غياب","حضور/ غياب","حضور/ غياب","حضور/ غياب","حضور/ غياب","حضور/ غياب","حضور/ غياب","حضور/ غياب",null,null,"ملاحظات\n / ( أذن )"]
[1,"محمد محسن عبد التواب"]
[2,"محمد رحومة جودة"]
[3,"محمود سالم عبد ربة"]
[4,"حازم معوض شحات"]
[5,"محمد ممدوح محمود"]
{"$rows_left_out":24}
{"sheet":"ش احمد","index":5,"n_rows":33,"n_cols":30,"rows_kept":33,"cut":false,"hidden":false,"merged":[[3,27,4,27],[3,28,4,28],[1,3,1,4],[0,0,0,29],[2,0,2,1],[2,2,2,6],[2,7,2,11],[2,12,2,16],[2,17,2,21],[2,22,2,26]]}
[" مكتب تحفيظ القرآن الكريم بمسجد خلوصي "]
["شهر ","فبراير",null,2021,null,null,null,null,"كشف بالاسماء لكل مُحفّظ / الشيخ أحمد",null,null,null,null,null,null,null,"اسم الحلقة /",null,null,null,"سعد بن أبي وقاص"]
["الأسبوع",null,"الأسبوع الأول",null,null,null,null,"الأسبوع الثاني",null,null,null,null,"الأسبوع الثالث",null,null,null,null,"الأسبوع الرابع",null,null,null,null,"الأسبوع الخامس"]
[null,null,"السبت","الأحد","الاثنين","الثلاثاء","الأربعاء","السبت","الأحد","الاثنين","الثلاثاء","الأربعاء","السبت","الأحد","الاثنين","الثلاثاء","الأربعاء","السبت","الأحد","الاثنين","الثلاثاء","الأربعاء","السبت","الأحد","الاثنين","الثلاثاء","الأربعاء","الصلاوات الخمس","اذكار الصياح والمساء "]
["م","ألأسم","حضور/ غياب","حضور/ غياب","حضور/ غياب","حضور/ غياب","حضور/ غياب","حضور/ غياب","حضور/ غياب","حضور/ غياب","حضور/ غياب","حضور/ غياب","حضور/ غياب","حضور/ غياب","حضور/ غياب","حضور/ غياب","حضور/ غياب","حضور/ غياب","حضور/ غياب","حضور/ غياب","حضور/ غياب","حضور/ غياب","حضور/ غياب","حضور/ غياب","حضور/ غياب","حضور/ غياب","حضور/ غياب",null,null,"ملاحظات\n / ( أذن )"]
[1,"انس وجية فتحي"]
[2,"عبد الرحمن محمد حفني "]
[3,"احمد ربيع رمضان محمد"]
[4,"احمد ابراهيم احمد محمود"]
[5,"معتصم سعيد حمدي "]
{"$rows_left_out":24}
{"sheet":"ش حجاج ","index":6,"n_rows":33,"n_cols":30,"rows_kept":33,"cut":false,"hidden":false,"merged":[[3,27,4,27],[3,28,4,28],[1,3,1,4],[0,0,0,29],[2,0,2,1],[2,2,2,6],[2,7,2,11],[2,12,2,16],[2,17,2,21],[2,22,2,26]]}
[" مكتب تحفيظ القرآن الكريم بمسجد خلوصي "]
["شهر ","فبراير",null,2021,null,null,null,null,"كشف بالاسماء لكل مُحفّظ / الشيخ حجاج",null,null,null,null,null,null,null,"اسم الحلقة /",null,null,null,null,"عمر بن الخطاب"]
["الأسبوع",null,"الأسبوع الأول",null,null,null,null,"الأسبوع الثاني",null,null,null,null,"الأسبوع الثالث",null,null,null,null,"الأسبوع الرابع",null,null,null,null,"الأسبوع الخامس"]
[null,null,"السبت","الأحد","الاثنين","الثلاثاء","الأربعاء","السبت","الأحد","الاثنين","الثلاثاء","الأربعاء","السبت","الأحد","الاثنين","الثلاثاء","الأربعاء","السبت","الأحد","الاثنين","الثلاثاء","الأربعاء","السبت","الأحد","الاثنين","الثلاثاء","الأربعاء","الصلاوات الخمس","اذكار الصياح والمساء "]
["م","ألأسم","حضور/ غياب","حضور/ غياب","حضور/ غياب","حضور/ غياب","حضور/ غياب","حضور/ غياب","حضور/ غياب","حضور/ غياب","حضور/ غياب","حضور/ غياب","حضور/ غياب","حضور/ غياب","حضور/ غياب","حضور/ غياب","حضور/ غياب","حضور/ غياب","حضور/ غياب","حضور/ غياب","حضور/ غياب","حضور/ غياب","حضور/ غياب","حضور/ غياب","حضور/ غياب","حضور/ غياب","حضور/ غياب",null,null,"ملاحظات \n/ ( أذن )"]
[1,"حمادة علي عبد الجواد"]
[2,"معاذ احمد ثابت"]
[3,"محمود علاء عبد التواب"]
[4,"يوسف ربيع فوزي"]
[5,"محمد هاني الهم"]
{"$rows_left_out":24}
{"sheet":"رامي","index":7,"n_rows":33,"n_cols":30,"rows_kept":33,"cut":false,"hidden":false,"merged":[[3,27,4,27],[3,28,4,28],[0,0,0,29],[1,3,1,4],[2,0,2,1],[2,2,2,6],[2,7,2,11],[2,12,2,16],[2,17,2,21],[2,22,2,26]]}
[" مكتب تحفيظ القرآن الكريم بمسجد خلوصي "]
["شهر ","فبراير",null,2021,null,null,null,null,"كشف بالاسماء لكل مُحفّظ /  الشيخ رامي",null,null,null,null,null,null,null,null,"اسم الحلقة /",null,null,"صلاح الدين"]
["الأسبوع",null,"الأسبوع الأول",null,null,null,null,"الأسبوع الثاني",null,null,null,null,"الأسبوع الثالث",null,null,null,null,"الأسبوع الرابع",null,null,null,null,"الأسبوع الخامس"]
[null,null,"السبت","الأحد","الاثنين","الثلاثاء","الأربعاء","السبت","الأحد","الاثنين","الثلاثاء","الأربعاء","السبت","الأحد","الاثنين","الثلاثاء","الأربعاء","السبت","الأحد","الاثنين","الثلاثاء","الأربعاء","السبت","الأحد","الاثنين","الثلاثاء","الأربعاء","الصلاوات الخمس","اذكار الصياح والمساء "]
["م","ألأسم","حضور/ غياب","حضور/ غياب","حضور/ غياب","حضور/ غياب","حضور/ غياب","حضور/ غياب","حضور/ غياب","حضور/ غياب","حضور/ غياب","حضور/ غياب","حضور/ غياب","حضور/ غياب","حضور/ غياب","حضور/ غياب","حضور/ غياب","حضور/ غياب","حضور/ غياب","حضور/ غياب","حضور/ غياب","حضور/ غياب","حضور/ غياب","حضور/ غياب","حضور/ غياب","حضور/ غياب","حضور/ غياب",null,null,"ملاحظات \n/ ( أذن )"]
[1,"مصطفي سعيد محمد قرني"]
[2,"طة علي مصطفي ايوب"]
[3,"حذيفة محسن عبد الحميد "]
[4,"احمد عبد الله ضيف سعيد"]
[5,"يوسف محمد عبد الرازق "]
{"$rows_left_out":24}
{"sheet":"صالح","index":8,"n_rows":33,"n_cols":30,"rows_kept":33,"cut":false,"hidden":false,"merged":[[3,26,4,26],[3,27,4,27],[0,0,0,29],[1,3,1,4],[2,0,2,1],[2,2,2,6],[2,7,2,11],[2,12,2,16],[2,17,2,21],[2,22,2,28]]}
[" مكتب تحفيظ القرآن الكريم بمسجد خلوصي "]
["شهر ","فبراير",null,2021,null,null,null,null,"كشف بالاسماء لكل مُحفّظ / الشيخ / صالح",null,null,null,null,null,null,null,null,"اسم الحلقة /",null,null,null,"حمزة بن عبد المطلب"]
["الأسبوع",null,"الأسبوع الأول",null,null,null,null,"الأسبوع الثاني",null,null,null,null,"الأسبوع الثالث",null,null,null,null,"الأسبوع الرابع",null,null,null,null,"الأسبوع الخامس"]
[null,null,"السبت","الأحد","الاثنين","الثلاثاء","الأربعاء","السبت","الأحد","الاثنين","الثلاثاء","الأربعاء","السبت","الأحد","الاثنين","الثلاثاء","الأربعاء","السبت","الأحد","الاثنين","الثلاثاء","الأربعاء","السبت","الأحد","الاثنين","الثلاثاء","الصلاوات الخمس","اذكار الصياح والمساء ","الأربعاء"]
["م","ألأسم","حضور/ غياب","حضور/ غياب","حضور/ غياب","حضور/ غياب","حضور/ غياب","حضور/ غياب","حضور/ غياب","حضور/ غياب","حضور/ غياب","حضور/ غياب","حضور/ غياب","حضور/ غياب","حضور/ غياب","حضور/ غياب","حضور/ غياب","حضور/ غياب","حضور/ غياب","حضور/ غياب","حضور/ غياب","حضور/ غياب","حضور/ غياب","حضور/ غياب","حضور/ غياب","حضور/ غياب",null,null,"حضور/ غياب","ملاحظات \n/ ( أذن )"]
[1,"سيف محمد خميس"]
[2,"يوسف حمادة احمد"]
[3,"عبدالله محمد خميس"]
[4,"احمد حمدي غلاب"]
[5,"محمد حمدي غلاب"]
{"$rows_left_out":24}
{"sheet":"ش عبد الله","index":9,"n_rows":33,"n_cols":30,"rows_kept":33,"cut":false,"hidden":false,"merged":[[3,27,4,27],[3,28,4,28],[0,0,0,29],[2,0,2,1],[2,2,2,6],[2,7,2,11],[2,12,2,16],[2,17,2,21],[2,22,2,26],[1,3,1,4]]}
[" مكتب تحفيظ القرآن الكريم بمسجد خلوصي "]
["شهر ","فبراير",null,2021,null,null,null,"كشف بالاسماء لكل مُحفّظ / الشيخ عبد الله شعبان",null,null,null,null,null,null,null,null,null,null,"اسم الحلقة /",null,null,null,null,"علي بن أبي طالب"]
["الأسبوع",null,"الأسبوع الأول",null,null,null,null,"الأسبوع الثاني",null,null,null,null,"الأسبوع الثالث",null,null,null,null,"الأسبوع الرابع",null,null,null,null,"الأسبوع الخامس"]
[null,null,"السبت","الأحد","الاثنين","الثلاثاء","الأربعاء","السبت","الأحد","الاثنين","الثلاثاء","الأربعاء","السبت","الأحد","الاثنين","الثلاثاء","الأربعاء","السبت","الأحد","الاثنين","الثلاثاء","الأربعاء","السبت","الأحد","الاثنين","الثلاثاء","الأربعاء","الصلاوات الخمس","اذكار الصياح والمساء "]
["م","ألأسم","حضور/ غياب","حضور/ غياب","حضور/ غياب","حضور/ غياب","حضور/ غياب","حضور/ غياب","حضور/ غياب","حضور/ غياب","حضور/ غياب","حضور/ غياب","حضور/ غياب","حضور/ غياب","حضور/ غياب","حضور/ غياب","حضور/ غياب","حضور/ غياب","حضور/ غياب","حضور/ غياب","حضور/ غياب","حضور/ غياب","حضور/ غياب","حضور/ غياب","حضور/ غياب","حضور/ غياب","حضور/ غياب",null,null,"ملاحظات \n/ ( أذن )"]
[1,"عمرو ياسر علي"]
[2,"عمار ياسر علي"]
[3,"مصطفي ياسر مصطفي "]
[4,"محمود فتوح محمود "]
[5,"بدر محمد قرني "]
{"$rows_left_out":24}
{"sheet":"علي","index":10,"n_rows":33,"n_cols":30,"rows_kept":33,"cut":false,"hidden":false,"merged":[[3,27,4,27],[3,28,4,28],[0,0,0,29],[1,3,1,4],[2,0,2,1],[2,2,2,6],[2,7,2,11],[2,12,2,16],[2,17,2,21],[2,22,2,26]]}
[" مكتب تحفيظ القرآن الكريم بمسجد خلوصي "]
["شهر ","فبراير",null,2021,null,null,null,null,"كشف بالاسماء لكل مُحفّظ /  الشيخ علي",null,null,null,null,null,null,null,null,"اسم الحلقة /",null,null,null,null,"مصعب بن عمير"]
["الأسبوع",null,"الأسبوع الأول",null,null,null,null,"الأسبوع الثاني",null,null,null,null,"الأسبوع الثالث",null,null,null,null,"الأسبوع الرابع",null,null,null,null,"الأسبوع الخامس"]
[null,null,"السبت","الأحد","الاثنين","الثلاثاء","الأربعاء","السبت","الأحد","الاثنين","الثلاثاء","الأربعاء","السبت","الأحد","الاثنين","الثلاثاء","الأربعاء","السبت","الأحد","الاثنين","الثلاثاء","الأربعاء","السبت","الأحد","الاثنين","الثلاثاء","الأربعاء","الصلاوات الخمس","اذكار الصياح والمساء "]
["م","ألأسم","حضور/ غياب","حضور/ غياب","حضور/ غياب","حضور/ غياب","حضور/ غياب","حضور/ غياب","حضور/ غياب","حضور/ غياب","حضور/ غياب","حضور/ غياب","حضور/ غياب","حضور/ غياب","حضور/ غياب","حضور/ غياب","حضور/ غياب","حضور/ غياب","حضور/ غياب","حضور/ غياب","حضور/ غياب","حضور/ غياب","حضور/ غياب","حضور/ غياب","حضور/ غياب","حضور/ غياب","حضور/ غياب",null,null,"ملاحظات\n / ( أذن )"]
[1,"محمد سامح محمود"]
[2,"انس محمد عيد"]
[3,"يوسف جمعة احمد"]
[4,"انس جمعة محمد"]
[5,"عبد الرحمن جمعة محمد"]
{"$rows_left_out":24}
{"sheet":" ش عمرو ","index":11,"n_rows":33,"n_cols":30,"rows_kept":33,"cut":false,"hidden":false,"merged":[[3,27,4,27],[3,28,4,28],[0,0,0,29],[1,3,1,4],[2,0,2,1],[2,2,2,6],[2,7,2,11],[2,12,2,16],[2,17,2,21],[2,22,2,26]]}
[" مكتب تحفيظ القرآن الكريم بمسجد خلوصي "]
["شهر ","فبراير",null,2021,null,null,null,null,"كشف بالاسماء لكل مُحفّظ / الشيخ / عمرو",null,null,null,null,null,null,null,null,"اسم الحلقة /",null,null,null,null,"عبد الرّحمن بن عوف"]
["الأسبوع",null,"الأسبوع الأول",null,null,null,null,"الأسبوع الثاني",null,null,null,null,"الأسبوع الثالث",null,null,null,null,"الأسبوع الرابع",null,null,null,null,"الأسبوع الخامس"]
[null,null,"السبت","الأحد","الاثنين","الثلاثاء","الأربعاء","السبت","الأحد","الاثنين","الثلاثاء","الأربعاء","السبت","الأحد","الاثنين","الثلاثاء","الأربعاء","السبت","الأحد","الاثنين","الثلاثاء","الأربعاء","السبت","الأحد","الاثنين","الثلاثاء","الأربعاء","الصلاوات الخمس","اذكار الصياح والمساء "]
["م","ألأسم","حضور/ غياب","حضور/ غياب","حضور/ غياب","حضور/ غياب","حضور/ غياب","حضور/ غياب","حضور/ غياب","حضور/ غياب","حضور/ غياب","حضور/ غياب","حضور/ غياب","حضور/ غياب","حضور/ غياب","حضور/ غياب","حضور/ غياب","حضور/ غياب","حضور/ غياب","حضور/ غياب","حضور/ غياب","حضور/ غياب","حضور/ غياب","حضور/ غياب","حضور/ غياب","حضور/ غياب","حضور/ غياب",null,null,"ملاحظات \n/ ( أذن )"]
[1,"محمد شعبان عبد الله"]
[2,"احمد محمود حسين"]
[3,"محمود عبد الله عبد العليم"]
[4,"عمر محمود حسين"]
[5,"محمد حامد محمود"]
{"$rows_left_out":24}
{"sheet":"ام طلحة","index":12,"n_rows":33,"n_cols":30,"rows_kept":33,"cut":false,"hidden":false,"merged":[[3,27,4,27],[3,28,4,28],[0,0,0,29],[2,0,2,1],[2,2,2,6],[2,7,2,11],[2,12,2,16],[2,17,2,21],[2,22,2,26],[1,3,1,4]]}
[" مكتب تحفيظ القرآن الكريم بمسجد خلوصي "]
["شهر ","فبراير",null,2021,null,null,null,null,"كشف بالاسماء لكل مُحفّظة / ام طلحة",null,null,null,null,null,null,null,"اسم الحلقة /",null,null,null,"طلحة بن عبيد الله"]
["الأسبوع",null,"الأسبوع الأول",null,null,null,null,"الأسبوع الثاني",null,null,null,null,"الأسبوع الثالث",null,null,null,null,"الأسبوع الرابع",null,null,null,null,"الأسبوع الخامس"]
[null,null,"السبت","الأحد","الاثنين","الثلاثاء","الأربعاء","السبت","الأحد","الاثنين","الثلاثاء","الأربعاء","السبت","الأحد","الاثنين","الثلاثاء","الأربعاء","السبت","الأحد","الاثنين","الثلاثاء","الأربعاء","السبت","الأحد","الاثنين","الثلاثاء","الأربعاء","الصلاوات الخمس","اذكار الصياح والمساء "]
["م","ألأسم","حضور/ غياب","حضور/ غياب","حضور/ غياب","حضور/ غياب","حضور/ غياب","حضور/ غياب","حضور/ غياب","حضور/ غياب","حضور/ غياب","حضور/ غياب","حضور/ غياب","حضور/ غياب","حضور/ غياب","حضور/ غياب","حضور/ غياب","حضور/ غياب","حضور/ غياب","حضور/ غياب","حضور/ غياب","حضور/ غياب","حضور/ غياب","حضور/ غياب","حضور/ غياب","حضور/ غياب","حضور/ غياب",null,null,"ملاحظات\n / ( أذن )"]
[1,"اية صبحي قرني حجاج"]
[2,"عائشة عامر عبد الله احمد"]
[3,"جنا محسن سيد عبدالباقي"]
[4,"امنة شعبان محمد عبد العال"]
[5,"ريهام تامر بخيت حميدة"]
{"$rows_left_out":24}
{"sheet":"ام عمر ","index":13,"n_rows":34,"n_cols":30,"rows_kept":34,"cut":false,"hidden":false,"merged":[[3,27,4,27],[3,28,4,28],[0,0,0,29],[1,3,1,4],[2,0,2,1],[2,2,2,6],[2,7,2,11],[2,12,2,16],[2,17,2,21],[2,22,2,26]]}
[" مكتب تحفيظ القرآن الكريم بمسجد خلوصي "]
["شهر ","فبراير",null,2021,null,null,null,null,"كشف بالاسماء لكل مُحفّظة / ام عمر",null,null,null,null,null,null,null,null,"اسم الحلقة /",null,null,"معاذ بن جبل"]
["الأسبوع",null,"الأسبوع الأول",null,null,null,null,"الأسبوع الثاني",null,null,null,null,"الأسبوع الثالث",null,null,null,null,"الأسبوع الرابع",null,null,null,null,"الأسبوع الخامس"]
[null,null,"السبت","الأحد","الاثنين","الثلاثاء","الأربعاء","السبت","الأحد","الاثنين","الثلاثاء","الأربعاء","السبت","الأحد","الاثنين","الثلاثاء","الأربعاء","السبت","الأحد","الاثنين","الثلاثاء","الأربعاء","السبت","الأحد","الاثنين","الثلاثاء","الأربعاء","الصلاوات الخمس","اذكار الصياح والمساء "]
["م","ألأسم","حضور/ غياب","حضور/ غياب","حضور/ غياب","حضور/ غياب","حضور/ غياب","حضور/ غياب","حضور/ غياب","حضور/ غياب","حضور/ غياب","حضور/ غياب","حضور/ غياب","حضور/ غياب","حضور/ غياب","حضور/ غياب","حضور/ غياب","حضور/ غياب","حضور/ غياب","حضور/ غياب","حضور/ غياب","حضور/ غياب","حضور/ غياب","حضور/ غياب","حضور/ غياب","حضور/ غياب","حضور/ غياب",null,null,"ملاحظات\n / ( أذن )"]
[1,"اسماء عمرو محمد"]
[2,"نورهان معتوق جمعة"]
[3,"خلود حسب الله عبد الصادق"]
[4,"سارة علي حسين "]
[5,"رضوي حمادة جاب الله "]
{"$rows_left_out":25}
{"sheet":"ام نسبية","index":14,"n_rows":33,"n_cols":30,"rows_kept":33,"cut":false,"hidden":false,"merged":[[3,27,4,27],[3,28,4,28],[0,0,0,29],[1,3,1,4],[2,0,2,1],[2,2,2,6],[2,7,2,11],[2,12,2,16],[2,17,2,21],[2,22,2,26]]}
[" مكتب تحفيظ القرآن الكريم بمسجد خلوصي "]
["شهر ","فبراير",null,2021,null,null,null,null,"كشف بالاسماء لكل مُحفّظة / ام نسيبة",null,null,null,null,null,null,null,null,"اسم الحلقة /",null,null,"أبو عبيدة بن الجراح"]
["الأسبوع",null,"الأسبوع الأول",null,null,null,null,"الأسبوع الثاني",null,null,null,null,"الأسبوع الثالث",null,null,null,null,"الأسبوع الرابع",null,null,null,null,"الأسبوع الخامس"]
[null,null,"السبت","الأحد","الاثنين","الثلاثاء","الأربعاء","السبت","الأحد","الاثنين","الثلاثاء","الأربعاء","السبت","الأحد","الاثنين","الثلاثاء","الأربعاء","السبت","الأحد","الاثنين","الثلاثاء","الأربعاء","السبت","الأحد","الاثنين","الثلاثاء","الأربعاء","الصلاوات الخمس","اذكار الصياح والمساء "]
["م","ألأسم","حضور/ غياب","حضور/ غياب","حضور/ غياب","حضور/ غياب","حضور/ غياب","حضور/ غياب","حضور/ غياب","حضور/ غياب","حضور/ غياب","حضور/ غياب","حضور/ غياب","حضور/ غياب","حضور/ غياب","حضور/ غياب","حضور/ غياب","حضور/ غياب","حضور/ غياب","حضور/ غياب","حضور/ غياب","حضور/ غياب","حضور/ غياب","حضور/ غياب","حضور/ غياب","حضور/ غياب","حضور/ غياب",null,null,"ملاحظات /\n ( أذن )"]
[1,"يارا محروس سيد عبدالباقي"]
[2,"مريم عيد عبد الله محمد"]
[3,"بسمله ماهر محمد سيد"]
[4,"فاطمة محمد خميس "]
[5,"هاجر مسعد عبدالرازق رشوان"]
{"$rows_left_out":24}
{"sheet":"ام عبيدة","index":15,"n_rows":33,"n_cols":30,"rows_kept":33,"cut":false,"hidden":false,"merged":[[3,27,4,27],[3,28,4,28],[0,0,0,29],[1,3,1,4],[2,0,2,1],[2,2,2,6],[2,7,2,11],[2,12,2,16],[2,17,2,21],[2,22,2,26]]}
[" مكتب تحفيظ القرآن الكريم بمسجد خلوصي "]
["شهر ","فبراير",null,2021,null,null,null,null,"كشف بالاسماء لكل مُحفّظ / ام عبيدة",null,null,null,null,null,null,null,null,"اسم الحلقة /",null,null,"عمرو بن العاص"]
["الأسبوع",null,"الأسبوع الأول",null,null,null,null,"الأسبوع الثاني",null,null,null,null,"الأسبوع الثالث",null,null,null,null,"الأسبوع الرابع",null,null,null,null,"الأسبوع الخامس"]
[null,null,"السبت","الأحد","الاثنين","الثلاثاء","الأربعاء","السبت","الأحد","الاثنين","الثلاثاء","الأربعاء","السبت","الأحد","الاثنين","الثلاثاء","الأربعاء","السبت","الأحد","الاثنين","الثلاثاء","الأربعاء","السبت","الأحد","الاثنين","الثلاثاء","الأربعاء","الصلاوات الخمس","اذكار الصياح والمساء "]
["م","ألأسم","حضور/ غياب","حضور/ غياب","حضور/ غياب","حضور/ غياب","حضور/ غياب","حضور/ غياب","حضور/ غياب","حضور/ غياب","حضور/ غياب","حضور/ غياب","حضور/ غياب","حضور/ غياب","حضور/ غياب","حضور/ غياب","حضور/ غياب","حضور/ غياب","حضور/ غياب","حضور/ غياب","حضور/ غياب","حضور/ غياب","حضور/ غياب","حضور/ غياب","حضور/ غياب","حضور/ غياب","حضور/ غياب",null,null,"ملاحظات\n / ( أذن )"]
[1,"ياسمين محروس يس"]
[2,"يمني هاني محمد"]
[3,"شاهيناز هاني محمد"]
[4,"ايمان احمد سعد"]
[5,"شروق مصطفي سعيد"]
{"$rows_left_out":24}
{"sheet":"تقي","index":16,"n_rows":33,"n_cols":30,"rows_kept":33,"cut":false,"hidden":false,"merged":[[3,27,4,27],[3,28,4,28],[0,0,0,29],[1,3,1,4],[2,0,2,1],[2,2,2,6],[2,7,2,11],[2,12,2,16],[2,17,2,21],[2,22,2,26]]}
[" مكتب تحفيظ القرآن الكريم بمسجد خلوصي "]
["شهر ","فبراير",null,2021,null,null,null,null,"كشف بالاسماء لكل مُحفّظة / تقي",null,null,null,null,null,null,"اسم الحلقة /",null,null,null,null,null,"حفصة بنت عمر بن الخطّاب "]
["الأسبوع",null,"الأسبوع الأول",null,null,null,null,"الأسبوع الثاني",null,null,null,null,"الأسبوع الثالث",null,null,null,null,"الأسبوع الرابع",null,null,null,null,"الأسبوع الخامس"]
[null,null,"السبت","الأحد","الاثنين","الثلاثاء","الأربعاء","السبت","الأحد","الاثنين","الثلاثاء","الأربعاء","السبت","الأحد","الاثنين","الثلاثاء","الأربعاء","السبت","الأحد","الاثنين","الثلاثاء","الأربعاء","السبت","الأحد","الاثنين","الثلاثاء","الأربعاء","الصلاوات الخمس","اذكار الصياح والمساء "]
["م","ألأسم","حضور/ غياب","حضور/ غياب","حضور/ غياب","حضور/ غياب","حضور/ غياب","حضور/ غياب","حضور/ غياب","حضور/ غياب","حضور/ غياب","حضور/ غياب","حضور/ غياب","حضور/ غياب","حضور/ غياب","حضور/ غياب","حضور/ غياب","حضور/ غياب","حضور/ غياب","حضور/ غياب","حضور/ غياب","حضور/ غياب","حضور/ غياب","حضور/ غياب","حضور/ غياب","حضور/ غياب","حضور/ غياب",null,null,"ملاحظات\n / ( أذن )"]
[1,"اسماء ياسر مصطفي"]
[2,"خديجة محمد حمدي"]
[3,"فاطمة جمعة  غلاب"]
[4,"رحمة سلومة جودة"]
[5,"رحمة محمد عمار"]
{"$rows_left_out":24}
{"sheet":"ولاء","index":17,"n_rows":33,"n_cols":30,"rows_kept":33,"cut":false,"hidden":false,"merged":[[3,27,4,27],[3,28,4,28],[1,3,1,4],[0,0,0,29],[2,0,2,1],[2,2,2,6],[2,7,2,11],[2,12,2,16],[2,17,2,21],[2,22,2,26]]}
[" مكتب تحفيظ القرآن الكريم بمسجد خلوصي "]
["شهر ","فبراير",null,2021,null,null,null,null,"كشف بالاسماء لكل مُحفّظة / ولاء",null,null,null,null,null,null,null,"اسم الحلقة /",null,null,null,"خديجة بنت خويلد "]
["الأسبوع",null,"الأسبوع الأول",null,null,null,null,"الأسبوع الثاني",null,null,null,null,"الأسبوع الثالث",null,null,null,null,"الأسبوع الرابع",null,null,null,null,"الأسبوع الخامس"]
[null,null,"السبت","الأحد","الاثنين","الثلاثاء","الأربعاء","السبت","الأحد","الاثنين","الثلاثاء","الأربعاء","السبت","الأحد","الاثنين","الثلاثاء","الأربعاء","السبت","الأحد","الاثنين","الثلاثاء","الأربعاء","السبت","الأحد","الاثنين","الثلاثاء","الأربعاء","الصلاوات الخمس","اذكار الصياح والمساء "]
["م","ألأسم","حضور/ غياب","حضور/ غياب","حضور/ غياب","حضور/ غياب","حضور/ غياب","حضور/ غياب","حضور/ غياب","حضور/ غياب","حضور/ غياب","حضور/ غياب","حضور/ غياب","حضور/ غياب","حضور/ غياب","حضور/ غياب","حضور/ غياب","حضور/ غياب","حضور/ غياب","حضور/ غياب","حضور/ غياب","حضور/ غياب","حضور/ غياب","حضور/ غياب","حضور/ غياب","حضور/ غياب","حضور/ غياب",null,null,"ملاحظات \n/ ( أذن )"]
[1,"شروق عماد حسن"]
[2,"شيماء صبحي ياسين"]
[3,"ملك فضل مصطفي"]
[4,"هدير سلامة معوض"]
[5,"هدي محمود احمد"]
{"$rows_left_out":23}