{"text_format":"1","workbook":"xlsx","n_sheets":4,"sheets":["Data","Pivot","Sheet1","نسب العمولة"],"not_rendered":{"charts":0,"images":0,"macros":0,"external_links":0,"defined_names":2,"comments":0,"pivot_tables":1},"unopened":[],"bounds":{"document_bytes":16777216,"sheet_cells":100000,"rows_first":2000,"rows_last":500,"rows_between":2000,"halvings":0,"cell_chars":16384,"cell_head_chars":4096},"cells_cut":0,"cells_raw":0,"read":"whole","date_system":"1900"}

{"sheet":"Data","index":0,"n_rows":497,"n_cols":16,"rows_kept":497,"cut":false,"hidden":false,"merged":[]}
[{"$f":"TODAY()","v":"2021-02-25"},null,null,null,null,{"$f":"IF(G1<>J1,\"هناك خطا . برجاء المراجعة\",\"الاجمالى صحيح\")","v":"الاجمالى صحيح"},{"$f":"SUBTOTAL(9,G3:G100000)","v":124131.9},108887.63157894736,15244.268421052615,124131.9,null,10124425,null,{"$f":"SUBTOTAL(9,N3:N100000)","v":72252.999999999971},{"$f":"SUBTOTAL(9,O3:O100000)","v":9930.5519999999942},41948.348000000056]
["Brand ","Name","Code","Color","Note","Size","Amount","Amount Before VAT","Vat","Amount After Vat","Cash / Visa","Date","Period","Designer Share","I/S Share","Net Profit"]
["Own The Trend","Baybe in tortoise","S05002","Tortoise",null,null,850,{"$f":"IFERROR((G3*100/114),\"\")","v":745.61403508771934},{"$f":"IFERROR((H3*14/100),\"\")","v":104.38596491228071},{"$f":"IFERROR((H3+I3),\"\")","v":850},"Cash","2020-12-19",{"$f":"TEXT(L3,\"mmm-YYYY\")","v":"Dec-2020"},{"$f":"IFERROR($G3*VLOOKUP($A3,'نسب العمولة'!$C$3:$F$800,2,0),\"\")","v":595},{"$f":"IFERROR($G3*VLOOKUP($A3,'نسب العمولة'!$C$3:$F$800,3,0),\"\")","v":68},{"$f":"IFERROR($G3*VLOOKUP($A3,'نسب العمولة'!$C$3:$F$800,4,0),\"\")","v":187.00000000000003}]
["Own The Trend","Cashmere in Black","S08901","Black",null,null,850,{"$f":"IFERROR((G4*100/114),\"\")","v":745.61403508771934},{"$f":"IFERROR((H4*14/100),\"\")","v":104.38596491228071},{"$f":"IFERROR((H4+I4),\"\")","v":850},"Cash","2020-12-19",{"$f":"TEXT(L4,\"mmm-YYYY\")","v":"Dec-2020"},{"$f":"IFERROR($G4*VLOOKUP($A4,'نسب العمولة'!$C$3:$F$800,2,0),\"\")","v":595},{"$f":"IFERROR($G4*VLOOKUP($A4,'نسب العمولة'!$C$3:$F$800,3,0),\"\")","v":68},{"$f":"IFERROR($G4*VLOOKUP($A4,'نسب العمولة'!$C$3:$F$800,4,0),\"\")","v":187.00000000000003}]
["Own The Trend","Baybe in Black","S05001","Black",null,null,850,745.61403508771934,104.38596491228071,850,"Cash","2020-12-19","Dec-2020",{"$f":"IFERROR($G5*VLOOKUP($A5,'نسب العمولة'!$C$3:$F$800,2,0),\"\")","v":595},{"$f":"IFERROR($G5*VLOOKUP($A5,'نسب العمولة'!$C$3:$F$800,3,0),\"\")","v":68},{"$f":"IFERROR($G5*VLOOKUP($A5,'نسب العمولة'!$C$3:$F$800,4,0),\"\")","v":187.00000000000003}]
["By Hand ","Astray Cylinder",null,"Black",null,"8*10",630,552.63157894736844,77.368421052631589,630,"Cash","2020-12-19","Dec-2020",{"$f":"IFERROR($G6*VLOOKUP($A6,'نسب العمولة'!$C$3:$F$800,2,0),\"\")","v":0},{"$f":"IFERROR($G6*VLOOKUP($A6,'نسب العمولة'!$C$3:$F$800,3,0),\"\")","v":50.4},{"$f":"IFERROR($G6*VLOOKUP($A6,'نسب العمولة'!$C$3:$F$800,4,0),\"\")","v":579.6}]
["ETTC Denzy","MIDI PATISSERIE Footed Service Plate",96697,null,"Denzi(ettc) 15%","23Hcm",100,87.719298245614041,12.280701754385966,100,"Cash","2020-12-19","Dec-2020",{"$f":"IFERROR($G7*VLOOKUP($A7,'نسب العمولة'!$C$3:$F$800,2,0),\"\")","v":85},{"$f":"IFERROR($G7*VLOOKUP($A7,'نسب العمولة'!$C$3:$F$800,3,0),\"\")","v":8},{"$f":"IFERROR($G7*VLOOKUP($A7,'نسب العمولة'!$C$3:$F$800,4,0),\"\")","v":7.0000000000000018}]
["ETTC Denzy","MIDI PATISSERIE Footed Service Plate",96697,null,"Denzi(ettc) 15%","23Hcm",100,87.719298245614041,12.280701754385966,100,"Cash","2020-12-19","Dec-2020",{"$f":"IFERROR($G8*VLOOKUP($A8,'نسب العمولة'!$C$3:$F$800,2,0),\"\")","v":85},{"$f":"IFERROR($G8*VLOOKUP($A8,'نسب العمولة'!$C$3:$F$800,3,0),\"\")","v":8},{"$f":"IFERROR($G8*VLOOKUP($A8,'نسب العمولة'!$C$3:$F$800,4,0),\"\")","v":7.0000000000000018}]
["Candle By Pose.","Big Queen","BQW","White / Vanilla"," ","Large",330,289.4736842105263,40.526315789473685,330,"Cash","2020-12-19","Dec-2020",{"$f":"IFERROR($G9*VLOOKUP($A9,'نسب العمولة'!$C$3:$F$800,2,0),\"\")","v":247.5},{"$f":"IFERROR($G9*VLOOKUP($A9,'نسب العمولة'!$C$3:$F$800,3,0),\"\")","v":26.400000000000002},{"$f":"IFERROR($G9*VLOOKUP($A9,'نسب العمولة'!$C$3:$F$800,4,0),\"\")","v":56.099999999999994}]
["Candle By Pose.","Big Queen","BQG","Mint green / Lavender",null,"Large",330,289.4736842105263,40.526315789473685,330,"Cash","2020-12-19","Dec-2020",{"$f":"IFERROR($G10*VLOOKUP($A10,'نسب العمولة'!$C$3:$F$800,2,0),\"\")","v":247.5},{"$f":"IFERROR($G10*VLOOKUP($A10,'نسب العمولة'!$C$3:$F$800,3,0),\"\")","v":26.400000000000002},{"$f":"IFERROR($G10*VLOOKUP($A10,'نسب العمولة'!$C$3:$F$800,4,0),\"\")","v":56.099999999999994}]
["Candle By Pose.","Small Queen","SQB","Brown / Dark Chocolate and Honey",null,"Small",250,219.2982456140351,30.701754385964914,250,"Cash","2020-12-19","Dec-2020",{"$f":"IFERROR($G11*VLOOKUP($A11,'نسب العمولة'!$C$3:$F$800,2,0),\"\")","v":187.5},{"$f":"IFERROR($G11*VLOOKUP($A11,'نسب العمولة'!$C$3:$F$800,3,0),\"\")","v":20},{"$f":"IFERROR($G11*VLOOKUP($A11,'نسب العمولة'!$C$3:$F$800,4,0),\"\")","v":42.499999999999993}]
["Own The Trend","Marylin in Smoke tortoise","S050321"," Smoke Tortoise",null,null,850,745.61403508771934,104.38596491228071,850,"Cash","2020-12-20","Dec-2020",{"$f":"IFERROR($G12*VLOOKUP($A12,'نسب العمولة'!$C$3:$F$800,2,0),\"\")","v":595},{"$f":"IFERROR($G12*VLOOKUP($A12,'نسب العمولة'!$C$3:$F$800,3,0),\"\")","v":68},{"$f":"IFERROR($G12*VLOOKUP($A12,'نسب العمولة'!$C$3:$F$800,4,0),\"\")","v":187.00000000000003}]
["Own The Trend","Sammy in Gold/black","S00404","Black/gold",null,null,850,745.61403508771934,104.38596491228071,850,"Cash","2020-12-20","Dec-2020",{"$f":"IFERROR($G13*VLOOKUP($A13,'نسب العمولة'!$C$3:$F$800,2,0),\"\")","v":595},{"$f":"IFERROR($G13*VLOOKUP($A13,'نسب العمولة'!$C$3:$F$800,3,0),\"\")","v":68},{"$f":"IFERROR($G13*VLOOKUP($A13,'نسب العمولة'!$C$3:$F$800,4,0),\"\")","v":187.00000000000003}]
["Own The Trend","Royce in full black","S04901","Black",null,null,850,745.61403508771934,104.38596491228071,850,"Cash","2020-12-20","Dec-2020",{"$f":"IFERROR($G14*VLOOKUP($A14,'نسب العمولة'!$C$3:$F$800,2,0),\"\")","v":595},{"$f":"IFERROR($G14*VLOOKUP($A14,'نسب العمولة'!$C$3:$F$800,3,0),\"\")","v":68},{"$f":"IFERROR($G14*VLOOKUP($A14,'نسب العمولة'!$C$3:$F$800,4,0),\"\")","v":187.00000000000003}]
["Candle By Pose.","Small Queen","SQW","White / Vanilla",null,"Small",250,219.2982456140351,30.701754385964914,250,"Cash","2020-12-21","Dec-2020",{"$f":"IFERROR($G15*VLOOKUP($A15,'نسب العمولة'!$C$3:$F$800,2,0),\"\")","v":187.5},{"$f":"IFERROR($G15*VLOOKUP($A15,'نسب العمولة'!$C$3:$F$800,3,0),\"\")","v":20},{"$f":"IFERROR($G15*VLOOKUP($A15,'نسب العمولة'!$C$3:$F$800,4,0),\"\")","v":42.499999999999993}]
["Candle By Pose.","Small Queen","SQW","White / Vanilla",null,"Small",250,219.2982456140351,30.701754385964914,250,"Cash","2020-12-21","Dec-2020",{"$f":"IFERROR($G16*VLOOKUP($A16,'نسب العمولة'!$C$3:$F$800,2,0),\"\")","v":187.5},{"$f":"IFERROR($G16*VLOOKUP($A16,'نسب العمولة'!$C$3:$F$800,3,0),\"\")","v":20},{"$f":"IFERROR($G16*VLOOKUP($A16,'نسب العمولة'!$C$3:$F$800,4,0),\"\")","v":42.499999999999993}]
["Candle By Pose.","Big Queen","BQB","Brown / Dark Chocolate and Honey",null,"Large",330,289.4736842105263,40.526315789473685,330,"Cash","2020-12-21","Dec-2020",{"$f":"IFERROR($G17*VLOOKUP($A17,'نسب العمولة'!$C$3:$F$800,2,0),\"\")","v":247.5},{"$f":"IFERROR($G17*VLOOKUP($A17,'نسب العمولة'!$C$3:$F$800,3,0),\"\")","v":26.400000000000002},{"$f":"IFERROR($G17*VLOOKUP($A17,'نسب العمولة'!$C$3:$F$800,4,0),\"\")","v":56.099999999999994}]
["Candle By Pose.","Small King","SKB","Brown / Dark Chocolate and Honey",null,"Small",250,219.2982456140351,30.701754385964914,250,"Cash","2020-12-21","Dec-2020",{"$f":"IFERROR($G18*VLOOKUP($A18,'نسب العمولة'!$C$3:$F$800,2,0),\"\")","v":187.5},{"$f":"IFERROR($G18*VLOOKUP($A18,'نسب العمولة'!$C$3:$F$800,3,0),\"\")","v":20},{"$f":"IFERROR($G18*VLOOKUP($A18,'نسب العمولة'!$C$3:$F$800,4,0),\"\")","v":42.499999999999993}]
["SAAB"," Ashtray stand","Gold ss stand","Black",null,null,1200,1052.6315789473683,147.36842105263156,1200,"Cash","2020-12-21","Dec-2020",{"$f":"IFERROR($G19*VLOOKUP($A19,'نسب العمولة'!$C$3:$F$800,2,0),\"\")","v":840},{"$f":"IFERROR($G19*VLOOKUP($A19,'نسب العمولة'!$C$3:$F$800,3,0),\"\")","v":96},{"$f":"IFERROR($G19*VLOOKUP($A19,'نسب العمولة'!$C$3:$F$800,4,0),\"\")","v":264.00000000000006}]
["HandPick","Long VASE",null,"White",null,"28cm*17cm",330,289.4736842105263,40.526315789473685,330,"Cash","2020-12-21","Dec-2020",{"$f":"IFERROR($G20*VLOOKUP($A20,'نسب العمولة'!$C$3:$F$800,2,0),\"\")","v":230.99999999999997},{"$f":"IFERROR($G20*VLOOKUP($A20,'نسب العمولة'!$C$3:$F$800,3,0),\"\")","v":26.400000000000002},{"$f":"IFERROR($G20*VLOOKUP($A20,'نسب العمولة'!$C$3:$F$800,4,0),\"\")","v":72.600000000000009}]
["TIYI",null,"22221600500358201-","tweed",null,40,600,526.31578947368416,73.68421052631578,600,"Cash","2020-12-21","Dec-2020",{"$f":"IFERROR($G21*VLOOKUP($A21,'نسب العمولة'!$C$3:$F$800,2,0),\"\")","v":450},{"$f":"IFERROR($G21*VLOOKUP($A21,'نسب العمولة'!$C$3:$F$800,3,0),\"\")","v":48},{"$f":"IFERROR($G21*VLOOKUP($A21,'نسب العمولة'!$C$3:$F$800,4,0),\"\")","v":101.99999999999999}]
["Eunoia","Petite Bud Vase","PBV-016","Clear",null,"Height 6 Cm",120,105.26315789473684,14.736842105263156,119.99999999999999,"Cash","2020-12-21","Dec-2020",{"$f":"IFERROR($G22*VLOOKUP($A22,'نسب العمولة'!$C$3:$F$800,2,0),\"\")","v":84},{"$f":"IFERROR($G22*VLOOKUP($A22,'نسب العمولة'!$C$3:$F$800,3,0),\"\")","v":9.6},{"$f":"IFERROR($G22*VLOOKUP($A22,'نسب العمولة'!$C$3:$F$800,4,0),\"\")","v":26.400000000000002}]
["Own The Trend","Skinny retro in black","S03001","Black",null,null,850,745.61403508771934,104.38596491228071,850,"Visa","2020-12-21","Dec-2020",{"$f":"IFERROR($G23*VLOOKUP($A23,'نسب العمولة'!$C$3:$F$800,2,0),\"\")","v":595},{"$f":"IFERROR($G23*VLOOKUP($A23,'نسب العمولة'!$C$3:$F$800,3,0),\"\")","v":68},{"$f":"IFERROR($G23*VLOOKUP($A23,'نسب العمولة'!$C$3:$F$800,4,0),\"\")","v":187.00000000000003}]
["By Hand ","Ashtray Half Zap",null,"Alabaster",null,null,670,587.71929824561403,82.280701754385959,670,"Visa","2020-12-22","Dec-2020",{"$f":"IFERROR($G24*VLOOKUP($A24,'نسب العمولة'!$C$3:$F$800,2,0),\"\")","v":0},{"$f":"IFERROR($G24*VLOOKUP($A24,'نسب العمولة'!$C$3:$F$800,3,0),\"\")","v":53.6},{"$f":"IFERROR($G24*VLOOKUP($A24,'نسب العمولة'!$C$3:$F$800,4,0),\"\")","v":616.4}]
["Ariika","Dawn Rug ",6222019553429,null,null,"250x170cm",3188,2796.4912280701756,391.5087719298246,3188,"Visa","2020-12-22","Dec-2020",{"$f":"IFERROR($G25*VLOOKUP($A25,'نسب العمولة'!$C$3:$F$800,2,0),\"\")","v":2231.6},{"$f":"IFERROR($G25*VLOOKUP($A25,'نسب العمولة'!$C$3:$F$800,3,0),\"\")","v":255.04},{"$f":"IFERROR($G25*VLOOKUP($A25,'نسب العمولة'!$C$3:$F$800,4,0),\"\")","v":701.36000000000013}]
["Candle By Pose.","Big Queen","BQG","Mint green / Lavender",null,"Large",330,289.4736842105263,40.526315789473685,330,"Visa","2020-12-22","Dec-2020",{"$f":"IFERROR($G26*VLOOKUP($A26,'نسب العمولة'!$C$3:$F$800,2,0),\"\")","v":247.5},{"$f":"IFERROR($G26*VLOOKUP($A26,'نسب العمولة'!$C$3:$F$800,3,0),\"\")","v":26.400000000000002},{"$f":"IFERROR($G26*VLOOKUP($A26,'نسب العمولة'!$C$3:$F$800,4,0),\"\")","v":56.099999999999994}]
["Candle By Pose.","Big Queen","BQB","Brown / Dark Chocolate and Honey",null,"Large",330,289.4736842105263,40.526315789473685,330,"Visa","2020-12-22","Dec-2020",{"$f":"IFERROR($G27*VLOOKUP($A27,'نسب العمولة'!$C$3:$F$800,2,0),\"\")","v":247.5},{"$f":"IFERROR($G27*VLOOKUP($A27,'نسب العمولة'!$C$3:$F$800,3,0),\"\")","v":26.400000000000002},{"$f":"IFERROR($G27*VLOOKUP($A27,'نسب العمولة'!$C$3:$F$800,4,0),\"\")","v":56.099999999999994}]
["Celeste","Candles",null,null,null,"Large",800,701.75438596491233,98.245614035087726,800,"Visa","2020-12-22","Dec-2020",{"$f":"IFERROR($G28*VLOOKUP($A28,'نسب العمولة'!$C$3:$F$800,2,0),\"\")","v":560},{"$f":"IFERROR($G28*VLOOKUP($A28,'نسب العمولة'!$C$3:$F$800,3,0),\"\")","v":64},{"$f":"IFERROR($G28*VLOOKUP($A28,'نسب العمولة'!$C$3:$F$800,4,0),\"\")","v":176.00000000000003}]
["By Hand ","Astray Cylinder",null,"Black",null,"8*10",630,552.63157894736844,77.368421052631589,630,"Visa","2020-12-22","Dec-2020",{"$f":"IFERROR($G29*VLOOKUP($A29,'نسب العمولة'!$C$3:$F$800,2,0),\"\")","v":0},{"$f":"IFERROR($G29*VLOOKUP($A29,'نسب العمولة'!$C$3:$F$800,3,0),\"\")","v":50.4},{"$f":"IFERROR($G29*VLOOKUP($A29,'نسب العمولة'!$C$3:$F$800,4,0),\"\")","v":579.6}]
["By Hand ","Astray Cylinder",null,"White",null,"8*10",570,500,70,570,"Visa","2020-12-22","Dec-2020",{"$f":"IFERROR($G30*VLOOKUP($A30,'نسب العمولة'!$C$3:$F$800,2,0),\"\")","v":0},{"$f":"IFERROR($G30*VLOOKUP($A30,'نسب العمولة'!$C$3:$F$800,3,0),\"\")","v":45.6},{"$f":"IFERROR($G30*VLOOKUP($A30,'نسب العمولة'!$C$3:$F$800,4,0),\"\")","v":524.4}]
["By Hand ","Astray Cylinder",null,"Green",null,"8*10",630,552.63157894736844,77.368421052631589,630,"Visa","2020-12-22","Dec-2020",{"$f":"IFERROR($G31*VLOOKUP($A31,'نسب العمولة'!$C$3:$F$800,2,0),\"\")","v":0},{"$f":"IFERROR($G31*VLOOKUP($A31,'نسب العمولة'!$C$3:$F$800,3,0),\"\")","v":50.4},{"$f":"IFERROR($G31*VLOOKUP($A31,'نسب العمولة'!$C$3:$F$800,4,0),\"\")","v":579.6}]
["Can lemon",null,null,null,null,null,40,35.087719298245617,4.9122807017543861,40,"Visa","2020-12-22","Dec-2020",{"$f":"IFERROR($G32*VLOOKUP($A32,'نسب العمولة'!$C$3:$F$800,2,0),\"\")","v":0},{"$f":"IFERROR($G32*VLOOKUP($A32,'نسب العمولة'!$C$3:$F$800,3,0),\"\")","v":3.2},{"$f":"IFERROR($G32*VLOOKUP($A32,'نسب العمولة'!$C$3:$F$800,4,0),\"\")","v":36.800000000000004}]
["Candle By Pose.","Big Queen","BQB","Brown / Dark Chocolate and Honey",null,"Large",330,289.4736842105263,40.526315789473685,330,"Visa","2020-12-22","Dec-2020",{"$f":"IFERROR($G33*VLOOKUP($A33,'نسب العمولة'!$C$3:$F$800,2,0),\"\")","v":247.5},{"$f":"IFERROR($G33*VLOOKUP($A33,'نسب العمولة'!$C$3:$F$800,3,0),\"\")","v":26.400000000000002},{"$f":"IFERROR($G33*VLOOKUP($A33,'نسب العمولة'!$C$3:$F$800,4,0),\"\")","v":56.099999999999994}]
["Candle By Pose.","Small Queen","SQW","White / Vanilla",null,"Small",250,219.2982456140351,30.701754385964914,250,"Visa","2020-12-22","Dec-2020",{"$f":"IFERROR($G34*VLOOKUP($A34,'نسب العمولة'!$C$3:$F$800,2,0),\"\")","v":187.5},{"$f":"IFERROR($G34*VLOOKUP($A34,'نسب العمولة'!$C$3:$F$800,3,0),\"\")","v":20},{"$f":"IFERROR($G34*VLOOKUP($A34,'نسب العمولة'!$C$3:$F$800,4,0),\"\")","v":42.499999999999993}]
["Aliel","Beige Horra",null,null,null,null,2500,2192.9824561403507,307.01754385964909,2500,"Visa","2020-12-22","Dec-2020",{"$f":"IFERROR($G35*VLOOKUP($A35,'نسب العمولة'!$C$3:$F$800,2,0),\"\")","v":1750},{"$f":"IFERROR($G35*VLOOKUP($A35,'نسب العمولة'!$C$3:$F$800,3,0),\"\")","v":200},{"$f":"IFERROR($G35*VLOOKUP($A35,'نسب العمولة'!$C$3:$F$800,4,0),\"\")","v":550.00000000000011}]
["Candle By Pose.","Small Queen","SQB","Brown / Dark Chocolate and Honey",null,"Small",250,219.2982456140351,30.701754385964914,250,"Visa","2020-12-22","Dec-2020",{"$f":"IFERROR($G36*VLOOKUP($A36,'نسب العمولة'!$C$3:$F$800,2,0),\"\")","v":187.5},{"$f":"IFERROR($G36*VLOOKUP($A36,'نسب العمولة'!$C$3:$F$800,3,0),\"\")","v":20},{"$f":"IFERROR($G36*VLOOKUP($A36,'نسب العمولة'!$C$3:$F$800,4,0),\"\")","v":42.499999999999993}]
["By Aziza.","Judjing you ","R005","Tapestry",null,"Medium",2090,1833.3333333333333,256.66666666666663,2090,"Visa","2020-12-22","Dec-2020",{"$f":"IFERROR($G37*VLOOKUP($A37,'نسب العمولة'!$C$3:$F$800,2,0),\"\")","v":1567.5},{"$f":"IFERROR($G37*VLOOKUP($A37,'نسب العمولة'!$C$3:$F$800,3,0),\"\")","v":167.20000000000002},{"$f":"IFERROR($G37*VLOOKUP($A37,'نسب العمولة'!$C$3:$F$800,4,0),\"\")","v":355.29999999999995}]
["TIYI","Tweed",null,null,null,38,599,525.43859649122805,73.561403508771932,599,"Visa","2020-12-22","Dec-2020",{"$f":"IFERROR($G38*VLOOKUP($A38,'نسب العمولة'!$C$3:$F$800,2,0),\"\")","v":449.25},{"$f":"IFERROR($G38*VLOOKUP($A38,'نسب العمولة'!$C$3:$F$800,3,0),\"\")","v":47.92},{"$f":"IFERROR($G38*VLOOKUP($A38,'نسب العمولة'!$C$3:$F$800,4,0),\"\")","v":101.82999999999998}]
["SAAB"," SEATED DEEP PLATTER GOLD",null," White",null,"42*28*4",1700,1491.2280701754387,208.77192982456143,1700,"Visa","2020-12-23","Dec-2020",{"$f":"IFERROR($G39*VLOOKUP($A39,'نسب العمولة'!$C$3:$F$800,2,0),\"\")","v":1190},{"$f":"IFERROR($G39*VLOOKUP($A39,'نسب العمولة'!$C$3:$F$800,3,0),\"\")","v":136},{"$f":"IFERROR($G39*VLOOKUP($A39,'نسب العمولة'!$C$3:$F$800,4,0),\"\")","v":374.00000000000006}]
["Celeste","Blue Geode Wine Stopper ",null," Blue Geode",null,null,450,394.73684210526318,55.263157894736842,450,"Visa","2020-12-23","Dec-2020",{"$f":"IFERROR($G40*VLOOKUP($A40,'نسب العمولة'!$C$3:$F$800,2,0),\"\")","v":315},{"$f":"IFERROR($G40*VLOOKUP($A40,'نسب العمولة'!$C$3:$F$800,3,0),\"\")","v":36},{"$f":"IFERROR($G40*VLOOKUP($A40,'نسب العمولة'!$C$3:$F$800,4,0),\"\")","v":99.000000000000014}]
{"$rows_left_out":458}
{"sheet":"Pivot","index":1,"n_rows":36,"n_cols":5,"rows_kept":36,"cut":false,"hidden":true,"merged":[]}
["Period","Jan-2021"]
[]
["Sum of Amount After Vat","Column Labels"]
["Row Labels","Cash","CL","Visa","Grand Total"]
["AMM Home",570,285,4959.3999999999996,5814.4]
["Asheya",null,null,2017,2017]
["B Jewelry.",null,null,2400,2400]
["BLACK LOTUS",524.5,null,587.5,1112]
["Braes",3683.2,280,2763.6,6726.7999999999993]
["By Aziza.",null,null,2090,2090]
["By Hand ",2166,80,889,3135]
["Can lemon",1561.8,null,5214.6000000000004,6776.4000000000005]
["Candle By pose",285,null,570,855]
["Candle By Pose.",1160,null,null,1160]
["Carpet",null,null,11540,11540]
["Celeste",null,null,12626,12626]
["Dunia anabtawi",null,null,2800,2800]
["Earth Owls",643,270,2128.4,3041.4]
["ETIKK",1632,null,1960.8,3592.8]
["ETTC",672.6,null,3169.2,3841.7999999999997]
["ETTC Denzy",400,null,null,400]
["ETTC.",null,null,3205,3205]
["Eunoia",null,null,690,690]
["EUNOIA HOME ORDER ",null,null,180,180]
["From Her Travels",2473.8000000000002,null,2979.3999999999996,5453.2]
["Indira",1754,null,3350,5104]
["Kay",684,null,null,684]
["Maison Molak",null,null,8861,8861]
["Nokoosh",780.9,null,2200,2980.9]
["Ramla",null,null,4100,4100]
["SAAB",3000.0000000000005,null,7286,10286]
["Sekmet",690,null,690,1380]
["Tayets",1345.2,null,7151,8496.2000000000007]
["The Kut",0,null,2100,2100]
["TIYI",683,null,null,683]
["Grand Total",24709.000000000004,915,98507.9,124131.9]

{"sheet":"Sheet1","index":2,"n_rows":47,"n_cols":3,"rows_kept":47,"cut":false,"hidden":true,"merged":[]}
[null,null,{"$f":"SUBTOTAL(109,C3:C11000)","v":333004.79999999999}]
[null,"Brand ","Amount"]
[null,"Aliel",{"$f":"SUMPRODUCT((Data!$A$3:$A$15000=Sheet1!B3)*(Data!$G$3:$G$15000))","v":20320}]
[null,"AMM Home",{"$f":"SUMPRODUCT((Data!$A$3:$A$15000=Sheet1!B4)*(Data!$G$3:$G$15000))","v":8639.3999999999978}]
[null,"Ariika",{"$f":"SUMPRODUCT((Data!$A$3:$A$15000=Sheet1!B5)*(Data!$G$3:$G$15000))","v":5656}]
[null,"Asheya",{"$f":"SUMPRODUCT((Data!$A$3:$A$15000=Sheet1!B6)*(Data!$G$3:$G$15000))","v":17377}]
[null,"B Jewelry.",{"$f":"SUMPRODUCT((Data!$A$3:$A$15000=Sheet1!B7)*(Data!$G$3:$G$15000))","v":2400}]
[null,"BLACK LOTUS",{"$f":"SUMPRODUCT((Data!$A$3:$A$15000=Sheet1!B8)*(Data!$G$3:$G$15000))","v":1527}]
[null,"Black louts",{"$f":"SUMPRODUCT((Data!$A$3:$A$15000=Sheet1!B9)*(Data!$G$3:$G$15000))","v":100}]
[null,"Bold and refined",{"$f":"SUMPRODUCT((Data!$A$3:$A$15000=Sheet1!B10)*(Data!$G$3:$G$15000))","v":2950}]
[null,"Braes",{"$f":"SUMPRODUCT((Data!$A$3:$A$15000=Sheet1!B11)*(Data!$G$3:$G$15000))","v":11886.8}]
[null,"By Aziza.",{"$f":"SUMPRODUCT((Data!$A$3:$A$15000=Sheet1!B12)*(Data!$G$3:$G$15000))","v":6270}]
[null,"By Hand ",{"$f":"SUMPRODUCT((Data!$A$3:$A$15000=Sheet1!B13)*(Data!$G$3:$G$15000))","v":13660}]
[null,"By Leila Nassar ",{"$f":"SUMPRODUCT((Data!$A$3:$A$15000=Sheet1!B14)*(Data!$G$3:$G$15000))","v":1926}]
[null,"Can lemon",{"$f":"SUMPRODUCT((Data!$A$3:$A$15000=Sheet1!B15)*(Data!$G$3:$G$15000))","v":6930.4000000000005}]
[null,"Candle By pose",{"$f":"SUMPRODUCT((Data!$A$3:$A$15000=Sheet1!B16)*(Data!$G$3:$G$15000))","v":1607.2}]
[null,"Candle By Pose.",{"$f":"SUMPRODUCT((Data!$A$3:$A$15000=Sheet1!B17)*(Data!$G$3:$G$15000))","v":5970}]
[null,"Carpet",{"$f":"SUMPRODUCT((Data!$A$3:$A$15000=Sheet1!B18)*(Data!$G$3:$G$15000))","v":12540}]
[null,"Celeste",{"$f":"SUMPRODUCT((Data!$A$3:$A$15000=Sheet1!B19)*(Data!$G$3:$G$15000))","v":23833}]
[null,"Dunia anabtawi",{"$f":"SUMPRODUCT((Data!$A$3:$A$15000=Sheet1!B20)*(Data!$G$3:$G$15000))","v":8200}]
[null,"Earth Owls",{"$f":"SUMPRODUCT((Data!$A$3:$A$15000=Sheet1!B21)*(Data!$G$3:$G$15000))","v":6607.2000000000007}]
[null,"ETIKK",{"$f":"SUMPRODUCT((Data!$A$3:$A$15000=Sheet1!B22)*(Data!$G$3:$G$15000))","v":8200.7999999999993}]
[null,"ETTC",{"$f":"SUMPRODUCT((Data!$A$3:$A$15000=Sheet1!B23)*(Data!$G$3:$G$15000))","v":4753.8}]
[null,"ETTC Denzy",{"$f":"SUMPRODUCT((Data!$A$3:$A$15000=Sheet1!B24)*(Data!$G$3:$G$15000))","v":600}]
[null,"ETTC.",{"$f":"SUMPRODUCT((Data!$A$3:$A$15000=Sheet1!B25)*(Data!$G$3:$G$15000))","v":8434}]
[null,"Eunoia",{"$f":"SUMPRODUCT((Data!$A$3:$A$15000=Sheet1!B26)*(Data!$G$3:$G$15000))","v":3110}]
[null,"EUNOIA HOME ORDER ",{"$f":"SUMPRODUCT((Data!$A$3:$A$15000=Sheet1!B27)*(Data!$G$3:$G$15000))","v":180}]
[null,"From Her Travels",{"$f":"SUMPRODUCT((Data!$A$3:$A$15000=Sheet1!B28)*(Data!$G$3:$G$15000))","v":6378.2000000000007}]
[null,"Hand pick",{"$f":"SUMPRODUCT((Data!$A$3:$A$15000=Sheet1!B29)*(Data!$G$3:$G$15000))","v":250.8}]
[null,"HandPick",{"$f":"SUMPRODUCT((Data!$A$3:$A$15000=Sheet1!B30)*(Data!$G$3:$G$15000))","v":660}]
[null,"House Of GA",{"$f":"SUMPRODUCT((Data!$A$3:$A$15000=Sheet1!B31)*(Data!$G$3:$G$15000))","v":4618}]
[null,"Indira",{"$f":"SUMPRODUCT((Data!$A$3:$A$15000=Sheet1!B32)*(Data!$G$3:$G$15000))","v":11654}]
[null,"Kay",{"$f":"SUMPRODUCT((Data!$A$3:$A$15000=Sheet1!B33)*(Data!$G$3:$G$15000))","v":3884}]
[null,"Knana",{"$f":"SUMPRODUCT((Data!$A$3:$A$15000=Sheet1!B34)*(Data!$G$3:$G$15000))","v":4218}]
[null,"Linda Farah",{"$f":"SUMPRODUCT((Data!$A$3:$A$15000=Sheet1!B35)*(Data!$G$3:$G$15000))","v":3500}]
[null,"Lush ",{"$f":"SUMPRODUCT((Data!$A$3:$A$15000=Sheet1!B36)*(Data!$G$3:$G$15000))","v":26800}]
[null,"Maison Molak",{"$f":"SUMPRODUCT((Data!$A$3:$A$15000=Sheet1!B37)*(Data!$G$3:$G$15000))","v":8861}]
[null,"Myne",{"$f":"SUMPRODUCT((Data!$A$3:$A$15000=Sheet1!B38)*(Data!$G$3:$G$15000))","v":855}]
[null,"Nokoosh",{"$f":"SUMPRODUCT((Data!$A$3:$A$15000=Sheet1!B39)*(Data!$G$3:$G$15000))","v":9318}]
[null,"Own The Trend",{"$f":"SUMPRODUCT((Data!$A$3:$A$15000=Sheet1!B40)*(Data!$G$3:$G$15000))","v":8500}]
{"$rows_left_out":8}
{"sheet":"نسب العمولة","index":3,"n_rows":314,"n_cols":8,"rows_kept":314,"cut":false,"hidden":false,"merged":[]}
[]
["م","نظام العمولة","اسم المسؤل","Designer Share","I/S Share","Net Profit","الاجمالي","احتساب نسبة العمولة"]
[1,"بيع","Aliel",0.7,0.08,{"$f":"100%-D3-E3","v":0.22000000000000003},{"$f":"D3+E3+F3","v":1},"الايراد"]
[2,"بيع","AMM Home",0.7,0.08,{"$f":"100%-D4-E4","v":0.22000000000000003},1,"الايراد"]
[3,"بيع","Ariika",0.7,0.08,0.22000000000000003,1,"الايراد"]
[4,"بيع","Asheya",0.7,0.08,0.22000000000000003,1,"الايراد"]
[5,"بيع","B Jewelry.",0.75,0.08,0.16999999999999998,1,"الايراد"]
[6,"بيع","Braes",0.7,0.08,0.22000000000000003,1,"الايراد"]
[7,"بيع","By Aziza.",0.75,0.08,0.16999999999999998,1,"الايراد"]
[8,"بيع","By Hand ",0,0.08,0.92,1,"الايراد"]
[9,"بيع","Can lemon",0,0.08,0.92,1,"الايراد"]
[10,"بيع","Candle By Pose.",0.75,0.08,0.16999999999999998,1,"الايراد"]
[11,"بيع","Carpet",0,0.08,0.92,1,"الايراد"]
[12,"بيع","Celeste",0.7,0.08,0.22000000000000003,1,"الايراد"]
[13,"بيع","Dunia anabtawi",0.7,0.08,0.22000000000000003,1,"الايراد"]
[14,"بيع","Earth Owls",0.7,0.08,0.22000000000000003,1,"الايراد"]
[15,"بيع","Etikk",0.7,0.08,0.22000000000000003,1,"الايراد"]
[16,"بيع","ETTC.",0.7,0.08,0.22000000000000003,1,"الايراد"]
[17,"بيع","Eunoia",0.7,0.08,0.22000000000000003,1,"الايراد"]
[18,"بيع","EUNOIA HOME ORDER ",0.7,0.08,0.22000000000000003,1,"الايراد"]
[19,"بيع","From her travels",0.7,0.08,0.22000000000000003,1,"الايراد"]
[20,"بيع","HandPick",0.7,0.08,0.22000000000000003,1,"الايراد"]
[21,"بيع","Indira",0.7,0.08,0.22000000000000003,1,"الايراد"]
[22,"بيع","Kay",0.7,0.08,0.22000000000000003,1,"الايراد"]
[23,"بيع","Linda Farah",0.7,0.08,0.22000000000000003,1,"الايراد"]
[24,"بيع","Lush ",0.7,0.08,0.22000000000000003,1,"الايراد"]
[25,"بيع","Maison Molak",0.7,0.08,0.22000000000000003,1,"الايراد"]
[26,"بيع","Nokoosh",0.7,0.08,0.22000000000000003,1,"الايراد"]
[27,"بيع","Own The Trend",0.7,0.08,0.22000000000000003,1,"الايراد"]
[28,"بيع","Ramla",0.7,0.08,0.22000000000000003,1,"الايراد"]
[29,"بيع","SAAB",0.7,0.08,0.22000000000000003,1,"الايراد"]
[30,"بيع","Sekmet",0.7,0.08,0.22000000000000003,1,"الايراد"]
[31,"بيع","Siko",0.7,0.08,0.22000000000000003,1,"الايراد"]
[32,"بيع","Tayets",0.7,0.08,0.22000000000000003,1,"الايراد"]
[33,"بيع","The Kut",0.7,0.08,0.22000000000000003,1,"الايراد"]
[34,"بيع","TIYI",0.75,0.08,0.16999999999999998,1,"الايراد"]
[35,"بيع","ETTC DENZY",0.85,0.08,7.0000000000000021E-2,1,"الايراد"]
[36,"بيع","BLACK LOTUS",0.7,0.08,0.22000000000000003,1,"الايراد"]
[37,"بيع","ETTC",0.7,0.08,0.22000000000000003,1,"الايراد"]
[38,"بيع","Candle By Pose",0.7,0.08,0.22000000000000003,1,"الايراد"]
{"$rows_left_out":274}