{"text_format":"1","workbook":"xlsx","n_sheets":8,"sheets":["Marks","Grade 1","Grade 2","Grade 3","Grade 4","Grade 5","Grade 6","Certificates"],"not_rendered":{"charts":0,"images":8,"macros":1,"external_links":1,"defined_names":16,"comments":0,"pivot_tables":0},"unopened":[],"bounds":{"document_bytes":16777216,"sheet_cells":100000,"rows_first":2000,"rows_last":500,"rows_between":2000,"halvings":0,"cell_chars":16384,"cell_head_chars":4096},"cells_cut":0,"cells_raw":0,"read":"whole","date_system":"1900"}

{"sheet":"Marks","index":0,"n_rows":104,"n_cols":54,"rows_kept":104,"cut":false,"hidden":false,"merged":[[0,13,1,14],[0,15,1,18],[0,31,1,32],[0,33,1,34],[3,5,3,12],[3,17,3,24],[3,34,4,34]]}
["2020-2021",null,null,null,null,null,null,null,null,null,null,null,null,"First ",null,"Semester",null,null,null,null,null,null,null,null,null,null,null,null,null,null,null,"Students Number",null,{"$f":"COUNT(B7:B97)","v":17}]
[null,null,""]
[0,1,2,3,4,5,6,7,8,9,10,11,12,13,14,15,16,17,18,19,20,21,22,23,24,25,26,27,28,29,30,31,32,33,34]
[null,null,null,null,null,"Arabic",null,null,null,null,null,null,null,null,null,null,null,"English",null,null,null,null,null,null,null,null,null,null,null,null,null,null,null,null,"Rank"]
[null,null,null,null,null,"قراءة","تعبير شفهي","إصغاء","إستظهار","إملاء","قواعد","تحليل نص","تعبير كتابي","خط ونسخ","تربية مدنية","جغرافيا","تاريخ ","Reading","Oral Com","Listening","Poem","Dictation","Grammar","Read Com","Writing","Penmanship","Maths","Biology","Chemistry","Physics","Sports","Arts","Skills","Total Marks"]
["Adm No.","Roll No.","Name","Class","Section",10,10,10,10,10,10,10,10,10,20,20,20,10,10,10,10,10,10,10,10,10,60,30,30,30,10,10,10,{"$f":"SUM(F6:AG6)","v":420}]
[1,220,"Omar Ahmad Zein","Grade 1","A",8,2,3,8,2,3,4,2,8,18,15,18,2,2,2,4,2,4,4,6,9,38,18,18,18,11,9,5,243,{"$f":"RANK(AH7,$AH$7:$AH$95,0)","v":7},null,null,null,null,null,null,null,null,null,null,null,null,null,null,null,null,null,"YELLOW","A"]
[2,221,"Ahmad Mohammed Yuness","Grade 2","A",2,3,4,5,6,7,8,9,10,11,12,13,14,15,16,17,18,19,20,21,22,23,24,25,26,27,28,29,434,1,null,null,null,null,null,null,null,null,null,null,null,null,null,null,null,null,null,"FARMERS","B"]
[3,222,"Zouheir hasan Wazni","Grade 3","B",2,2,2,5,3,4,4,2,9,18,15,15,2,2,2,5,2,5,5,7,9,35,17,20,20,16,9,9,246,3,null,null,null,null,null,null,null,null,null,null,null,null,null,null,null,null,null,"BUS-MABSOUT","C"]
[4,223,"Sara Ali Ballot","Grade 4","C",2,2,2,5,2,4,4,2,9,15,14,15,2,2,2,5,2,4,4,2,8,36,19,15,19,18,7,9,230,14,null,null,null,null,null,null,null,null,null,null,null,null,null,null,null,null,null,"BLOOMERS","D"]
[5,224,"Saad eddin Syufi","Grade 5","D",2,2,2,5,2,4,4,4,9,15,14,14,2,4,4,5,2,4,4,3,7,30,18,18,15,19,8,8,228,15,null,null,null,null,null,null,null,null,null,null,null,null,null,null,null,null,null,"CACTUS","E"]
[6,225,"Ali  Mohammed Safar","Grade 8","E",2,2,3,5,2,4,4,4,8,15,18,16,2,4,4,5,2,4,4,3,9,32,18,15,17,20,9,6,237,11,null,null,null,null,null,null,null,null,null,null,null,null,null,null,null,null,null,"EDISON","F"]
[7,226,"Ali Naser Slim","Grade 8","F",2,2,3,5,2,4,4,2,7,14,19,18,5,2,2,5,2,2,2,5,8,38,19,17,19,8,9,8,233,13]
[8,227,"Mohammed Ali Saad","Grade 7","C",2,2,2,5,2,4,4,4,7,16,20,19,2,5,5,5,2,5,5,5,9,39,20,16,19,15,8,6,253,2]
[9,228,"Samir Ahmad Doulani","Grade 6","C",2,2,2,5,2,4,3,2,5,8,7,6,2,2,3,6,3,3,2,2,5,12,8,11,8,8,5,5,133,17]
{"$rows_left_out":90}
{"sheet":"Grade 1","index":1,"n_rows":104,"n_cols":49,"rows_kept":104,"cut":false,"hidden":false,"merged":[[0,26,1,27],[0,28,1,29],[3,5,3,12],[3,14,3,21],[3,29,4,29]]}
[null,null,null,null,null,null,null,null,null,null,null,null,null,"First SEMESTER",null,null,null,null,null,null,null,null,null,null,null,null,"Students Number",null,{"$f":"COUNT(B7:B97)","v":0}]
[null,null,""]
[0,1,2,3,4,5,6,7,8,9,10,11,12,13,14,15,16,17,18,19,20,21,22,23,24,25,26,27,28,29]
[null,null,null,null,null,"Arabic",null,null,null,null,null,null,null,null,"English",null,null,null,null,null,null,null,null,null,null,null,null,null,null,"Rank"]
[null,null,null,null,null,"قراءة","تعبير شفهي","إصغاء","إستظهار","إملاء","قواعد","تحليل نص","تعبير كتابي","خط ونسخ","Reading","Oral Com","Listening","Poem","Dictation","Phonics","Read Com","Writing","Penmanship","Maths","Siences","Sports","Arts","Skills","Total Marks"]
["Adm No.","Roll No.","Name","Class","Section",10,10,10,10,10,10,10,10,10,10,10,10,10,10,10,10,10,10,60,30,10,10,10,{"$f":"SUM(F6:AB6)","v":300}]
[1,null,null,null,null,null,null,null,null,null,null,null,null,null,null,null,null,null,null,null,null,null,null,null,null,null,null,null,0,{"$f":"RANK(AC7,$AC$7:$AC$150,0)","v":1},null,null,null,null,null,null,null,null,null,null,null,null,null,null,null,null,null,"YELLOW","A"]
[2,null,null,null,null,null,null,null,null,null,null,null,null,null,null,null,null,null,null,null,null,null,null,null,null,null,null,null,0,{"$f":"RANK(AC8,$AC$7:$AC$150,0)","v":1},null,null,null,null,null,null,null,null,null,null,null,null,null,null,null,null,null,"FARMERS","B"]
[3,null,null,null,null,null,null,null,null,null,null,null,null,null,null,null,null,null,null,null,null,null,null,null,null,null,null,null,0,1,null,null,null,null,null,null,null,null,null,null,null,null,null,null,null,null,null,"BUS-MABSOUT","C"]
[4,null,null,null,null,null,null,null,null,null,null,null,null,null,null,null,null,null,null,null,null,null,null,null,null,null,null,null,0,1,null,null,null,null,null,null,null,null,null,null,null,null,null,null,null,null,null,"BLOOMERS","D"]
[5,null,null,null,null,null,null,null,null,null,null,null,null,null,null,null,null,null,null,null,null,null,null,null,null,null,null,null,0,1,null,null,null,null,null,null,null,null,null,null,null,null,null,null,null,null,null,"CACTUS","E"]
[6,null,null,null,null,null,null,null,null,null,null,null,null,null,null,null,null,null,null,null,null,null,null,null,null,null,null,null,0,1,null,null,null,null,null,null,null,null,null,null,null,null,null,null,null,null,null,"EDISON","F"]
[7,null,null,null,null,null,null,null,null,null,null,null,null,null,null,null,null,null,null,null,null,null,null,null,null,null,null,null,0,1]
[8,null,null,null,null,null,null,null,null,null,null,null,null,null,null,null,null,null,null,null,null,null,null,null,null,null,null,null,0,1]
[9,null,null,null,null,null,null,null,null,null,null,null,null,null,null,null,null,null,null,null,null,null,null,null,null,null,null,null,0,1]
{"$rows_left_out":90}
{"sheet":"Grade 2","index":2,"n_rows":104,"n_cols":49,"rows_kept":104,"cut":false,"hidden":false,"merged":[[0,26,1,27],[0,28,1,29],[3,5,3,12],[3,14,3,21],[3,29,4,29]]}
[null,null,null,null,null,null,null,null,null,null,null,null,null,"First SEMESTER",null,null,null,null,null,null,null,null,null,null,null,null,"Students Number",null,{"$f":"COUNT(B7:B97)","v":0}]
[null,null,""]
[0,1,2,3,4,5,6,7,8,9,10,11,12,13,14,15,16,17,18,19,20,21,22,23,24,25,26,27,28,29]
[null,null,null,null,null,"Arabic",null,null,null,null,null,null,null,null,"English",null,null,null,null,null,null,null,null,null,null,null,null,null,null,"Rank"]
[null,null,null,null,null,"قراءة","تعبير شفهي","إصغاء","إستظهار","إملاء","قواعد","تحليل نص","تعبير كتابي","خط ونسخ","Reading","Oral Com","Listening","Poem","Dictation","Phonics","Read Com","Writing","Penmanship","Maths","Siences","Sports","Arts","Skills","Total Marks"]
["Adm No.","Roll No.","Name","Class","Section",10,10,10,10,10,10,10,10,10,10,10,10,10,10,10,10,10,10,60,30,10,10,10,{"$f":"SUM(F6:AB6)","v":300}]
[1,null,null,null,null,null,null,null,null,null,null,null,null,null,null,null,null,null,null,null,null,null,null,null,null,null,null,null,0,{"$f":"RANK(AC7,$AC$7:$AC$150,0)","v":1},null,null,null,null,null,null,null,null,null,null,null,null,null,null,null,null,null,"YELLOW","A"]
[2,null,null,null,null,null,null,null,null,null,null,null,null,null,null,null,null,null,null,null,null,null,null,null,null,null,null,null,0,{"$f":"RANK(AC8,$AC$7:$AC$150,0)","v":1},null,null,null,null,null,null,null,null,null,null,null,null,null,null,null,null,null,"FARMERS","B"]
[3,null,null,null,null,null,null,null,null,null,null,null,null,null,null,null,null,null,null,null,null,null,null,null,null,null,null,null,0,1,null,null,null,null,null,null,null,null,null,null,null,null,null,null,null,null,null,"BUS-MABSOUT","C"]
[4,null,null,null,null,null,null,null,null,null,null,null,null,null,null,null,null,null,null,null,null,null,null,null,null,null,null,null,0,1,null,null,null,null,null,null,null,null,null,null,null,null,null,null,null,null,null,"BLOOMERS","D"]
[5,null,null,null,null,null,null,null,null,null,null,null,null,null,null,null,null,null,null,null,null,null,null,null,null,null,null,null,0,1,null,null,null,null,null,null,null,null,null,null,null,null,null,null,null,null,null,"CACTUS","E"]
[6,null,null,null,null,null,null,null,null,null,null,null,null,null,null,null,null,null,null,null,null,null,null,null,null,null,null,null,0,1,null,null,null,null,null,null,null,null,null,null,null,null,null,null,null,null,null,"EDISON","F"]
[7,null,null,null,null,null,null,null,null,null,null,null,null,null,null,null,null,null,null,null,null,null,null,null,null,null,null,null,0,1]
[8,null,null,null,null,null,null,null,null,null,null,null,null,null,null,null,null,null,null,null,null,null,null,null,null,null,null,null,0,1]
[9,null,null,null,null,null,null,null,null,null,null,null,null,null,null,null,null,null,null,null,null,null,null,null,null,null,null,null,0,1]
{"$rows_left_out":90}
{"sheet":"Grade 3","index":3,"n_rows":104,"n_cols":49,"rows_kept":104,"cut":false,"hidden":false,"merged":[[0,26,1,27],[0,28,1,29],[3,5,3,12],[3,14,3,21],[3,29,4,29]]}
[null,null,null,null,null,null,null,null,null,null,null,null,null,"First SEMESTER",null,null,null,null,null,null,null,null,null,null,null,null,"Students Number",null,{"$f":"COUNT(B7:B97)","v":0}]
[null,null,""]
[0,1,2,3,4,5,6,7,8,9,10,11,12,13,14,15,16,17,18,19,20,21,22,23,24,25,26,27,28,29]
[null,null,null,null,null,"Arabic",null,null,null,null,null,null,null,null,"English",null,null,null,null,null,null,null,null,null,null,null,null,null,null,"Rank"]
[null,null,null,null,null,"قراءة","تعبير شفهي","إصغاء","إستظهار","إملاء","قواعد","تحليل نص","تعبير كتابي","خط ونسخ","Reading","Oral Com","Listening","Poem","Dictation","Phonics","Read Com","Writing","Penmanship","Maths","Siences","Sports","Arts","Skills","Total Marks"]
["Adm No.","Roll No.","Name","Class","Section",10,10,10,10,10,10,10,10,10,10,10,10,10,10,10,10,10,10,60,30,10,10,10,{"$f":"SUM(F6:AB6)","v":300}]
[1,null,null,null,null,null,null,null,null,null,null,null,null,null,null,null,null,null,null,null,null,null,null,null,null,null,null,null,0,{"$f":"RANK(AC7,$AC$7:$AC$150,0)","v":1},null,null,null,null,null,null,null,null,null,null,null,null,null,null,null,null,null,"YELLOW","A"]
[2,null,null,null,null,null,null,null,null,null,null,null,null,null,null,null,null,null,null,null,null,null,null,null,null,null,null,null,0,{"$f":"RANK(AC8,$AC$7:$AC$150,0)","v":1},null,null,null,null,null,null,null,null,null,null,null,null,null,null,null,null,null,"FARMERS","B"]
[3,null,null,null,null,null,null,null,null,null,null,null,null,null,null,null,null,null,null,null,null,null,null,null,null,null,null,null,0,1,null,null,null,null,null,null,null,null,null,null,null,null,null,null,null,null,null,"BUS-MABSOUT","C"]
[4,null,null,null,null,null,null,null,null,null,null,null,null,null,null,null,null,null,null,null,null,null,null,null,null,null,null,null,0,1,null,null,null,null,null,null,null,null,null,null,null,null,null,null,null,null,null,"BLOOMERS","D"]
[5,null,null,null,null,null,null,null,null,null,null,null,null,null,null,null,null,null,null,null,null,null,null,null,null,null,null,null,0,1,null,null,null,null,null,null,null,null,null,null,null,null,null,null,null,null,null,"CACTUS","E"]
[6,null,null,null,null,null,null,null,null,null,null,null,null,null,null,null,null,null,null,null,null,null,null,null,null,null,null,null,0,1,null,null,null,null,null,null,null,null,null,null,null,null,null,null,null,null,null,"EDISON","F"]
[7,null,null,null,null,null,null,null,null,null,null,null,null,null,null,null,null,null,null,null,null,null,null,null,null,null,null,null,0,1]
[8,null,null,null,null,null,null,null,null,null,null,null,null,null,null,null,null,null,null,null,null,null,null,null,null,null,null,null,0,1]
[9,null,null,null,null,null,null,null,null,null,null,null,null,null,null,null,null,null,null,null,null,null,null,null,null,null,null,null,0,1]
{"$rows_left_out":90}
{"sheet":"Grade 4","index":4,"n_rows":104,"n_cols":49,"rows_kept":104,"cut":false,"hidden":false,"merged":[[0,26,1,27],[0,28,1,29],[3,5,3,12],[3,14,3,21],[3,29,4,29]]}
[null,null,null,null,null,null,null,null,null,null,null,null,null,"First SEMESTER",null,null,null,null,null,null,null,null,null,null,null,null,"Students Number",null,{"$f":"COUNT(B7:B97)","v":0}]
[null,null,""]
[0,1,2,3,4,5,6,7,8,9,10,11,12,13,14,15,16,17,18,19,20,21,22,23,24,25,26,27,28,29]
[null,null,null,null,null,"Arabic",null,null,null,null,null,null,null,null,"English",null,null,null,null,null,null,null,null,null,null,null,null,null,null,"Rank"]
[null,null,null,null,null,"قراءة","تعبير شفهي","إصغاء","إستظهار","إملاء","قواعد","تحليل نص","تعبير كتابي","خط ونسخ","Reading","Oral Com","Listening","Poem","Dictation","Phonics","Read Com","Writing","Penmanship","Maths","Siences","Sports","Arts","Skills","Total Marks"]
["Adm No.","Roll No.","Name","Class","Section",10,10,10,10,10,10,10,10,10,10,10,10,10,10,10,10,10,10,60,30,10,10,10,{"$f":"SUM(F6:AB6)","v":300}]
[1,null,null,null,null,null,null,null,null,null,null,null,null,null,null,null,null,null,null,null,null,null,null,null,null,null,null,null,0,{"$f":"RANK(AC7,$AC$7:$AC$150,0)","v":1},null,null,null,null,null,null,null,null,null,null,null,null,null,null,null,null,null,"YELLOW","A"]
[2,null,null,null,null,null,null,null,null,null,null,null,null,null,null,null,null,null,null,null,null,null,null,null,null,null,null,null,0,{"$f":"RANK(AC8,$AC$7:$AC$150,0)","v":1},null,null,null,null,null,null,null,null,null,null,null,null,null,null,null,null,null,"FARMERS","B"]
[3,null,null,null,null,null,null,null,null,null,null,null,null,null,null,null,null,null,null,null,null,null,null,null,null,null,null,null,0,1,null,null,null,null,null,null,null,null,null,null,null,null,null,null,null,null,null,"BUS-MABSOUT","C"]
[4,null,null,null,null,null,null,null,null,null,null,null,null,null,null,null,null,null,null,null,null,null,null,null,null,null,null,null,0,1,null,null,null,null,null,null,null,null,null,null,null,null,null,null,null,null,null,"BLOOMERS","D"]
[5,null,null,null,null,null,null,null,null,null,null,null,null,null,null,null,null,null,null,null,null,null,null,null,null,null,null,null,0,1,null,null,null,null,null,null,null,null,null,null,null,null,null,null,null,null,null,"CACTUS","E"]
[6,null,null,null,null,null,null,null,null,null,null,null,null,null,null,null,null,null,null,null,null,null,null,null,null,null,null,null,0,1,null,null,null,null,null,null,null,null,null,null,null,null,null,null,null,null,null,"EDISON","F"]
[7,null,null,null,null,null,null,null,null,null,null,null,null,null,null,null,null,null,null,null,null,null,null,null,null,null,null,null,0,1]
[8,null,null,null,null,null,null,null,null,null,null,null,null,null,null,null,null,null,null,null,null,null,null,null,null,null,null,null,0,1]
[9,null,null,null,null,null,null,null,null,null,null,null,null,null,null,null,null,null,null,null,null,null,null,null,null,null,null,null,0,1]
{"$rows_left_out":90}
{"sheet":"Grade 5","index":5,"n_rows":104,"n_cols":49,"rows_kept":104,"cut":false,"hidden":false,"merged":[[0,26,1,27],[0,28,1,29],[3,5,3,12],[3,14,3,21],[3,29,4,29]]}
[null,null,null,null,null,null,null,null,null,null,null,null,null,"First SEMESTER",null,null,null,null,null,null,null,null,null,null,null,null,"Students Number",null,{"$f":"COUNT(B7:B97)","v":0}]
[null,null,""]
[0,1,2,3,4,5,6,7,8,9,10,11,12,13,14,15,16,17,18,19,20,21,22,23,24,25,26,27,28,29]
[null,null,null,null,null,"Arabic",null,null,null,null,null,null,null,null,"English",null,null,null,null,null,null,null,null,null,null,null,null,null,null,"Rank"]
[null,null,null,null,null,"قراءة","تعبير شفهي","إصغاء","إستظهار","إملاء","قواعد","تحليل نص","تعبير كتابي","خط ونسخ","Reading","Oral Com","Listening","Poem","Dictation","Phonics","Read Com","Writing","Penmanship","Maths","Siences","Sports","Arts","Skills","Total Marks"]
["Adm No.","Roll No.","Name","Class","Section",10,10,10,10,10,10,10,10,10,10,10,10,10,10,10,10,10,10,60,30,10,10,10,{"$f":"SUM(F6:AB6)","v":300}]
[1,null,null,null,null,null,null,null,null,null,null,null,null,null,null,null,null,null,null,null,null,null,null,null,null,null,null,null,0,{"$f":"RANK(AC7,$AC$7:$AC$150,0)","v":1},null,null,null,null,null,null,null,null,null,null,null,null,null,null,null,null,null,"YELLOW","A"]
[2,null,null,null,null,null,null,null,null,null,null,null,null,null,null,null,null,null,null,null,null,null,null,null,null,null,null,null,0,{"$f":"RANK(AC8,$AC$7:$AC$150,0)","v":1},null,null,null,null,null,null,null,null,null,null,null,null,null,null,null,null,null,"FARMERS","B"]
[3,null,null,null,null,null,null,null,null,null,null,null,null,null,null,null,null,null,null,null,null,null,null,null,null,null,null,null,0,1,null,null,null,null,null,null,null,null,null,null,null,null,null,null,null,null,null,"BUS-MABSOUT","C"]
[4,null,null,null,null,null,null,null,null,null,null,null,null,null,null,null,null,null,null,null,null,null,null,null,null,null,null,null,0,1,null,null,null,null,null,null,null,null,null,null,null,null,null,null,null,null,null,"BLOOMERS","D"]
[5,null,null,null,null,null,null,null,null,null,null,null,null,null,null,null,null,null,null,null,null,null,null,null,null,null,null,null,0,1,null,null,null,null,null,null,null,null,null,null,null,null,null,null,null,null,null,"CACTUS","E"]
[6,null,null,null,null,null,null,null,null,null,null,null,null,null,null,null,null,null,null,null,null,null,null,null,null,null,null,null,0,1,null,null,null,null,null,null,null,null,null,null,null,null,null,null,null,null,null,"EDISON","F"]
[7,null,null,null,null,null,null,null,null,null,null,null,null,null,null,null,null,null,null,null,null,null,null,null,null,null,null,null,0,1]
[8,null,null,null,null,null,null,null,null,null,null,null,null,null,null,null,null,null,null,null,null,null,null,null,null,null,null,null,0,1]
[9,null,null,null,null,null,null,null,null,null,null,null,null,null,null,null,null,null,null,null,null,null,null,null,null,null,null,null,0,1]
{"$rows_left_out":90}
{"sheet":"Grade 6","index":6,"n_rows":104,"n_cols":49,"rows_kept":104,"cut":false,"hidden":false,"merged":[[0,26,1,27],[0,28,1,29],[3,5,3,12],[3,14,3,21],[3,29,4,29]]}
[null,null,null,null,null,null,null,null,null,null,null,null,null,"First SEMESTER",null,null,null,null,null,null,null,null,null,null,null,null,"Students Number",null,{"$f":"COUNT(B7:B97)","v":0}]
[null,null,""]
[0,1,2,3,4,5,6,7,8,9,10,11,12,13,14,15,16,17,18,19,20,21,22,23,24,25,26,27,28,29]
[null,null,null,null,null,"Arabic",null,null,null,null,null,null,null,null,"English",null,null,null,null,null,null,null,null,null,null,null,null,null,null,"Rank"]
[null,null,null,null,null,"قراءة","تعبير شفهي","إصغاء","إستظهار","إملاء","قواعد","تحليل نص","تعبير كتابي","خط ونسخ","Reading","Oral Com","Listening","Poem","Dictation","Phonics","Read Com","Writing","Penmanship","Maths","Siences","Sports","Arts","Skills","Total Marks"]
["Adm No.","Roll No.","Name","Class","Section",10,10,10,10,10,10,10,10,10,10,10,10,10,10,10,10,10,10,60,30,10,10,10,{"$f":"SUM(F6:AB6)","v":300}]
[1,null,null,null,null,null,null,null,null,null,null,null,null,null,null,null,null,null,null,null,null,null,null,null,null,null,null,null,0,{"$f":"RANK(AC7,$AC$7:$AC$150,0)","v":1},null,null,null,null,null,null,null,null,null,null,null,null,null,null,null,null,null,"YELLOW","A"]
[2,null,null,null,null,null,null,null,null,null,null,null,null,null,null,null,null,null,null,null,null,null,null,null,null,null,null,null,0,{"$f":"RANK(AC8,$AC$7:$AC$150,0)","v":1},null,null,null,null,null,null,null,null,null,null,null,null,null,null,null,null,null,"FARMERS","B"]
[3,null,null,null,null,null,null,null,null,null,null,null,null,null,null,null,null,null,null,null,null,null,null,null,null,null,null,null,0,1,null,null,null,null,null,null,null,null,null,null,null,null,null,null,null,null,null,"BUS-MABSOUT","C"]
[4,null,null,null,null,null,null,null,null,null,null,null,null,null,null,null,null,null,null,null,null,null,null,null,null,null,null,null,0,1,null,null,null,null,null,null,null,null,null,null,null,null,null,null,null,null,null,"BLOOMERS","D"]
[5,null,null,null,null,null,null,null,null,null,null,null,null,null,null,null,null,null,null,null,null,null,null,null,null,null,null,null,0,1,null,null,null,null,null,null,null,null,null,null,null,null,null,null,null,null,null,"CACTUS","E"]
[6,null,null,null,null,null,null,null,null,null,null,null,null,null,null,null,null,null,null,null,null,null,null,null,null,null,null,null,0,1,null,null,null,null,null,null,null,null,null,null,null,null,null,null,null,null,null,"EDISON","F"]
[7,null,null,null,null,null,null,null,null,null,null,null,null,null,null,null,null,null,null,null,null,null,null,null,null,null,null,null,0,1]
[8,null,null,null,null,null,null,null,null,null,null,null,null,null,null,null,null,null,null,null,null,null,null,null,null,null,null,null,0,1]
[9,null,null,null,null,null,null,null,null,null,null,null,null,null,null,null,null,null,null,null,null,null,null,null,null,null,null,null,0,1]
{"$rows_left_out":90}
{"sheet":"Certificates","index":7,"n_rows":382,"n_cols":18,"rows_kept":382,"cut":false,"hidden":false,"merged":[[22,9,23,12],[8,8,8,16],[9,8,9,16],[7,8,7,16],[4,8,4,16],[375,5,377,6],[311,5,311,6],[313,5,315,6],[317,5,317,6],[320,5,321,6],[324,5,324,6],[327,5,329,6],[279,5,281,6],[299,5,299,6],[365,5,365,6],[368,5,369,6],[372,5,372,6],[125,5,125,6],[180,5,180,6],[183,5,185,6],[203,5,203,6],[209,5,209,6],[87,5,89,6],[107,5,107,6],[113,5,113,6],[119,5,119,6],[121,5,123,6],[176,5,177,6],[128,5,129,6],[132,5,132,6],[135,5,137,6],[217,5,219,6],[215,5,215,6],[167,5,167,6],[173,5,173,6],[155,5,155,6],[161,5,161,6],[169,5,171,6],[347,5,347,6],[353,5,353,6],[359,5,359,6],[361,5,363,6],[221,5,221,6],[224,5,225,6],[305,5,305,6],[228,5,228,6],[231,5,233,6],[251,5,251,6],[257,5,257,6],[263,5,263,6],[265,5,267,6],[269,5,269,6],[272,5,273,6],[276,5,276,6],[73,5,75,6],[77,5,77,6],[80,5,81,6],[84,5,84,6],[59,5,59,6],[65,5,65,6],[71,5,71,6],[36,5,36,6],[39,5,41,6],[11,5,11,6],[17,5,17,6],[23,5,23,6],[25,5,27,6],[29,5,29,6],[32,5,33,6]]}
[]
[]
[]
[]
[null,null,null,null,null,null,null,null,"هل استطيع تحديد بأمر أو كود طباعة كل الشهادات التي تحوي على اسم الصف المطلوب ؟",null,null,null,null,null,null,null,null,1]
["GRATE REPPORT ",null,null,null,null,"DATE :","2021-11-11"]
[]
["NAME ",null,{"$f":"VLOOKUP(F8,Marks!$B$3:$AI$22,2,0)","v":"Omar Ahmad Zein"},null,null,220,"ID No.",null,"هل هناك كود ترحيل البيانات كل صف  الى شيت مختلف ؟ ",null,null,null,null,null,null,null,null,2]
["Class",null,{"$f":"VLOOKUP(F8,Marks!$B$3:$AI$22,3,0)","v":"Grade 1"},null,null,{"$f":"Marks!$A$1","v":"2020-2021"},"Year"]
["Section",null,{"$f":"VLOOKUP(F8,[1]Marks!$B$3:$AI$22,4,0)","v":"A"},null,null,{"$f":"Marks!$N$1","v":"First "},"Semester",null," اعمل على تنسيق اليوزرفورم أيضا   هل هناك كود للطباعة بنفس الشروط ولكن من اليوزر فورم ؟",null,null,null,null,null,null,null,null,3]
[]
["Subjets","Maximum Mark","Chapter Mark","Remarks",null,"Absence"]
[{"$f":"[1]Marks!$F$5","v":"قراءة"},{"$f":"Marks!$F$6","v":10},{"$f":"VLOOKUP(F8,Marks!$B$3:$AI$22,5,0)","v":8}]
[{"$f":"[1]Marks!$G$5","v":"تعبير شفهي"},{"$f":"Marks!$G$6","v":10},{"$f":"VLOOKUP(F8,Marks!$B$3:$AI$22,6,0)","v":2}]
[{"$f":"[1]Marks!$H$5","v":"إصغاء"},{"$f":"Marks!$H$6","v":10},{"$f":"VLOOKUP(F8, Marks!$B$3:$AI$22,7,0)","v":3}]
{"$rows_left_out":367}