{"text_format":"1","workbook":"xlsx","n_sheets":2,"sheets":["Sheet4","1"],"not_rendered":{"charts":0,"images":1,"macros":1,"external_links":1,"defined_names":9,"comments":0,"pivot_tables":0},"unopened":[],"bounds":{"document_bytes":16777216,"sheet_cells":100000,"rows_first":2000,"rows_last":500,"rows_between":2000,"halvings":0,"cell_chars":16384,"cell_head_chars":4096},"cells_cut":0,"cells_raw":0,"read":"whole","date_system":"1900"}

{"sheet":"Sheet4","index":0,"n_rows":22,"n_cols":4,"rows_kept":22,"cut":false,"hidden":false,"merged":[]}
[]
["1 / 1","إبراهيم","المكان","المدرس"]
["1 / 1","أحمد ","1","ه"]
["1 / 1","اشرف ","2","و"]
["1 / 1","جمال ","3","ى"]
["1 / 1","خالد ","4","ز"]
["1 / 1","زياد","5","م"]
["1 / 1","شادى","6","ك"]
["1 / 2","عبد القادر ","7","ن"]
["1 / 2","ققق","8","ا"]
["1 / 2","ففف","9","ل"]
["1 / 3","ببب","10","ب"]
["1 / 3","ؤؤؤ","11","ي"]
["1 / 3","ررر","12","ر"]
["1 / 4","لالالا","13","س"]
["1 / 4","ىىى","14","ش"]
["1 / 4","ووو","15","ص"]
["1 / 4","ةةة","16","ض"]
["1 / 5","كك","17","ق"]
["1 / 5","خخخخ","18","ف"]
["1 / 5","هه","19","غ"]
["1 / 5","تت","20","خ"]

{"sheet":"1","index":1,"n_rows":46,"n_cols":8,"rows_kept":46,"cut":false,"hidden":false,"merged":[]}
[]
[]
[]
[null,"قائمة فصــــــــــل",null,"1 / 1",null,null,null,"1 / 1"]
["#","الاســــــــــــم","المكان","المدرس",null,null,null,"1 / 2"]
[{"$f":"IF(B6=\"\",\"\",MAX($A$5:A5)+1)","v":1},{"$f":"IF(ROWS(B$6:B6)>COUNTIF(Sheet4!$A$3:$A$100,$D$4),\"\",INDEX(Sheet4!B$3:B$100,SMALL(IF(Sheet4!B$3:B$100<>\"\",IF(Sheet4!$A$3:$A$100=$D$4,ROW(B$3:B$100)-ROW($B$3)+1)),ROWS(B$6:B6))))","v":"أحمد "},{"$f":"IF(ROWS(C$6:C6)>COUNTIF(Sheet4!$A$3:$A$100,$D$4),\"\",INDEX(Sheet4!C$3:C$100,SMALL(IF(Sheet4!C$3:C$100<>\"\",IF(Sheet4!$A$3:$A$100=$D$4,ROW(C$3:C$100)-ROW($B$3)+1)),ROWS(C$6:C6))))","v":"1"},{"$f":"IF(ROWS(D$6:D6)>COUNTIF(Sheet4!$A$3:$A$100,$D$4),\"\",INDEX(Sheet4!D$3:D$100,SMALL(IF(Sheet4!D$3:D$100<>\"\",IF(Sheet4!$A$3:$A$100=$D$4,ROW(D$3:D$100)-ROW($B$3)+1)),ROWS(D$6:D6))))","v":"ه"},null,null,null,"1 / 3"]
[{"$f":"IF(B7=\"\",\"\",MAX($A$5:A6)+1)","v":2},{"$f":"IF(ROWS(B$6:B7)>COUNTIF(Sheet4!$A$3:$A$100,$D$4),\"\",INDEX(Sheet4!B$3:B$100,SMALL(IF(Sheet4!B$3:B$100<>\"\",IF(Sheet4!$A$3:$A$100=$D$4,ROW(B$3:B$100)-ROW($B$3)+1)),ROWS(B$6:B7))))","v":"اشرف "},{"$f":"IF(ROWS(C$6:C7)>COUNTIF(Sheet4!$A$3:$A$100,$D$4),\"\",INDEX(Sheet4!C$3:C$100,SMALL(IF(Sheet4!C$3:C$100<>\"\",IF(Sheet4!$A$3:$A$100=$D$4,ROW(C$3:C$100)-ROW($B$3)+1)),ROWS(C$6:C7))))","v":"2"},{"$f":"IF(ROWS(D$6:D7)>COUNTIF(Sheet4!$A$3:$A$100,$D$4),\"\",INDEX(Sheet4!D$3:D$100,SMALL(IF(Sheet4!D$3:D$100<>\"\",IF(Sheet4!$A$3:$A$100=$D$4,ROW(D$3:D$100)-ROW($B$3)+1)),ROWS(D$6:D7))))","v":"و"},null,null,null,"1 / 4"]
[{"$f":"IF(B8=\"\",\"\",MAX($A$5:A7)+1)","v":3},{"$f":"IF(ROWS(B$6:B8)>COUNTIF(Sheet4!$A$3:$A$100,$D$4),\"\",INDEX(Sheet4!B$3:B$100,SMALL(IF(Sheet4!B$3:B$100<>\"\",IF(Sheet4!$A$3:$A$100=$D$4,ROW(B$3:B$100)-ROW($B$3)+1)),ROWS(B$6:B8))))","v":"جمال "},{"$f":"IF(ROWS(C$6:C8)>COUNTIF(Sheet4!$A$3:$A$100,$D$4),\"\",INDEX(Sheet4!C$3:C$100,SMALL(IF(Sheet4!C$3:C$100<>\"\",IF(Sheet4!$A$3:$A$100=$D$4,ROW(C$3:C$100)-ROW($B$3)+1)),ROWS(C$6:C8))))","v":"3"},{"$f":"IF(ROWS(D$6:D8)>COUNTIF(Sheet4!$A$3:$A$100,$D$4),\"\",INDEX(Sheet4!D$3:D$100,SMALL(IF(Sheet4!D$3:D$100<>\"\",IF(Sheet4!$A$3:$A$100=$D$4,ROW(D$3:D$100)-ROW($B$3)+1)),ROWS(D$6:D8))))","v":"ى"},null,null,null,"1 / 5"]
[{"$f":"IF(B9=\"\",\"\",MAX($A$5:A8)+1)","v":4},{"$f":"IF(ROWS(B$6:B9)>COUNTIF(Sheet4!$A$3:$A$100,$D$4),\"\",INDEX(Sheet4!B$3:B$100,SMALL(IF(Sheet4!B$3:B$100<>\"\",IF(Sheet4!$A$3:$A$100=$D$4,ROW(B$3:B$100)-ROW($B$3)+1)),ROWS(B$6:B9))))","v":"خالد "},{"$f":"IF(ROWS(C$6:C9)>COUNTIF(Sheet4!$A$3:$A$100,$D$4),\"\",INDEX(Sheet4!C$3:C$100,SMALL(IF(Sheet4!C$3:C$100<>\"\",IF(Sheet4!$A$3:$A$100=$D$4,ROW(C$3:C$100)-ROW($B$3)+1)),ROWS(C$6:C9))))","v":"4"},{"$f":"IF(ROWS(D$6:D9)>COUNTIF(Sheet4!$A$3:$A$100,$D$4),\"\",INDEX(Sheet4!D$3:D$100,SMALL(IF(Sheet4!D$3:D$100<>\"\",IF(Sheet4!$A$3:$A$100=$D$4,ROW(D$3:D$100)-ROW($B$3)+1)),ROWS(D$6:D9))))","v":"ز"},null,null,null,"1 / 6"]
[{"$f":"IF(B10=\"\",\"\",MAX($A$5:A9)+1)","v":5},{"$f":"IF(ROWS(B$6:B10)>COUNTIF(Sheet4!$A$3:$A$100,$D$4),\"\",INDEX(Sheet4!B$3:B$100,SMALL(IF(Sheet4!B$3:B$100<>\"\",IF(Sheet4!$A$3:$A$100=$D$4,ROW(B$3:B$100)-ROW($B$3)+1)),ROWS(B$6:B10))))","v":"زياد"},{"$f":"IF(ROWS(C$6:C10)>COUNTIF(Sheet4!$A$3:$A$100,$D$4),\"\",INDEX(Sheet4!C$3:C$100,SMALL(IF(Sheet4!C$3:C$100<>\"\",IF(Sheet4!$A$3:$A$100=$D$4,ROW(C$3:C$100)-ROW($B$3)+1)),ROWS(C$6:C10))))","v":"5"},{"$f":"IF(ROWS(D$6:D10)>COUNTIF(Sheet4!$A$3:$A$100,$D$4),\"\",INDEX(Sheet4!D$3:D$100,SMALL(IF(Sheet4!D$3:D$100<>\"\",IF(Sheet4!$A$3:$A$100=$D$4,ROW(D$3:D$100)-ROW($B$3)+1)),ROWS(D$6:D10))))","v":"م"},null,null,null,"1 / 7 "]
[{"$f":"IF(B11=\"\",\"\",MAX($A$5:A10)+1)","v":6},{"$f":"IF(ROWS(B$6:B11)>COUNTIF(Sheet4!$A$3:$A$100,$D$4),\"\",INDEX(Sheet4!B$3:B$100,SMALL(IF(Sheet4!B$3:B$100<>\"\",IF(Sheet4!$A$3:$A$100=$D$4,ROW(B$3:B$100)-ROW($B$3)+1)),ROWS(B$6:B11))))","v":"شادى"},{"$f":"IF(ROWS(C$6:C11)>COUNTIF(Sheet4!$A$3:$A$100,$D$4),\"\",INDEX(Sheet4!C$3:C$100,SMALL(IF(Sheet4!C$3:C$100<>\"\",IF(Sheet4!$A$3:$A$100=$D$4,ROW(C$3:C$100)-ROW($B$3)+1)),ROWS(C$6:C11))))","v":"6"},{"$f":"IF(ROWS(D$6:D11)>COUNTIF(Sheet4!$A$3:$A$100,$D$4),\"\",INDEX(Sheet4!D$3:D$100,SMALL(IF(Sheet4!D$3:D$100<>\"\",IF(Sheet4!$A$3:$A$100=$D$4,ROW(D$3:D$100)-ROW($B$3)+1)),ROWS(D$6:D11))))","v":"ك"},null,null,null,"1 / 8"]
[{"$f":"IF(B12=\"\",\"\",MAX($A$5:A11)+1)","v":""},{"$f":"IF(ROWS(B$6:B12)>COUNTIF(Sheet4!$A$3:$A$100,$D$4),\"\",INDEX(Sheet4!B$3:B$100,SMALL(IF(Sheet4!B$3:B$100<>\"\",IF(Sheet4!$A$3:$A$100=$D$4,ROW(B$3:B$100)-ROW($B$3)+1)),ROWS(B$6:B12))))","v":""},{"$f":"IF(ROWS(C$6:C12)>COUNTIF(Sheet4!$A$3:$A$100,$D$4),\"\",INDEX(Sheet4!C$3:C$100,SMALL(IF(Sheet4!C$3:C$100<>\"\",IF(Sheet4!$A$3:$A$100=$D$4,ROW(C$3:C$100)-ROW($B$3)+1)),ROWS(C$6:C12))))","v":""},{"$f":"IF(ROWS(D$6:D12)>COUNTIF(Sheet4!$A$3:$A$100,$D$4),\"\",INDEX(Sheet4!D$3:D$100,SMALL(IF(Sheet4!D$3:D$100<>\"\",IF(Sheet4!$A$3:$A$100=$D$4,ROW(D$3:D$100)-ROW($B$3)+1)),ROWS(D$6:D12))))","v":""},null,null,null,"1 / 9"]
[{"$f":"IF(B13=\"\",\"\",MAX($A$5:A12)+1)","v":""},{"$f":"IF(ROWS(B$6:B13)>COUNTIF(Sheet4!$A$3:$A$100,$D$4),\"\",INDEX(Sheet4!B$3:B$100,SMALL(IF(Sheet4!B$3:B$100<>\"\",IF(Sheet4!$A$3:$A$100=$D$4,ROW(B$3:B$100)-ROW($B$3)+1)),ROWS(B$6:B13))))","v":""},{"$f":"IF(ROWS(C$6:C13)>COUNTIF(Sheet4!$A$3:$A$100,$D$4),\"\",INDEX(Sheet4!C$3:C$100,SMALL(IF(Sheet4!C$3:C$100<>\"\",IF(Sheet4!$A$3:$A$100=$D$4,ROW(C$3:C$100)-ROW($B$3)+1)),ROWS(C$6:C13))))","v":""},{"$f":"IF(ROWS(D$6:D13)>COUNTIF(Sheet4!$A$3:$A$100,$D$4),\"\",INDEX(Sheet4!D$3:D$100,SMALL(IF(Sheet4!D$3:D$100<>\"\",IF(Sheet4!$A$3:$A$100=$D$4,ROW(D$3:D$100)-ROW($B$3)+1)),ROWS(D$6:D13))))","v":""},null,null,null,"1 / 10"]
[{"$f":"IF(B14=\"\",\"\",MAX($A$5:A13)+1)","v":""},{"$f":"IF(ROWS(B$6:B14)>COUNTIF(Sheet4!$A$3:$A$100,$D$4),\"\",INDEX(Sheet4!B$3:B$100,SMALL(IF(Sheet4!B$3:B$100<>\"\",IF(Sheet4!$A$3:$A$100=$D$4,ROW(B$3:B$100)-ROW($B$3)+1)),ROWS(B$6:B14))))","v":""},{"$f":"IF(ROWS(C$6:C14)>COUNTIF(Sheet4!$A$3:$A$100,$D$4),\"\",INDEX(Sheet4!C$3:C$100,SMALL(IF(Sheet4!C$3:C$100<>\"\",IF(Sheet4!$A$3:$A$100=$D$4,ROW(C$3:C$100)-ROW($B$3)+1)),ROWS(C$6:C14))))","v":""},{"$f":"IF(ROWS(D$6:D14)>COUNTIF(Sheet4!$A$3:$A$100,$D$4),\"\",INDEX(Sheet4!D$3:D$100,SMALL(IF(Sheet4!D$3:D$100<>\"\",IF(Sheet4!$A$3:$A$100=$D$4,ROW(D$3:D$100)-ROW($B$3)+1)),ROWS(D$6:D14))))","v":""},null,null,null,"1 / 11"]
[{"$f":"IF(B15=\"\",\"\",MAX($A$5:A14)+1)","v":""},{"$f":"IF(ROWS(B$6:B15)>COUNTIF(Sheet4!$A$3:$A$100,$D$4),\"\",INDEX(Sheet4!B$3:B$100,SMALL(IF(Sheet4!B$3:B$100<>\"\",IF(Sheet4!$A$3:$A$100=$D$4,ROW(B$3:B$100)-ROW($B$3)+1)),ROWS(B$6:B15))))","v":""},{"$f":"IF(ROWS(C$6:C15)>COUNTIF(Sheet4!$A$3:$A$100,$D$4),\"\",INDEX(Sheet4!C$3:C$100,SMALL(IF(Sheet4!C$3:C$100<>\"\",IF(Sheet4!$A$3:$A$100=$D$4,ROW(C$3:C$100)-ROW($B$3)+1)),ROWS(C$6:C15))))","v":""},{"$f":"IF(ROWS(D$6:D15)>COUNTIF(Sheet4!$A$3:$A$100,$D$4),\"\",INDEX(Sheet4!D$3:D$100,SMALL(IF(Sheet4!D$3:D$100<>\"\",IF(Sheet4!$A$3:$A$100=$D$4,ROW(D$3:D$100)-ROW($B$3)+1)),ROWS(D$6:D15))))","v":""},null,null,null,"1 / 12"]
[{"$f":"IF(B16=\"\",\"\",MAX($A$5:A15)+1)","v":""},{"$f":"IF(ROWS(B$6:B16)>COUNTIF(Sheet4!$A$3:$A$100,$D$4),\"\",INDEX(Sheet4!B$3:B$100,SMALL(IF(Sheet4!B$3:B$100<>\"\",IF(Sheet4!$A$3:$A$100=$D$4,ROW(B$3:B$100)-ROW($B$3)+1)),ROWS(B$6:B16))))","v":""},{"$f":"IF(ROWS(C$6:C16)>COUNTIF(Sheet4!$A$3:$A$100,$D$4),\"\",INDEX(Sheet4!C$3:C$100,SMALL(IF(Sheet4!C$3:C$100<>\"\",IF(Sheet4!$A$3:$A$100=$D$4,ROW(C$3:C$100)-ROW($B$3)+1)),ROWS(C$6:C16))))","v":""},{"$f":"IF(ROWS(D$6:D16)>COUNTIF(Sheet4!$A$3:$A$100,$D$4),\"\",INDEX(Sheet4!D$3:D$100,SMALL(IF(Sheet4!D$3:D$100<>\"\",IF(Sheet4!$A$3:$A$100=$D$4,ROW(D$3:D$100)-ROW($B$3)+1)),ROWS(D$6:D16))))","v":""},null,null,null,"1 / 13"]
[{"$f":"IF(B17=\"\",\"\",MAX($A$5:A16)+1)","v":""},{"$f":"IF(ROWS(B$6:B17)>COUNTIF(Sheet4!$A$3:$A$100,$D$4),\"\",INDEX(Sheet4!B$3:B$100,SMALL(IF(Sheet4!B$3:B$100<>\"\",IF(Sheet4!$A$3:$A$100=$D$4,ROW(B$3:B$100)-ROW($B$3)+1)),ROWS(B$6:B17))))","v":""},{"$f":"IF(ROWS(C$6:C17)>COUNTIF(Sheet4!$A$3:$A$100,$D$4),\"\",INDEX(Sheet4!C$3:C$100,SMALL(IF(Sheet4!C$3:C$100<>\"\",IF(Sheet4!$A$3:$A$100=$D$4,ROW(C$3:C$100)-ROW($B$3)+1)),ROWS(C$6:C17))))","v":""},{"$f":"IF(ROWS(D$6:D17)>COUNTIF(Sheet4!$A$3:$A$100,$D$4),\"\",INDEX(Sheet4!D$3:D$100,SMALL(IF(Sheet4!D$3:D$100<>\"\",IF(Sheet4!$A$3:$A$100=$D$4,ROW(D$3:D$100)-ROW($B$3)+1)),ROWS(D$6:D17))))","v":""},null,null,null,"1 / 14"]
[{"$f":"IF(B18=\"\",\"\",MAX($A$5:A17)+1)","v":""},{"$f":"IF(ROWS(B$6:B18)>COUNTIF(Sheet4!$A$3:$A$100,$D$4),\"\",INDEX(Sheet4!B$3:B$100,SMALL(IF(Sheet4!B$3:B$100<>\"\",IF(Sheet4!$A$3:$A$100=$D$4,ROW(B$3:B$100)-ROW($B$3)+1)),ROWS(B$6:B18))))","v":""},{"$f":"IF(ROWS(C$6:C18)>COUNTIF(Sheet4!$A$3:$A$100,$D$4),\"\",INDEX(Sheet4!C$3:C$100,SMALL(IF(Sheet4!C$3:C$100<>\"\",IF(Sheet4!$A$3:$A$100=$D$4,ROW(C$3:C$100)-ROW($B$3)+1)),ROWS(C$6:C18))))","v":""},{"$f":"IF(ROWS(D$6:D18)>COUNTIF(Sheet4!$A$3:$A$100,$D$4),\"\",INDEX(Sheet4!D$3:D$100,SMALL(IF(Sheet4!D$3:D$100<>\"\",IF(Sheet4!$A$3:$A$100=$D$4,ROW(D$3:D$100)-ROW($B$3)+1)),ROWS(D$6:D18))))","v":""},null,null,null,"1 / 15"]
[{"$f":"IF(B19=\"\",\"\",MAX($A$5:A18)+1)","v":""},{"$f":"IF(ROWS(B$6:B19)>COUNTIF(Sheet4!$A$3:$A$100,$D$4),\"\",INDEX(Sheet4!B$3:B$100,SMALL(IF(Sheet4!B$3:B$100<>\"\",IF(Sheet4!$A$3:$A$100=$D$4,ROW(B$3:B$100)-ROW($B$3)+1)),ROWS(B$6:B19))))","v":""},{"$f":"IF(ROWS(C$6:C19)>COUNTIF(Sheet4!$A$3:$A$100,$D$4),\"\",INDEX(Sheet4!C$3:C$100,SMALL(IF(Sheet4!C$3:C$100<>\"\",IF(Sheet4!$A$3:$A$100=$D$4,ROW(C$3:C$100)-ROW($B$3)+1)),ROWS(C$6:C19))))","v":""},{"$f":"IF(ROWS(D$6:D19)>COUNTIF(Sheet4!$A$3:$A$100,$D$4),\"\",INDEX(Sheet4!D$3:D$100,SMALL(IF(Sheet4!D$3:D$100<>\"\",IF(Sheet4!$A$3:$A$100=$D$4,ROW(D$3:D$100)-ROW($B$3)+1)),ROWS(D$6:D19))))","v":""},null,null,null,"1 / 16"]
[{"$f":"IF(B20=\"\",\"\",MAX($A$5:A19)+1)","v":""},{"$f":"IF(ROWS(B$6:B20)>COUNTIF(Sheet4!$A$3:$A$100,$D$4),\"\",INDEX(Sheet4!B$3:B$100,SMALL(IF(Sheet4!B$3:B$100<>\"\",IF(Sheet4!$A$3:$A$100=$D$4,ROW(B$3:B$100)-ROW($B$3)+1)),ROWS(B$6:B20))))","v":""},{"$f":"IF(ROWS(C$6:C20)>COUNTIF(Sheet4!$A$3:$A$100,$D$4),\"\",INDEX(Sheet4!C$3:C$100,SMALL(IF(Sheet4!C$3:C$100<>\"\",IF(Sheet4!$A$3:$A$100=$D$4,ROW(C$3:C$100)-ROW($B$3)+1)),ROWS(C$6:C20))))","v":""},{"$f":"IF(ROWS(D$6:D20)>COUNTIF(Sheet4!$A$3:$A$100,$D$4),\"\",INDEX(Sheet4!D$3:D$100,SMALL(IF(Sheet4!D$3:D$100<>\"\",IF(Sheet4!$A$3:$A$100=$D$4,ROW(D$3:D$100)-ROW($B$3)+1)),ROWS(D$6:D20))))","v":""},null,null,null,"1 / 17"]
[{"$f":"IF(B21=\"\",\"\",MAX($A$5:A20)+1)","v":""},{"$f":"IF(ROWS(B$6:B21)>COUNTIF(Sheet4!$A$3:$A$100,$D$4),\"\",INDEX(Sheet4!B$3:B$100,SMALL(IF(Sheet4!B$3:B$100<>\"\",IF(Sheet4!$A$3:$A$100=$D$4,ROW(B$3:B$100)-ROW($B$3)+1)),ROWS(B$6:B21))))","v":""},{"$f":"IF(ROWS(C$6:C21)>COUNTIF(Sheet4!$A$3:$A$100,$D$4),\"\",INDEX(Sheet4!C$3:C$100,SMALL(IF(Sheet4!C$3:C$100<>\"\",IF(Sheet4!$A$3:$A$100=$D$4,ROW(C$3:C$100)-ROW($B$3)+1)),ROWS(C$6:C21))))","v":""},{"$f":"IF(ROWS(D$6:D21)>COUNTIF(Sheet4!$A$3:$A$100,$D$4),\"\",INDEX(Sheet4!D$3:D$100,SMALL(IF(Sheet4!D$3:D$100<>\"\",IF(Sheet4!$A$3:$A$100=$D$4,ROW(D$3:D$100)-ROW($B$3)+1)),ROWS(D$6:D21))))","v":""},null,null,null,"1 / 18"]
[{"$f":"IF(B22=\"\",\"\",MAX($A$5:A21)+1)","v":""},{"$f":"IF(ROWS(B$6:B22)>COUNTIF(Sheet4!$A$3:$A$100,$D$4),\"\",INDEX(Sheet4!B$3:B$100,SMALL(IF(Sheet4!B$3:B$100<>\"\",IF(Sheet4!$A$3:$A$100=$D$4,ROW(B$3:B$100)-ROW($B$3)+1)),ROWS(B$6:B22))))","v":""},{"$f":"IF(ROWS(C$6:C22)>COUNTIF(Sheet4!$A$3:$A$100,$D$4),\"\",INDEX(Sheet4!C$3:C$100,SMALL(IF(Sheet4!C$3:C$100<>\"\",IF(Sheet4!$A$3:$A$100=$D$4,ROW(C$3:C$100)-ROW($B$3)+1)),ROWS(C$6:C22))))","v":""},{"$f":"IF(ROWS(D$6:D22)>COUNTIF(Sheet4!$A$3:$A$100,$D$4),\"\",INDEX(Sheet4!D$3:D$100,SMALL(IF(Sheet4!D$3:D$100<>\"\",IF(Sheet4!$A$3:$A$100=$D$4,ROW(D$3:D$100)-ROW($B$3)+1)),ROWS(D$6:D22))))","v":""}]
[{"$f":"IF(B23=\"\",\"\",MAX($A$5:A22)+1)","v":""},{"$f":"IF(ROWS(B$6:B23)>COUNTIF(Sheet4!$A$3:$A$100,$D$4),\"\",INDEX(Sheet4!B$3:B$100,SMALL(IF(Sheet4!B$3:B$100<>\"\",IF(Sheet4!$A$3:$A$100=$D$4,ROW(B$3:B$100)-ROW($B$3)+1)),ROWS(B$6:B23))))","v":""},{"$f":"IF(ROWS(C$6:C23)>COUNTIF(Sheet4!$A$3:$A$100,$D$4),\"\",INDEX(Sheet4!C$3:C$100,SMALL(IF(Sheet4!C$3:C$100<>\"\",IF(Sheet4!$A$3:$A$100=$D$4,ROW(C$3:C$100)-ROW($B$3)+1)),ROWS(C$6:C23))))","v":""},{"$f":"IF(ROWS(D$6:D23)>COUNTIF(Sheet4!$A$3:$A$100,$D$4),\"\",INDEX(Sheet4!D$3:D$100,SMALL(IF(Sheet4!D$3:D$100<>\"\",IF(Sheet4!$A$3:$A$100=$D$4,ROW(D$3:D$100)-ROW($B$3)+1)),ROWS(D$6:D23))))","v":""}]
[{"$f":"IF(B24=\"\",\"\",MAX($A$5:A23)+1)","v":""},{"$f":"IF(ROWS(B$6:B24)>COUNTIF(Sheet4!$A$3:$A$100,$D$4),\"\",INDEX(Sheet4!B$3:B$100,SMALL(IF(Sheet4!B$3:B$100<>\"\",IF(Sheet4!$A$3:$A$100=$D$4,ROW(B$3:B$100)-ROW($B$3)+1)),ROWS(B$6:B24))))","v":""},{"$f":"IF(ROWS(C$6:C24)>COUNTIF(Sheet4!$A$3:$A$100,$D$4),\"\",INDEX(Sheet4!C$3:C$100,SMALL(IF(Sheet4!C$3:C$100<>\"\",IF(Sheet4!$A$3:$A$100=$D$4,ROW(C$3:C$100)-ROW($B$3)+1)),ROWS(C$6:C24))))","v":""},{"$f":"IF(ROWS(D$6:D24)>COUNTIF(Sheet4!$A$3:$A$100,$D$4),\"\",INDEX(Sheet4!D$3:D$100,SMALL(IF(Sheet4!D$3:D$100<>\"\",IF(Sheet4!$A$3:$A$100=$D$4,ROW(D$3:D$100)-ROW($B$3)+1)),ROWS(D$6:D24))))","v":""}]
[{"$f":"IF(B25=\"\",\"\",MAX($A$5:A24)+1)","v":""},{"$f":"IF(ROWS(B$6:B25)>COUNTIF(Sheet4!$A$3:$A$100,$D$4),\"\",INDEX(Sheet4!B$3:B$100,SMALL(IF(Sheet4!B$3:B$100<>\"\",IF(Sheet4!$A$3:$A$100=$D$4,ROW(B$3:B$100)-ROW($B$3)+1)),ROWS(B$6:B25))))","v":""},{"$f":"IF(ROWS(C$6:C25)>COUNTIF(Sheet4!$A$3:$A$100,$D$4),\"\",INDEX(Sheet4!C$3:C$100,SMALL(IF(Sheet4!C$3:C$100<>\"\",IF(Sheet4!$A$3:$A$100=$D$4,ROW(C$3:C$100)-ROW($B$3)+1)),ROWS(C$6:C25))))","v":""},{"$f":"IF(ROWS(D$6:D25)>COUNTIF(Sheet4!$A$3:$A$100,$D$4),\"\",INDEX(Sheet4!D$3:D$100,SMALL(IF(Sheet4!D$3:D$100<>\"\",IF(Sheet4!$A$3:$A$100=$D$4,ROW(D$3:D$100)-ROW($B$3)+1)),ROWS(D$6:D25))))","v":""}]
[{"$f":"IF(B26=\"\",\"\",MAX($A$5:A25)+1)","v":""},{"$f":"IF(ROWS(B$6:B26)>COUNTIF(Sheet4!$A$3:$A$100,$D$4),\"\",INDEX(Sheet4!B$3:B$100,SMALL(IF(Sheet4!B$3:B$100<>\"\",IF(Sheet4!$A$3:$A$100=$D$4,ROW(B$3:B$100)-ROW($B$3)+1)),ROWS(B$6:B26))))","v":""},{"$f":"IF(ROWS(C$6:C26)>COUNTIF(Sheet4!$A$3:$A$100,$D$4),\"\",INDEX(Sheet4!C$3:C$100,SMALL(IF(Sheet4!C$3:C$100<>\"\",IF(Sheet4!$A$3:$A$100=$D$4,ROW(C$3:C$100)-ROW($B$3)+1)),ROWS(C$6:C26))))","v":""},{"$f":"IF(ROWS(D$6:D26)>COUNTIF(Sheet4!$A$3:$A$100,$D$4),\"\",INDEX(Sheet4!D$3:D$100,SMALL(IF(Sheet4!D$3:D$100<>\"\",IF(Sheet4!$A$3:$A$100=$D$4,ROW(D$3:D$100)-ROW($B$3)+1)),ROWS(D$6:D26))))","v":""}]
[{"$f":"IF(B27=\"\",\"\",MAX($A$5:A26)+1)","v":""},{"$f":"IF(ROWS(B$6:B27)>COUNTIF(Sheet4!$A$3:$A$100,$D$4),\"\",INDEX(Sheet4!B$3:B$100,SMALL(IF(Sheet4!B$3:B$100<>\"\",IF(Sheet4!$A$3:$A$100=$D$4,ROW(B$3:B$100)-ROW($B$3)+1)),ROWS(B$6:B27))))","v":""},{"$f":"IF(ROWS(C$6:C27)>COUNTIF(Sheet4!$A$3:$A$100,$D$4),\"\",INDEX(Sheet4!C$3:C$100,SMALL(IF(Sheet4!C$3:C$100<>\"\",IF(Sheet4!$A$3:$A$100=$D$4,ROW(C$3:C$100)-ROW($B$3)+1)),ROWS(C$6:C27))))","v":""},{"$f":"IF(ROWS(D$6:D27)>COUNTIF(Sheet4!$A$3:$A$100,$D$4),\"\",INDEX(Sheet4!D$3:D$100,SMALL(IF(Sheet4!D$3:D$100<>\"\",IF(Sheet4!$A$3:$A$100=$D$4,ROW(D$3:D$100)-ROW($B$3)+1)),ROWS(D$6:D27))))","v":""}]
[{"$f":"IF(B28=\"\",\"\",MAX($A$5:A27)+1)","v":""},{"$f":"IF(ROWS(B$6:B28)>COUNTIF(Sheet4!$A$3:$A$100,$D$4),\"\",INDEX(Sheet4!B$3:B$100,SMALL(IF(Sheet4!B$3:B$100<>\"\",IF(Sheet4!$A$3:$A$100=$D$4,ROW(B$3:B$100)-ROW($B$3)+1)),ROWS(B$6:B28))))","v":""},{"$f":"IF(ROWS(C$6:C28)>COUNTIF(Sheet4!$A$3:$A$100,$D$4),\"\",INDEX(Sheet4!C$3:C$100,SMALL(IF(Sheet4!C$3:C$100<>\"\",IF(Sheet4!$A$3:$A$100=$D$4,ROW(C$3:C$100)-ROW($B$3)+1)),ROWS(C$6:C28))))","v":""},{"$f":"IF(ROWS(D$6:D28)>COUNTIF(Sheet4!$A$3:$A$100,$D$4),\"\",INDEX(Sheet4!D$3:D$100,SMALL(IF(Sheet4!D$3:D$100<>\"\",IF(Sheet4!$A$3:$A$100=$D$4,ROW(D$3:D$100)-ROW($B$3)+1)),ROWS(D$6:D28))))","v":""}]
[{"$f":"IF(B29=\"\",\"\",MAX($A$5:A28)+1)","v":""},{"$f":"IF(ROWS(B$6:B29)>COUNTIF(Sheet4!$A$3:$A$100,$D$4),\"\",INDEX(Sheet4!B$3:B$100,SMALL(IF(Sheet4!B$3:B$100<>\"\",IF(Sheet4!$A$3:$A$100=$D$4,ROW(B$3:B$100)-ROW($B$3)+1)),ROWS(B$6:B29))))","v":""},{"$f":"IF(ROWS(C$6:C29)>COUNTIF(Sheet4!$A$3:$A$100,$D$4),\"\",INDEX(Sheet4!C$3:C$100,SMALL(IF(Sheet4!C$3:C$100<>\"\",IF(Sheet4!$A$3:$A$100=$D$4,ROW(C$3:C$100)-ROW($B$3)+1)),ROWS(C$6:C29))))","v":""},{"$f":"IF(ROWS(D$6:D29)>COUNTIF(Sheet4!$A$3:$A$100,$D$4),\"\",INDEX(Sheet4!D$3:D$100,SMALL(IF(Sheet4!D$3:D$100<>\"\",IF(Sheet4!$A$3:$A$100=$D$4,ROW(D$3:D$100)-ROW($B$3)+1)),ROWS(D$6:D29))))","v":""}]
[{"$f":"IF(B30=\"\",\"\",MAX($A$5:A29)+1)","v":""},{"$f":"IF(ROWS(B$6:B30)>COUNTIF(Sheet4!$A$3:$A$100,$D$4),\"\",INDEX(Sheet4!B$3:B$100,SMALL(IF(Sheet4!B$3:B$100<>\"\",IF(Sheet4!$A$3:$A$100=$D$4,ROW(B$3:B$100)-ROW($B$3)+1)),ROWS(B$6:B30))))","v":""},{"$f":"IF(ROWS(C$6:C30)>COUNTIF(Sheet4!$A$3:$A$100,$D$4),\"\",INDEX(Sheet4!C$3:C$100,SMALL(IF(Sheet4!C$3:C$100<>\"\",IF(Sheet4!$A$3:$A$100=$D$4,ROW(C$3:C$100)-ROW($B$3)+1)),ROWS(C$6:C30))))","v":""},{"$f":"IF(ROWS(D$6:D30)>COUNTIF(Sheet4!$A$3:$A$100,$D$4),\"\",INDEX(Sheet4!D$3:D$100,SMALL(IF(Sheet4!D$3:D$100<>\"\",IF(Sheet4!$A$3:$A$100=$D$4,ROW(D$3:D$100)-ROW($B$3)+1)),ROWS(D$6:D30))))","v":""}]
[{"$f":"IF(B31=\"\",\"\",MAX($A$5:A30)+1)","v":""},{"$f":"IF(ROWS(B$6:B31)>COUNTIF(Sheet4!$A$3:$A$100,$D$4),\"\",INDEX(Sheet4!B$3:B$100,SMALL(IF(Sheet4!B$3:B$100<>\"\",IF(Sheet4!$A$3:$A$100=$D$4,ROW(B$3:B$100)-ROW($B$3)+1)),ROWS(B$6:B31))))","v":""},{"$f":"IF(ROWS(C$6:C31)>COUNTIF(Sheet4!$A$3:$A$100,$D$4),\"\",INDEX(Sheet4!C$3:C$100,SMALL(IF(Sheet4!C$3:C$100<>\"\",IF(Sheet4!$A$3:$A$100=$D$4,ROW(C$3:C$100)-ROW($B$3)+1)),ROWS(C$6:C31))))","v":""},{"$f":"IF(ROWS(D$6:D31)>COUNTIF(Sheet4!$A$3:$A$100,$D$4),\"\",INDEX(Sheet4!D$3:D$100,SMALL(IF(Sheet4!D$3:D$100<>\"\",IF(Sheet4!$A$3:$A$100=$D$4,ROW(D$3:D$100)-ROW($B$3)+1)),ROWS(D$6:D31))))","v":""}]
[{"$f":"IF(B32=\"\",\"\",MAX($A$5:A31)+1)","v":""},{"$f":"IF(ROWS(B$6:B32)>COUNTIF(Sheet4!$A$3:$A$100,$D$4),\"\",INDEX(Sheet4!B$3:B$100,SMALL(IF(Sheet4!B$3:B$100<>\"\",IF(Sheet4!$A$3:$A$100=$D$4,ROW(B$3:B$100)-ROW($B$3)+1)),ROWS(B$6:B32))))","v":""},{"$f":"IF(ROWS(C$6:C32)>COUNTIF(Sheet4!$A$3:$A$100,$D$4),\"\",INDEX(Sheet4!C$3:C$100,SMALL(IF(Sheet4!C$3:C$100<>\"\",IF(Sheet4!$A$3:$A$100=$D$4,ROW(C$3:C$100)-ROW($B$3)+1)),ROWS(C$6:C32))))","v":""},{"$f":"IF(ROWS(D$6:D32)>COUNTIF(Sheet4!$A$3:$A$100,$D$4),\"\",INDEX(Sheet4!D$3:D$100,SMALL(IF(Sheet4!D$3:D$100<>\"\",IF(Sheet4!$A$3:$A$100=$D$4,ROW(D$3:D$100)-ROW($B$3)+1)),ROWS(D$6:D32))))","v":""}]
[{"$f":"IF(B33=\"\",\"\",MAX($A$5:A32)+1)","v":""},{"$f":"IF(ROWS(B$6:B33)>COUNTIF(Sheet4!$A$3:$A$100,$D$4),\"\",INDEX(Sheet4!B$3:B$100,SMALL(IF(Sheet4!B$3:B$100<>\"\",IF(Sheet4!$A$3:$A$100=$D$4,ROW(B$3:B$100)-ROW($B$3)+1)),ROWS(B$6:B33))))","v":""},{"$f":"IF(ROWS(C$6:C33)>COUNTIF(Sheet4!$A$3:$A$100,$D$4),\"\",INDEX(Sheet4!C$3:C$100,SMALL(IF(Sheet4!C$3:C$100<>\"\",IF(Sheet4!$A$3:$A$100=$D$4,ROW(C$3:C$100)-ROW($B$3)+1)),ROWS(C$6:C33))))","v":""},{"$f":"IF(ROWS(D$6:D33)>COUNTIF(Sheet4!$A$3:$A$100,$D$4),\"\",INDEX(Sheet4!D$3:D$100,SMALL(IF(Sheet4!D$3:D$100<>\"\",IF(Sheet4!$A$3:$A$100=$D$4,ROW(D$3:D$100)-ROW($B$3)+1)),ROWS(D$6:D33))))","v":""}]
[{"$f":"IF(B34=\"\",\"\",MAX($A$5:A33)+1)","v":""},{"$f":"IF(ROWS(B$6:B34)>COUNTIF(Sheet4!$A$3:$A$100,$D$4),\"\",INDEX(Sheet4!B$3:B$100,SMALL(IF(Sheet4!B$3:B$100<>\"\",IF(Sheet4!$A$3:$A$100=$D$4,ROW(B$3:B$100)-ROW($B$3)+1)),ROWS(B$6:B34))))","v":""},{"$f":"IF(ROWS(C$6:C34)>COUNTIF(Sheet4!$A$3:$A$100,$D$4),\"\",INDEX(Sheet4!C$3:C$100,SMALL(IF(Sheet4!C$3:C$100<>\"\",IF(Sheet4!$A$3:$A$100=$D$4,ROW(C$3:C$100)-ROW($B$3)+1)),ROWS(C$6:C34))))","v":""},{"$f":"IF(ROWS(D$6:D34)>COUNTIF(Sheet4!$A$3:$A$100,$D$4),\"\",INDEX(Sheet4!D$3:D$100,SMALL(IF(Sheet4!D$3:D$100<>\"\",IF(Sheet4!$A$3:$A$100=$D$4,ROW(D$3:D$100)-ROW($B$3)+1)),ROWS(D$6:D34))))","v":""}]
[{"$f":"IF(B35=\"\",\"\",MAX($A$5:A34)+1)","v":""},{"$f":"IF(ROWS(B$6:B35)>COUNTIF(Sheet4!$A$3:$A$100,$D$4),\"\",INDEX(Sheet4!B$3:B$100,SMALL(IF(Sheet4!B$3:B$100<>\"\",IF(Sheet4!$A$3:$A$100=$D$4,ROW(B$3:B$100)-ROW($B$3)+1)),ROWS(B$6:B35))))","v":""},{"$f":"IF(ROWS(C$6:C35)>COUNTIF(Sheet4!$A$3:$A$100,$D$4),\"\",INDEX(Sheet4!C$3:C$100,SMALL(IF(Sheet4!C$3:C$100<>\"\",IF(Sheet4!$A$3:$A$100=$D$4,ROW(C$3:C$100)-ROW($B$3)+1)),ROWS(C$6:C35))))","v":""},{"$f":"IF(ROWS(D$6:D35)>COUNTIF(Sheet4!$A$3:$A$100,$D$4),\"\",INDEX(Sheet4!D$3:D$100,SMALL(IF(Sheet4!D$3:D$100<>\"\",IF(Sheet4!$A$3:$A$100=$D$4,ROW(D$3:D$100)-ROW($B$3)+1)),ROWS(D$6:D35))))","v":""}]
[{"$f":"IF(B36=\"\",\"\",MAX($A$5:A35)+1)","v":""},{"$f":"IF(ROWS(B$6:B36)>COUNTIF(Sheet4!$A$3:$A$100,$D$4),\"\",INDEX(Sheet4!B$3:B$100,SMALL(IF(Sheet4!B$3:B$100<>\"\",IF(Sheet4!$A$3:$A$100=$D$4,ROW(B$3:B$100)-ROW($B$3)+1)),ROWS(B$6:B36))))","v":""},{"$f":"IF(ROWS(C$6:C36)>COUNTIF(Sheet4!$A$3:$A$100,$D$4),\"\",INDEX(Sheet4!C$3:C$100,SMALL(IF(Sheet4!C$3:C$100<>\"\",IF(Sheet4!$A$3:$A$100=$D$4,ROW(C$3:C$100)-ROW($B$3)+1)),ROWS(C$6:C36))))","v":""},{"$f":"IF(ROWS(D$6:D36)>COUNTIF(Sheet4!$A$3:$A$100,$D$4),\"\",INDEX(Sheet4!D$3:D$100,SMALL(IF(Sheet4!D$3:D$100<>\"\",IF(Sheet4!$A$3:$A$100=$D$4,ROW(D$3:D$100)-ROW($B$3)+1)),ROWS(D$6:D36))))","v":""}]
[{"$f":"IF(B37=\"\",\"\",MAX($A$5:A36)+1)","v":""},{"$f":"IF(ROWS(B$6:B37)>COUNTIF(Sheet4!$A$3:$A$100,$D$4),\"\",INDEX(Sheet4!B$3:B$100,SMALL(IF(Sheet4!B$3:B$100<>\"\",IF(Sheet4!$A$3:$A$100=$D$4,ROW(B$3:B$100)-ROW($B$3)+1)),ROWS(B$6:B37))))","v":""},{"$f":"IF(ROWS(C$6:C37)>COUNTIF(Sheet4!$A$3:$A$100,$D$4),\"\",INDEX(Sheet4!C$3:C$100,SMALL(IF(Sheet4!C$3:C$100<>\"\",IF(Sheet4!$A$3:$A$100=$D$4,ROW(C$3:C$100)-ROW($B$3)+1)),ROWS(C$6:C37))))","v":""},{"$f":"IF(ROWS(D$6:D37)>COUNTIF(Sheet4!$A$3:$A$100,$D$4),\"\",INDEX(Sheet4!D$3:D$100,SMALL(IF(Sheet4!D$3:D$100<>\"\",IF(Sheet4!$A$3:$A$100=$D$4,ROW(D$3:D$100)-ROW($B$3)+1)),ROWS(D$6:D37))))","v":""}]
[{"$f":"IF(B38=\"\",\"\",MAX($A$5:A37)+1)","v":""},{"$f":"IF(ROWS(B$6:B38)>COUNTIF(Sheet4!$A$3:$A$100,$D$4),\"\",INDEX(Sheet4!B$3:B$100,SMALL(IF(Sheet4!B$3:B$100<>\"\",IF(Sheet4!$A$3:$A$100=$D$4,ROW(B$3:B$100)-ROW($B$3)+1)),ROWS(B$6:B38))))","v":""},{"$f":"IF(ROWS(C$6:C38)>COUNTIF(Sheet4!$A$3:$A$100,$D$4),\"\",INDEX(Sheet4!C$3:C$100,SMALL(IF(Sheet4!C$3:C$100<>\"\",IF(Sheet4!$A$3:$A$100=$D$4,ROW(C$3:C$100)-ROW($B$3)+1)),ROWS(C$6:C38))))","v":""},{"$f":"IF(ROWS(D$6:D38)>COUNTIF(Sheet4!$A$3:$A$100,$D$4),\"\",INDEX(Sheet4!D$3:D$100,SMALL(IF(Sheet4!D$3:D$100<>\"\",IF(Sheet4!$A$3:$A$100=$D$4,ROW(D$3:D$100)-ROW($B$3)+1)),ROWS(D$6:D38))))","v":""}]
[{"$f":"IF(B39=\"\",\"\",MAX($A$5:A38)+1)","v":""},{"$f":"IF(ROWS(B$6:B39)>COUNTIF(Sheet4!$A$3:$A$100,$D$4),\"\",INDEX(Sheet4!B$3:B$100,SMALL(IF(Sheet4!B$3:B$100<>\"\",IF(Sheet4!$A$3:$A$100=$D$4,ROW(B$3:B$100)-ROW($B$3)+1)),ROWS(B$6:B39))))","v":""},{"$f":"IF(ROWS(C$6:C39)>COUNTIF(Sheet4!$A$3:$A$100,$D$4),\"\",INDEX(Sheet4!C$3:C$100,SMALL(IF(Sheet4!C$3:C$100<>\"\",IF(Sheet4!$A$3:$A$100=$D$4,ROW(C$3:C$100)-ROW($B$3)+1)),ROWS(C$6:C39))))","v":""},{"$f":"IF(ROWS(D$6:D39)>COUNTIF(Sheet4!$A$3:$A$100,$D$4),\"\",INDEX(Sheet4!D$3:D$100,SMALL(IF(Sheet4!D$3:D$100<>\"\",IF(Sheet4!$A$3:$A$100=$D$4,ROW(D$3:D$100)-ROW($B$3)+1)),ROWS(D$6:D39))))","v":""}]
[{"$f":"IF(B40=\"\",\"\",MAX($A$5:A39)+1)","v":""},{"$f":"IF(ROWS(B$6:B40)>COUNTIF(Sheet4!$A$3:$A$100,$D$4),\"\",INDEX(Sheet4!B$3:B$100,SMALL(IF(Sheet4!B$3:B$100<>\"\",IF(Sheet4!$A$3:$A$100=$D$4,ROW(B$3:B$100)-ROW($B$3)+1)),ROWS(B$6:B40))))","v":""},{"$f":"IF(ROWS(C$6:C40)>COUNTIF(Sheet4!$A$3:$A$100,$D$4),\"\",INDEX(Sheet4!C$3:C$100,SMALL(IF(Sheet4!C$3:C$100<>\"\",IF(Sheet4!$A$3:$A$100=$D$4,ROW(C$3:C$100)-ROW($B$3)+1)),ROWS(C$6:C40))))","v":""},{"$f":"IF(ROWS(D$6:D40)>COUNTIF(Sheet4!$A$3:$A$100,$D$4),\"\",INDEX(Sheet4!D$3:D$100,SMALL(IF(Sheet4!D$3:D$100<>\"\",IF(Sheet4!$A$3:$A$100=$D$4,ROW(D$3:D$100)-ROW($B$3)+1)),ROWS(D$6:D40))))","v":""}]
{"$rows_left_out":6}