{"text_format":"1","workbook":"xlsx","n_sheets":7,"sheets":["تفاصيل الحجز","حجوزات الملاعب","طباعة الحجز","سجل الفواتير","الفاتورة","القوائم","ورقة1"],"not_rendered":{"charts":0,"images":2,"macros":1,"external_links":0,"defined_names":1,"comments":0,"pivot_tables":0},"unopened":[],"bounds":{"document_bytes":16777216,"sheet_cells":100000,"rows_first":2000,"rows_last":500,"rows_between":2000,"halvings":0,"cell_chars":16384,"cell_head_chars":4096},"cells_cut":0,"cells_raw":0,"read":"whole","date_system":"1900"}

{"sheet":"تفاصيل الحجز","index":0,"n_rows":1985,"n_cols":7,"rows_kept":1985,"cut":false,"hidden":false,"merged":[[0,7,0,20]]}
["اسم المشترك ","رقم الجوال","نوع الاشتراك ","الملعب","تاريخ االحجز","يوم الحجز ","وقت الحجز "]
[null,null,null,null,null,{"$f":"IF(E2=\"\",\"\",TEXT(E2,\"ddd\"))","v":""}]
[null,null,null,null,null,{"$f":"IF(E3=\"\",\"\",TEXT(E3,\"ddd\"))","v":""}]
[null,null,null,null,null,""]
[null,null,null,null,null,""]
[null,null,null,null,null,{"$f":"IF(E6=\"\",\"\",TEXT(E6,\"ddd\"))","v":""}]
[null,null,null,null,null,""]
[null,null,null,null,null,""]
[null,null,null,null,null,""]
[null,null,null,null,null,""]
[null,null,null,null,null,""]
[null,null,null,null,null,""]
[null,null,null,null,null,""]
[null,null,null,null,null,""]
[null,null,null,null,null,""]
[null,null,null,null,null,""]
[null,null,null,null,null,""]
[null,null,null,null,null,""]
[null,null,null,null,null,""]
[null,null,null,null,null,""]
[null,null,null,null,null,""]
[null,null,null,null,null,""]
[null,null,null,null,null,""]
[null,null,null,null,null,""]
[null,null,null,null,null,""]
[null,null,null,null,null,""]
[null,null,null,null,null,""]
[null,null,null,null,null,""]
[null,null,null,null,null,""]
[null,null,null,null,null,""]
[null,null,null,null,null,""]
[null,null,null,null,null,""]
[null,null,null,null,null,""]
[null,null,null,null,null,""]
[null,null,null,null,null,""]
[null,null,null,null,null,""]
[null,null,null,null,null,""]
[null,null,null,null,null,""]
[null,null,null,null,null,""]
[null,null,null,null,null,""]
[null,null,null,null,null,""]
[null,null,null,null,null,""]
[null,null,null,null,null,""]
[null,null,null,null,null,""]
[null,null,null,null,null,""]
[null,null,null,null,null,""]
[null,null,null,null,null,""]
[null,null,null,null,null,""]
[null,null,null,null,null,""]
[null,null,null,null,null,""]
[null,null,null,null,null,""]
[null,null,null,null,null,""]
[null,null,null,null,null,""]
[null,null,null,null,null,""]
[null,null,null,null,null,""]
[null,null,null,null,null,""]
[null,null,null,null,null,""]
[null,null,null,null,null,""]
[null,null,null,null,null,""]
[null,null,null,null,null,""]
{"$rows_left_out":1926}
{"sheet":"حجوزات الملاعب","index":1,"n_rows":1217,"n_cols":9,"rows_kept":1217,"cut":false,"hidden":false,"merged":[[1214,0,1216,0],[1214,1,1216,1],[1205,0,1207,0],[1205,1,1207,1],[1208,0,1210,0],[1208,1,1210,1],[1211,0,1213,0],[1211,1,1213,1],[1196,0,1198,0],[1196,1,1198,1],[1199,0,1201,0],[1199,1,1201,1],[1202,0,1204,0],[1202,1,1204,1],[1187,0,1189,0],[1187,1,1189,1],[1190,0,1192,0],[1190,1,1192,1],[1193,0,1195,0],[1193,1,1195,1],[1178,0,1180,0],[1178,1,1180,1],[1181,0,1183,0],[1181,1,1183,1],[1184,0,1186,0],[1184,1,1186,1],[1169,0,1171,0],[1169,1,1171,1],[1172,0,1174,0],[1172,1,1174,1],[1175,0,1177,0],[1175,1,1177,1],[1160,0,1162,0],[1160,1,1162,1],[1163,0,1165,0],[1163,1,1165,1],[1166,0,1168,0],[1166,1,1168,1],[1151,0,1153,0],[1151,1,1153,1],[1154,0,1156,0],[1154,1,1156,1],[1157,0,1159,0],[1157,1,1159,1],[1142,0,1144,0],[1142,1,1144,1],[1145,0,1147,0],[1145,1,1147,1],[1148,0,1150,0],[1148,1,1150,1],[1133,0,1135,0],[1133,1,1135,1],[1136,0,1138,0],[1136,1,1138,1],[1139,0,1141,0],[1139,1,1141,1],[1124,0,1126,0],[1124,1,1126,1],[1127,0,1129,0],[1127,1,1129,1],[1130,0,1132,0],[1130,1,1132,1],[1115,0,1117,0],[1115,1,1117,1],[1118,0,1120,0],[1118,1,1120,1],[1121,0,1123,0],[1121,1,1123,1],[1106,0,1108,0],[1106,1,1108,1],[1109,0,1111,0],[1109,1,1111,1],[1112,0,1114,0],[1112,1,1114,1],[1097,0,1099,0],[1097,1,1099,1],[1100,0,1102,0],[1100,1,1102,1],[1103,0,1105,0],[1103,1,1105,1],[1088,0,1090,0],[1088,1,1090,1],[1091,0,1093,0],[1091,1,1093,1],[1094,0,1096,0],[1094,1,1096,1],[1079,0,1081,0],[1079,1,1081,1],[1082,0,1084,0],[1082,1,1084,1],[1085,0,1087,0],[1085,1,1087,1],[1070,0,1072,0],[1070,1,1072,1],[1073,0,1075,0],[1073,1,1075,1],[1076,0,1078,0],[1076,1,1078,1],[1061,0,1063,0],[1061,1,1063,1],[1064,0,1066,0],[1064,1,1066,1],[1067,0,1069,0],[1067,1,1069,1],[1052,0,1054,0],[1052,1,1054,1],[1055,0,1057,0],[1055,1,1057,1],[1058,0,1060,0],[1058,1,1060,1],[1043,0,1045,0],[1043,1,1045,1],[1046,0,1048,0],[1046,1,1048,1],[1049,0,1051,0],[1049,1,1051,1],[1034,0,1036,0],[1034,1,1036,1],[1037,0,1039,0],[1037,1,1039,1],[1040,0,1042,0],[1040,1,1042,1],[1025,0,1027,0],[1025,1,1027,1],[1028,0,1030,0],[1028,1,1030,1],[1031,0,1033,0],[1031,1,1033,1],[1016,0,1018,0],[1016,1,1018,1],[1019,0,1021,0],[1019,1,1021,1],[1022,0,1024,0],[1022,1,1024,1],[1007,0,1009,0],[1007,1,1009,1],[1010,0,1012,0],[1010,1,1012,1],[1013,0,1015,0],[1013,1,1015,1],[998,0,1000,0],[998,1,1000,1],[1001,0,1003,0],[1001,1,1003,1],[1004,0,1006,0],[1004,1,1006,1],[989,0,991,0],[989,1,991,1],[992,0,994,0],[992,1,994,1],[995,0,997,0],[995,1,997,1],[980,0,982,0],[980,1,982,1],[983,0,985,0],[983,1,985,1],[986,0,988,0],[986,1,988,1],[971,0,973,0],[971,1,973,1],[974,0,976,0],[974,1,976,1],[977,0,979,0],[977,1,979,1],[962,0,964,0],[962,1,964,1],[965,0,967,0],[965,1,967,1],[968,0,970,0],[968,1,970,1],[953,0,955,0],[953,1,955,1],[956,0,958,0],[956,1,958,1],[959,0,961,0],[959,1,961,1],[944,0,946,0],[944,1,946,1],[947,0,949,0],[947,1,949,1],[950,0,952,0],[950,1,952,1],[935,0,937,0],[935,1,937,1],[938,0,940,0],[938,1,940,1],[941,0,943,0],[941,1,943,1],[926,0,928,0],[926,1,928,1],[929,0,931,0],[929,1,931,1],[932,0,934,0],[932,1,934,1],[917,0,919,0],[917,1,919,1],[920,0,922,0],[920,1,922,1],[923,0,925,0],[923,1,925,1],[908,0,910,0],[908,1,910,1],[911,0,913,0],[911,1,913,1],[914,0,916,0],[914,1,916,1],[899,0,901,0],[899,1,901,1],[902,0,904,0],[902,1,904,1],[905,0,907,0],[905,1,907,1],[890,0,892,0],[890,1,892,1],[893,0,895,0],[893,1,895,1],[896,0,898,0],[896,1,898,1],[881,0,883,0],[881,1,883,1],[884,0,886,0],[884,1,886,1],[887,0,889,0],[887,1,889,1],[872,0,874,0],[872,1,874,1],[875,0,877,0],[875,1,877,1],[878,0,880,0],[878,1,880,1],[863,0,865,0],[863,1,865,1],[866,0,868,0],[866,1,868,1],[869,0,871,0],[869,1,871,1],[854,0,856,0],[854,1,856,1],[857,0,859,0],[857,1,859,1],[860,0,862,0],[860,1,862,1],[845,0,847,0],[845,1,847,1],[848,0,850,0],[848,1,850,1],[851,0,853,0],[851,1,853,1],[836,0,838,0],[836,1,838,1],[839,0,841,0],[839,1,841,1],[842,0,844,0],[842,1,844,1],[827,0,829,0],[827,1,829,1],[830,0,832,0],[830,1,832,1],[833,0,835,0],[833,1,835,1],[818,0,820,0],[818,1,820,1],[821,0,823,0],[821,1,823,1],[824,0,826,0],[824,1,826,1],[809,0,811,0],[809,1,811,1],[812,0,814,0],[812,1,814,1],[815,0,817,0],[815,1,817,1],[800,0,802,0],[800,1,802,1],[803,0,805,0],[803,1,805,1],[806,0,808,0],[806,1,808,1],[791,0,793,0],[791,1,793,1],[794,0,796,0],[794,1,796,1],[797,0,799,0],[797,1,799,1],[782,0,784,0],[782,1,784,1],[785,0,787,0],[785,1,787,1],[788,0,790,0],[788,1,790,1],[773,0,775,0],[773,1,775,1],[776,0,778,0],[776,1,778,1],[779,0,781,0],[779,1,781,1],[764,0,766,0],[764,1,766,1],[767,0,769,0],[767,1,769,1],[770,0,772,0],[770,1,772,1],[755,0,757,0],[755,1,757,1],[758,0,760,0],[758,1,760,1],[761,0,763,0],[761,1,763,1],[746,0,748,0],[746,1,748,1],[749,0,751,0],[749,1,751,1],[752,0,754,0],[752,1,754,1],[737,0,739,0],[737,1,739,1],[740,0,742,0],[740,1,742,1],[743,0,745,0],[743,1,745,1],[728,0,730,0],[728,1,730,1],[731,0,733,0],[731,1,733,1],[734,0,736,0],[734,1,736,1],[719,0,721,0],[719,1,721,1],[722,0,724,0],[722,1,724,1],[725,0,727,0],[725,1,727,1],[710,0,712,0],[710,1,712,1],[713,0,715,0],[713,1,715,1],[716,0,718,0],[716,1,718,1],[701,0,703,0],[701,1,703,1],[704,0,706,0],[704,1,706,1],[707,0,709,0],[707,1,709,1],[692,0,694,0],[692,1,694,1],[695,0,697,0],[695,1,697,1],[698,0,700,0],[698,1,700,1],[683,0,685,0],[683,1,685,1],[686,0,688,0],[686,1,688,1],[689,0,691,0],[689,1,691,1],[674,0,676,0],[674,1,676,1],[677,0,679,0],[677,1,679,1],[680,0,682,0],[680,1,682,1],[665,0,667,0],[665,1,667,1],[668,0,670,0],[668,1,670,1],[671,0,673,0],[671,1,673,1],[656,0,658,0],[656,1,658,1],[659,0,661,0],[659,1,661,1],[662,0,664,0],[662,1,664,1],[647,0,649,0],[647,1,649,1],[650,0,652,0],[650,1,652,1],[653,0,655,0],[653,1,655,1],[638,0,640,0],[638,1,640,1],[641,0,643,0],[641,1,643,1],[644,0,646,0],[644,1,646,1],[629,0,631,0],[629,1,631,1],[632,0,634,0],[632,1,634,1],[635,0,637,0],[635,1,637,1],[620,0,622,0],[620,1,622,1],[623,0,625,0],[623,1,625,1],[626,0,628,0],[626,1,628,1],[611,0,613,0],[611,1,613,1],[614,0,616,0],[614,1,616,1],[617,0,619,0],[617,1,619,1],[602,0,604,0],[602,1,604,1],[605,0,607,0],[605,1,607,1],[608,0,610,0],[608,1,610,1],[593,0,595,0],[593,1,595,1],[596,0,598,0],[596,1,598,1],[599,0,601,0],[599,1,601,1],[584,0,586,0],[584,1,586,1],[587,0,589,0],[587,1,589,1],[590,0,592,0],[590,1,592,1],[575,0,577,0],[575,1,577,1],[578,0,580,0],[578,1,580,1],[581,0,583,0],[581,1,583,1],[566,0,568,0],[566,1,568,1],[569,0,571,0],[569,1,571,1],[572,0,574,0],[572,1,574,1],[557,0,559,0],[557,1,559,1],[560,0,562,0],[560,1,562,1],[563,0,565,0],[563,1,565,1],[548,0,550,0],[548,1,550,1],[551,0,553,0],[551,1,553,1],[554,0,556,0],[554,1,556,1],[539,0,541,0],[539,1,541,1],[542,0,544,0],[542,1,544,1],[545,0,547,0],[545,1,547,1],[530,0,532,0],[530,1,532,1],[533,0,535,0],[533,1,535,1],[536,0,538,0],[536,1,538,1],[521,0,523,0],[521,1,523,1],[524,0,526,0],[524,1,526,1],[527,0,529,0],[527,1,529,1],[512,0,514,0],[512,1,514,1],[515,0,517,0],[515,1,517,1],[518,0,520,0],[518,1,520,1],[503,0,505,0],[503,1,505,1],[506,0,508,0],[506,1,508,1],[509,0,511,0],[509,1,511,1],[494,0,496,0],[494,1,496,1],[497,0,499,0],[497,1,499,1],[500,0,502,0],[500,1,502,1],[485,0,487,0],[485,1,487,1],[488,0,490,0],[488,1,490,1],[491,0,493,0],[491,1,493,1],[476,0,478,0],[476,1,478,1],[479,0,481,0],[479,1,481,1],[482,0,484,0],[482,1,484,1],[467,0,469,0],[467,1,469,1],[470,0,472,0],[470,1,472,1],[473,0,475,0],[473,1,475,1],[458,0,460,0],[458,1,460,1],[461,0,463,0],[461,1,463,1],[464,0,466,0],[464,1,466,1],[449,0,451,0],[449,1,451,1],[452,0,454,0],[452,1,454,1],[455,0,457,0],[455,1,457,1],[440,0,442,0],[440,1,442,1],[443,0,445,0],[443,1,445,1],[446,0,448,0],[446,1,448,1],[431,0,433,0],[431,1,433,1],[434,0,436,0],[434,1,436,1],[437,0,439,0],[437,1,439,1],[422,0,424,0],[422,1,424,1],[425,0,427,0],[425,1,427,1],[428,0,430,0],[428,1,430,1],[413,0,415,0],[413,1,415,1],[416,0,418,0],[416,1,418,1],[419,0,421,0],[419,1,421,1],[404,0,406,0],[404,1,406,1],[407,0,409,0],[407,1,409,1],[410,0,412,0],[410,1,412,1],[395,0,397,0],[395,1,397,1],[398,0,400,0],[398,1,400,1],[401,0,403,0],[401,1,403,1],[386,0,388,0],[386,1,388,1],[389,0,391,0],[389,1,391,1],[392,0,394,0],[392,1,394,1],[377,0,379,0],[377,1,379,1],[380,0,382,0],[380,1,382,1],[383,0,385,0],[383,1,385,1],[368,0,370,0],[368,1,370,1],[371,0,373,0],[371,1,373,1],[374,0,376,0],[374,1,376,1],[359,0,361,0],[359,1,361,1],[362,0,364,0],[362,1,364,1],[365,0,367,0],[365,1,367,1],[350,0,352,0],[350,1,352,1],[353,0,355,0],[353,1,355,1],[356,0,358,0],[356,1,358,1],[341,0,343,0],[341,1,343,1],[344,0,346,0],[344,1,346,1],[347,0,349,0],[347,1,349,1],[332,0,334,0],[332,1,334,1],[335,0,337,0],[335,1,337,1],[338,0,340,0],[338,1,340,1],[323,0,325,0],[323,1,325,1],[326,0,328,0],[326,1,328,1],[329,0,331,0],[329,1,331,1],[314,0,316,0],[314,1,316,1],[317,0,319,0],[317,1,319,1],[320,0,322,0],[320,1,322,1],[305,0,307,0],[305,1,307,1],[308,0,310,0],[308,1,310,1],[311,0,313,0],[311,1,313,1],[296,0,298,0],[296,1,298,1],[299,0,301,0],[299,1,301,1],[302,0,304,0],[302,1,304,1],[287,0,289,0],[287,1,289,1],[290,0,292,0],[290,1,292,1],[293,0,295,0],[293,1,295,1],[278,0,280,0],[278,1,280,1],[281,0,283,0],[281,1,283,1],[284,0,286,0],[284,1,286,1],[269,0,271,0],[269,1,271,1],[272,0,274,0],[272,1,274,1],[275,0,277,0],[275,1,277,1],[260,0,262,0],[260,1,262,1],[263,0,265,0],[263,1,265,1],[266,0,268,0],[266,1,268,1],[251,0,253,0],[251,1,253,1],[254,0,256,0],[254,1,256,1],[257,0,259,0],[257,1,259,1],[242,0,244,0],[242,1,244,1],[245,0,247,0],[245,1,247,1],[248,0,250,0],[248,1,250,1],[233,0,235,0],[233,1,235,1],[236,0,238,0],[236,1,238,1],[239,0,241,0],[239,1,241,1],[224,0,226,0],[224,1,226,1],[227,0,229,0],[227,1,229,1],[230,0,232,0],[230,1,232,1],[215,0,217,0],[215,1,217,1],[218,0,220,0],[218,1,220,1],[221,0,223,0],[221,1,223,1],[206,0,208,0],[206,1,208,1],[209,0,211,0],[209,1,211,1],[212,0,214,0],[212,1,214,1],[197,0,199,0],[197,1,199,1],[200,0,202,0],[200,1,202,1],[203,0,205,0],[203,1,205,1],[188,0,190,0],[188,1,190,1],[191,0,193,0],[191,1,193,1],[194,0,196,0],[194,1,196,1],[179,0,181,0],[179,1,181,1],[182,0,184,0],[182,1,184,1],[185,0,187,0],[185,1,187,1],[170,0,172,0],[170,1,172,1],[173,0,175,0],[173,1,175,1],[176,0,178,0],[176,1,178,1],[161,0,163,0],[161,1,163,1],[164,0,166,0],[164,1,166,1],[167,0,169,0],[167,1,169,1],[152,0,154,0],[152,1,154,1],[155,0,157,0],[155,1,157,1],[158,0,160,0],[158,1,160,1],[116,1,118,1],[119,1,121,1],[122,1,124,1],[140,0,142,0],[131,1,133,1],[98,1,100,1],[101,1,103,1],[104,1,106,1],[107,1,109,1],[125,1,127,1],[128,1,130,1],[110,1,112,1],[113,1,115,1],[128,0,130,0],[131,0,133,0],[119,0,121,0],[122,0,124,0],[125,0,127,0],[110,0,112,0],[113,0,115,0],[116,0,118,0],[107,0,109,0],[104,0,106,0],[143,0,145,0],[146,0,148,0],[149,0,151,0],[134,1,136,1],[137,1,139,1],[140,1,142,1],[143,1,145,1],[146,1,148,1],[149,1,151,1],[134,0,136,0],[137,0,139,0],[71,0,73,0],[38,0,40,0],[41,0,43,0],[95,1,97,1],[62,1,64,1],[65,1,67,1],[68,1,70,1],[71,1,73,1],[74,1,76,1],[77,1,79,1],[80,1,82,1],[83,1,85,1],[86,1,88,1],[89,1,91,1],[92,1,94,1],[59,1,61,1],[38,1,40,1],[41,1,43,1],[44,1,46,1],[47,1,49,1],[50,1,52,1],[53,1,55,1],[56,1,58,1],[74,0,76,0],[77,0,79,0],[80,0,82,0],[83,0,85,0],[86,0,88,0],[89,0,91,0],[92,0,94,0],[95,0,97,0],[98,0,100,0],[101,0,103,0],[44,0,46,0],[47,0,49,0],[50,0,52,0],[53,0,55,0],[56,0,58,0],[59,0,61,0],[62,0,64,0],[65,0,67,0],[68,0,70,0],[2,0,2,1],[1,0,1,1],[35,0,37,0],[5,1,7,1],[5,0,7,0],[8,0,10,0],[11,0,13,0],[14,0,16,0],[17,0,19,0],[20,0,22,0],[23,0,25,0],[26,0,28,0],[29,0,31,0],[32,0,34,0],[8,1,10,1],[11,1,13,1],[14,1,16,1],[17,1,19,1],[20,1,22,1],[23,1,25,1],[26,1,28,1],[29,1,31,1],[32,1,34,1],[35,1,37,1]]}
[]
["تاريخ اليوم "]
[{"$f":"TODAY()","v":"2021-03-29"}]
[]
["الأيام ","التاريخ ","الملعب ","من 4:30 م إلى 6:00 م","من 7:00 م  إلى 8:30 م ","من9:00 م إلى 10:30 م","من10:30 م إلى 12:00 ص","من 12:00 ص إلى 1:30 ص","من 1:30 ص إلى 3:00 ص"]
[{"$f":"IF(B6=\"\",\"\",TEXT(B6,\"ddd\"))","v":"الخميس"},"2021-04-01","الملعب الصغير"]
[null,null,"الملعب الوسط "]
[null,null,"الملعب الكبير"]
[{"$f":"IF(B9=\"\",\"\",TEXT(B9,\"ddd\"))","v":"الجمعة"},"2021-04-02","الملعب الصغير"]
[null,null,"الملعب الوسط "]
[null,null,"الملعب الكبير"]
[{"$f":"IF(B12=\"\",\"\",TEXT(B12,\"ddd\"))","v":"السبت"},"2021-04-03","الملعب الصغير"]
[null,null,"الملعب الوسط "]
[null,null,"الملعب الكبير"]
[{"$f":"IF(B15=\"\",\"\",TEXT(B15,\"ddd\"))","v":"الأحد"},"2021-04-04","الملعب الصغير"]
[null,null,"الملعب الوسط "]
[null,null,"الملعب الكبير"]
[{"$f":"IF(B18=\"\",\"\",TEXT(B18,\"ddd\"))","v":"الإثنين"},"2021-04-05","الملعب الصغير"]
[null,null,"الملعب الوسط "]
[null,null,"الملعب الكبير"]
[{"$f":"IF(B21=\"\",\"\",TEXT(B21,\"ddd\"))","v":"الثلاثاء"},"2021-04-06","الملعب الصغير"]
[null,null,"الملعب الوسط "]
[null,null,"الملعب الكبير"]
[{"$f":"IF(B24=\"\",\"\",TEXT(B24,\"ddd\"))","v":"الأربعاء"},"2021-04-07","الملعب الصغير"]
[null,null,"الملعب الوسط "]
[null,null,"الملعب الكبير"]
[{"$f":"IF(B27=\"\",\"\",TEXT(B27,\"ddd\"))","v":"الخميس"},"2021-04-08","الملعب الصغير"]
[null,null,"الملعب الوسط "]
[null,null,"الملعب الكبير"]
[{"$f":"IF(B30=\"\",\"\",TEXT(B30,\"ddd\"))","v":"الجمعة"},"2021-04-09","الملعب الصغير"]
[null,null,"الملعب الوسط "]
[null,null,"الملعب الكبير"]
[{"$f":"IF(B33=\"\",\"\",TEXT(B33,\"ddd\"))","v":"السبت"},"2021-04-10","الملعب الصغير"]
[null,null,"الملعب الوسط "]
[null,null,"الملعب الكبير"]
[{"$f":"IF(B36=\"\",\"\",TEXT(B36,\"ddd\"))","v":"الأحد"},"2021-04-11","الملعب الصغير"]
[null,null,"الملعب الوسط "]
[null,null,"الملعب الكبير"]
[{"$f":"IF(B39=\"\",\"\",TEXT(B39,\"ddd\"))","v":"الإثنين"},"2021-04-12","الملعب الصغير"]
[null,null,"الملعب الوسط "]
[null,null,"الملعب الكبير"]
[{"$f":"IF(B42=\"\",\"\",TEXT(B42,\"ddd\"))","v":"الثلاثاء"},"2021-04-13","الملعب الصغير"]
[null,null,"الملعب الوسط "]
[null,null,"الملعب الكبير"]
["الأربعاء","2021-04-14","الملعب الصغير"]
[null,null,"الملعب الوسط "]
[null,null,"الملعب الكبير"]
["الخميس","2021-04-15","الملعب الصغير"]
[null,null,"الملعب الوسط "]
[null,null,"الملعب الكبير"]
["الجمعة","2021-04-16","الملعب الصغير"]
[null,null,"الملعب الوسط "]
[null,null,"الملعب الكبير"]
["السبت","2021-04-17","الملعب الصغير"]
[null,null,"الملعب الوسط "]
[null,null,"الملعب الكبير"]
["الأحد","2021-04-18","الملعب الصغير"]
[null,null,"الملعب الوسط "]
[null,null,"الملعب الكبير"]
[{"$f":"IF(B60=\"\",\"\",TEXT(B60,\"ddd\"))","v":"الإثنين"},"2021-04-19","الملعب الصغير"]
{"$rows_left_out":1158}
{"sheet":"طباعة الحجز","index":2,"n_rows":6,"n_cols":10,"rows_kept":6,"cut":false,"hidden":false,"merged":[[25,13,25,14],[3,7,3,8],[25,5,25,6],[25,7,25,8],[25,9,25,10],[25,11,25,12]]}
[]
[]
[]
[null,null,null,null,null,null,"اسم المشترك"]
[]
[null,null,null,null,null,"نوع الإشتراك","الملعب ","تاريخ الحجز","يوم الحجز","وقت الحجز"]

{"sheet":"سجل الفواتير","index":3,"n_rows":2463,"n_cols":19,"rows_kept":2463,"cut":false,"hidden":false,"merged":[[1,3,2,10],[3,13,3,14]]}
[]
[null,null,null,"سجـــــــل الفــــــواتير"]
[]
[null,null,null,null,null,null,null,null,null,null,null,null,null,"خاص بالحجوزات الشهرية"]
[null,"رقم الفاتورة ","اسم المشترك ","الإشتراك","قيمة الإشتراك","الملعب","عدد التمارين","الخصم","المبلغ بعد الخصم","المدفوع","المتبقي","تاريخ الإشتراك","وقت الحجز ","اخر موعد للسداد","التنبيه"]
[null,1,null,null,null,null,null,null,{"$f":"E6-(E6*H6)","v":0},null,{"$f":"I6-J6","v":0},null,null,{"$f":"IF(L6=\"\",\"\",IF(D6=\"إشتراك يومي\",\"\",L6+$S$6))","v":""},{"$f":"IF(AND($S$7>N6,K6>0),\"مطلوب السداد\",\"\")","v":""},null,null,"مهلة السداد",25]
[null,2,null,null,null,null,null,null,{"$f":"E7-(E7*H7)","v":0},null,{"$f":"I7-J7","v":0},null,null,{"$f":"IF(L7=\"\",\"\",IF(D7=\"إشتراك يومي\",\"\",L7+$S$6))","v":""},{"$f":"IF(AND($S$7>N7,K7>0),\"مطلوب السداد\",\"\")","v":""},null,null,"تاريخ اليوم",{"$f":"TODAY()","v":"2021-03-29"}]
[null,3,null,null,null,null,null,null,0,null,0,null,null,{"$f":"IF(L8=\"\",\"\",IF(D8=\"إشتراك يومي\",\"\",L8+$S$6))","v":""},{"$f":"IF(AND($S$7>N8,K8>0),\"مطلوب السداد\",\"\")","v":""}]
[null,4,null,null,null,null,null,null,{"$f":"E9-(E9*H9)","v":0},null,0,null,null,"",""]
[null,5,null,null,null,null,null,null,0,null,0,null,null,"",""]
[null,6,null,null,null,null,null,null,0,null,0,null,null,"",""]
[null,7,null,null,null,null,null,null,0,null,0,null,null,"",""]
[null,8,null,null,null,null,null,null,0,null,0,null,null,"",""]
[null,9,null,null,null,null,null,null,0,null,0,null,null,"",""]
[null,10,null,null,null,null,null,null,0,null,0,null,null,"",""]
[null,11,null,null,null,null,null,null,0,null,0,null,null,"",""]
[null,12,null,null,null,null,null,null,0,null,0,null,null,"",""]
[null,13,null,null,null,null,null,null,{"$f":"E18-(E18*H18)","v":0},null,0,null,null,"",""]
[null,14,null,null,null,null,null,null,0,null,0,null,null,"",""]
[null,15,null,null,null,null,null,null,0,null,0,null,null,"",""]
[null,16,null,null,null,null,null,null,{"$f":"E21-(E21*H21)","v":0},null,{"$f":"I21-J21","v":0},null,null,"",""]
[null,17,null,null,null,null,null,null,0,null,0,null,null,"",""]
[null,18,null,null,null,null,null,null,0,null,0,null,null,"",""]
[null,19,null,null,null,null,null,null,0,null,0,null,null,"",""]
[null,20,null,null,null,null,null,null,0,null,0,null,null,"",""]
[null,21,null,null,null,null,null,null,0,null,0,null,null,"",""]
[null,22,null,null,null,null,null,null,0,null,0,null,null,"",""]
[null,23,null,null,null,null,null,null,0,null,0,null,null,"",""]
[null,24,null,null,null,null,null,null,0,null,0,null,null,"",""]
[null,25,null,null,null,null,null,null,0,null,0,null,null,"",""]
[null,26,null,null,null,null,null,null,0,null,0,null,null,"",""]
[null,27,null,null,null,null,null,null,0,null,0,null,null,"",""]
[null,28,null,null,null,null,null,null,0,null,0,null,null,"",""]
[null,29,null,null,null,null,null,null,0,null,0,null,null,"",""]
[null,30,null,null,null,null,null,null,0,null,0,null,null,"",""]
[null,31,null,null,null,null,null,null,0,null,0,null,null,"",""]
[null,32,null,null,null,null,null,null,0,null,0,null,null,"",""]
[null,33,null,null,null,null,null,null,0,null,0,null,null,"",""]
[null,34,null,null,null,null,null,null,0,null,0,null,null,"",""]
[null,35,null,null,null,null,null,null,0,null,0,null,null,"",""]
[null,36,null,null,null,null,null,null,0,null,0,null,null,"",""]
[null,37,null,null,null,null,null,null,0,null,0,null,null,"",""]
[null,38,null,null,null,null,null,null,0,null,0,null,null,"",""]
[null,39,null,null,null,null,null,null,0,null,0,null,null,"",""]
[null,40,null,null,null,null,null,null,0,null,0,null,null,"",""]
[null,41,null,null,null,null,null,null,0,null,0,null,null,"",""]
[null,42,null,null,null,null,null,null,0,null,0,null,null,"",""]
[null,43,null,null,null,null,null,null,0,null,0,null,null,"",""]
[null,44,null,null,null,null,null,null,0,null,0,null,null,"",""]
[null,45,null,null,null,null,null,null,0,null,0,null,null,"",""]
[null,46,null,null,null,null,null,null,0,null,0,null,null,"",""]
[null,47,null,null,null,null,null,null,0,null,0,null,null,"",""]
[null,48,null,null,null,null,null,null,0,null,0,null,null,"",""]
[null,49,null,null,null,null,null,null,0,null,0,null,null,"",""]
[null,50,null,null,null,null,null,null,0,null,0,null,null,"",""]
[null,51,null,null,null,null,null,null,0,null,0,null,null,"",""]
[null,52,null,null,null,null,null,null,0,null,0,null,null,"",""]
[null,53,null,null,null,null,null,null,0,null,0,null,null,"",""]
[null,54,null,null,null,null,null,null,0,null,0,null,null,"",""]
[null,55,null,null,null,null,null,null,0,null,0,null,null,"",""]
{"$rows_left_out":2404}
{"sheet":"الفاتورة","index":4,"n_rows":31,"n_cols":8,"rows_kept":31,"cut":false,"hidden":false,"merged":[[20,3,20,4],[1,3,1,5],[2,3,2,5],[5,1,5,2],[10,1,10,2],[12,1,12,2],[13,1,13,2],[14,1,14,2],[15,1,15,2],[16,1,16,2],[18,1,18,2],[19,1,19,2],[27,3,27,6],[28,3,28,6],[21,3,21,6],[22,3,22,6],[23,3,23,6],[24,3,24,6],[25,3,25,6],[26,3,26,6]]}
[]
[null,null,null,"فاتورة مبيعات "]
[null,null,null,"  sale invoice"]
[]
[]
[null,{"$f":"IFERROR(VLOOKUP(H6,'سجل الفواتير'!B5:M5000,8,0),\"\")","v":""},null,"ريال S.R",null,null,"رقم الفاتورة /"]
[null,null,null,null,null,null,"التاريخ :",{"$f":"IFERROR(VLOOKUP(H6,'سجل الفواتير'!B5:M5000,11,0),\"\")","v":""}]
[]
[]
[]
[null,{"$f":"IFERROR(VLOOKUP(H6,'سجل الفواتير'!B5:M5000,3,0),\"\")","v":""}]
[]
[null,"         القيمة قبل الخصم :",null,{"$f":"IFERROR(VLOOKUP(H6,'سجل الفواتير'!B5:M5000,4,0),\"\")","v":""}]
[null,"                   الخصم :",null,{"$f":"IFERROR(VLOOKUP(H6,'سجل الفواتير'!B5:M5000,7,0),\"\")","v":""}]
[null,"      الإجمالي بعد الخصم :",null,{"$f":"IFERROR(VLOOKUP(H6,'سجل الفواتير'!B5:M5000,8,0),\"\")","v":""}]
[]
[]
[]
[null,"  استلمنا من السيد /هـ :  ",null,{"$f":"IFERROR(VLOOKUP(H6,'سجل الفواتير'!B5:M5000,2,0),\"\")","v":""}]
[null,"  مبلغ وقدره :",null,{"$f":"IFERROR(VLOOKUP(H6,'سجل الفواتير'!B5:M5000,9,0),\"\")","v":""},null,"المتبقي :",{"$f":"IFERROR(VLOOKUP(H6,'سجل الفواتير'!B5:M5000,10,0),\"\")","v":""}]
[]
[]
[null,null,"الملعب :",{"$f":"IFERROR(VLOOKUP(H6,'سجل الفواتير'!B5:M5000,5,0),\"\")","v":""}]
[null,null,"عدد التمارين :",{"$f":"IFERROR(VLOOKUP(H6,'سجل الفواتير'!B5:M5000,6,0),\"\")","v":""}]
[null,null,"وقت الحجز :",{"$f":"IFERROR(VLOOKUP(H6,'سجل الفواتير'!B5:M5000,12,0),\"\")","v":""}]
[]
[]
[]
[]
[null,null,null,null,null,"المحاسب : ","إسماعيل أبكر"]
[null,null,null,null,null,"التوقيع :"]

{"sheet":"القوائم","index":5,"n_rows":20,"n_cols":15,"rows_kept":20,"cut":false,"hidden":false,"merged":[]}
[]
[]
[null,null,null,null,"أسعار الملاعب ",null,"أسعار الملاعب ",null,"التمارين",null,"مدة الحجز ",null,"الخصم",null,"الأيام"]
[null,null,null,null,250,null,800,null,"تمرين واحد",null,"من 4:30 م إلى 6:00 م",null,0.3,null,"السبت"]
[null,null,null,null,null,null,1600,null,"4 تمارين",null,"من 7:00 م  إلى 8:30 م ",null,0.25,null,"الاحد"]
[null,null,null,null,null,null,2600,null,"8 تمارين",null,"من9:00 م إلى 10:30 م",null,0.2,null,"الإثنين"]
[null,null,null,null,null,null,null,null,"12 تمرين",null,"من10:30 م إلى 12:00 ص",null,0.1,null,"الثلاثاء"]
[null,null,null,null,240,null,null,null,null,null,"من 12:00 ص إلى 1:30 ص",null,0.05,null,"الأربعاء"]
[null,null,null,null,null,null,null,null,null,null,"من 1:30 ص إلى 3:00 ص",null,null,null,"الخميس"]
[null,null,null,null,null,null,760,null,null,null,null,null,null,null,"الجمعة"]
[null,null,null,null,null,null,1520]
[null,null,null,null,220,null,2280]
[]
[]
[null,null,null,null,null,null,680,null,"الملاعب"]
[null,null,null,null,null,null,1360,null,"الملعب الكبير"]
[null,null,null,null,null,null,2040,null,"الملعب الوسط",null,"إشتراك يومي",null,"الإشتراك"]
[null,null,null,null,null,null,null,null,"الملعب الصغير ",null,"إشتراك شهري 4 تمارين",null,"إشتراك يومي"]
[null,null,null,null,null,null,null,null,null,null,"إشتراك شهري 8 تمارين ",null,"إشتراك شهري"]
[null,null,null,null,null,null,null,null,null,null,"إشتراك شهري 12 تمرين"]

{"sheet":"ورقة1","index":6,"n_rows":0,"n_cols":0,"rows_kept":0,"cut":false,"hidden":false,"merged":[]}