{"text_format":"1","workbook":"xlsx","n_sheets":5,"sheets":["الرئيسية","إشعار1","10-1","الإحصائية الشهرية","الإحصائية السنوية"],"not_rendered":{"charts":0,"images":0,"macros":1,"external_links":5,"defined_names":63,"comments":0,"pivot_tables":0},"unopened":[],"bounds":{"document_bytes":16777216,"sheet_cells":100000,"rows_first":2000,"rows_last":500,"rows_between":2000,"halvings":0,"cell_chars":16384,"cell_head_chars":4096},"cells_cut":0,"cells_raw":0,"read":"whole","date_system":"1900"}

{"sheet":"الرئيسية","index":0,"n_rows":9,"n_cols":13,"rows_kept":9,"cut":false,"hidden":false,"merged":[[8,7,10,11],[8,12,10,16],[1,8,1,15],[2,7,4,11],[2,12,4,16],[5,7,7,11],[5,12,7,16]]}
[]
[null,null,null,null,null,null,null,null,"الحضور والغياب (سبتمبر)"]
[null,null,null,null,null,null,null,"10\\1",null,null,null,null,"10\\2"]
[]
[]
[null,null,null,null,null,null,null,"10\\3",null,null,null,null,"10\\4"]
[]
[]
[null,null,null,null,null,null,null,"10\\5"]

{"sheet":"إشعار1","index":1,"n_rows":74,"n_cols":11,"rows_kept":74,"cut":false,"hidden":false,"merged":[[1,3,1,7]]}
[]
[null,null,null,"إشعار بتكرار الغياب 3 مرات أو أكثر"]
[null,"الرقم","اسم الطالب","الصف","رقم ولي الأمر","عدد مرات الغياب","التحويل 3","التحويل 5","التحويل 7","التحويل 10","التحويل 13"]
[null,{"$f":"ROW()-3","v":1},{"$f":"IFERROR(INDEX('الإحصائية السنوية'!$C$6:$C$990,SMALL(IF('الإحصائية السنوية'!$P$6:$P$990>=3,ROW($C$12:$C$996)-ROW($C$12)+1),ROWS($C$3:C3))),\"\")","v":""},{"$f":"IFERROR(INDEX('الإحصائية السنوية'!$E$6:$E$990,SMALL(IF('الإحصائية السنوية'!$P$6:$P$990>=3,ROW($C$12:$C$996)-ROW($C$12)+1),ROWS($C$3:C3))),\"\")","v":""},{"$f":"IFERROR(INDEX('الإحصائية السنوية'!$D$6:$D$990,SMALL(IF('الإحصائية السنوية'!$P$6:$P$990>=3,ROW($C$12:$C$996)-ROW($C$12)+1),ROWS($C$3:C3))),\"\")","v":""},{"$f":"IFERROR(INDEX('الإحصائية السنوية'!$P$6:$P$990,SMALL(IF('الإحصائية السنوية'!$P$6:$P$990>=3,ROW($C$12:$C$996)-ROW($C$12)+1),ROWS($C$3:C3))),\"\")","v":""},"تم","تم"]
[null,{"$f":"ROW()-3","v":2},{"$f":"IFERROR(INDEX('الإحصائية السنوية'!$C$6:$C$990,SMALL(IF('الإحصائية السنوية'!$P$6:$P$990>=3,ROW($C$12:$C$996)-ROW($C$12)+1),ROWS($C$3:C4))),\"\")","v":""},{"$f":"IFERROR(INDEX('الإحصائية السنوية'!$E$6:$E$990,SMALL(IF('الإحصائية السنوية'!$P$6:$P$990>=3,ROW($C$12:$C$996)-ROW($C$12)+1),ROWS($C$3:C4))),\"\")","v":""},{"$f":"IFERROR(INDEX('الإحصائية السنوية'!$D$6:$D$990,SMALL(IF('الإحصائية السنوية'!$P$6:$P$990>=3,ROW($C$12:$C$996)-ROW($C$12)+1),ROWS($C$3:C4))),\"\")","v":""},{"$f":"IFERROR(INDEX('الإحصائية السنوية'!$P$6:$P$990,SMALL(IF('الإحصائية السنوية'!$P$6:$P$990>=3,ROW($C$12:$C$996)-ROW($C$12)+1),ROWS($C$3:C4))),\"\")","v":""}]
[null,3,{"$f":"IFERROR(INDEX('الإحصائية السنوية'!$C$6:$C$990,SMALL(IF('الإحصائية السنوية'!$P$6:$P$990>=3,ROW($C$12:$C$996)-ROW($C$12)+1),ROWS($C$3:C5))),\"\")","v":""},{"$f":"IFERROR(INDEX('الإحصائية السنوية'!$E$6:$E$990,SMALL(IF('الإحصائية السنوية'!$P$6:$P$990>=3,ROW($C$12:$C$996)-ROW($C$12)+1),ROWS($C$3:C5))),\"\")","v":""},{"$f":"IFERROR(INDEX('الإحصائية السنوية'!$D$6:$D$990,SMALL(IF('الإحصائية السنوية'!$P$6:$P$990>=3,ROW($C$12:$C$996)-ROW($C$12)+1),ROWS($C$3:C5))),\"\")","v":""},{"$f":"IFERROR(INDEX('الإحصائية السنوية'!$P$6:$P$990,SMALL(IF('الإحصائية السنوية'!$P$6:$P$990>=3,ROW($C$12:$C$996)-ROW($C$12)+1),ROWS($C$3:C5))),\"\")","v":""}]
[null,4,{"$f":"IFERROR(INDEX('الإحصائية السنوية'!$C$6:$C$990,SMALL(IF('الإحصائية السنوية'!$P$6:$P$990>=3,ROW($C$12:$C$996)-ROW($C$12)+1),ROWS($C$3:C6))),\"\")","v":""},{"$f":"IFERROR(INDEX('الإحصائية السنوية'!$E$6:$E$990,SMALL(IF('الإحصائية السنوية'!$P$6:$P$990>=3,ROW($C$12:$C$996)-ROW($C$12)+1),ROWS($C$3:C6))),\"\")","v":""},{"$f":"IFERROR(INDEX('الإحصائية السنوية'!$D$6:$D$990,SMALL(IF('الإحصائية السنوية'!$P$6:$P$990>=3,ROW($C$12:$C$996)-ROW($C$12)+1),ROWS($C$3:C6))),\"\")","v":""},{"$f":"IFERROR(INDEX('الإحصائية السنوية'!$P$6:$P$990,SMALL(IF('الإحصائية السنوية'!$P$6:$P$990>=3,ROW($C$12:$C$996)-ROW($C$12)+1),ROWS($C$3:C6))),\"\")","v":""}]
[null,5,{"$f":"IFERROR(INDEX('الإحصائية السنوية'!$C$6:$C$990,SMALL(IF('الإحصائية السنوية'!$P$6:$P$990>=3,ROW($C$12:$C$996)-ROW($C$12)+1),ROWS($C$3:C7))),\"\")","v":""},{"$f":"IFERROR(INDEX('الإحصائية السنوية'!$E$6:$E$990,SMALL(IF('الإحصائية السنوية'!$P$6:$P$990>=3,ROW($C$12:$C$996)-ROW($C$12)+1),ROWS($C$3:C7))),\"\")","v":""},{"$f":"IFERROR(INDEX('الإحصائية السنوية'!$D$6:$D$990,SMALL(IF('الإحصائية السنوية'!$P$6:$P$990>=3,ROW($C$12:$C$996)-ROW($C$12)+1),ROWS($C$3:C7))),\"\")","v":""},{"$f":"IFERROR(INDEX('الإحصائية السنوية'!$P$6:$P$990,SMALL(IF('الإحصائية السنوية'!$P$6:$P$990>=3,ROW($C$12:$C$996)-ROW($C$12)+1),ROWS($C$3:C7))),\"\")","v":""}]
[null,6,{"$f":"IFERROR(INDEX('الإحصائية السنوية'!$C$6:$C$990,SMALL(IF('الإحصائية السنوية'!$P$6:$P$990>=3,ROW($C$12:$C$996)-ROW($C$12)+1),ROWS($C$3:C8))),\"\")","v":""},{"$f":"IFERROR(INDEX('الإحصائية السنوية'!$E$6:$E$990,SMALL(IF('الإحصائية السنوية'!$P$6:$P$990>=3,ROW($C$12:$C$996)-ROW($C$12)+1),ROWS($C$3:C8))),\"\")","v":""},{"$f":"IFERROR(INDEX('الإحصائية السنوية'!$D$6:$D$990,SMALL(IF('الإحصائية السنوية'!$P$6:$P$990>=3,ROW($C$12:$C$996)-ROW($C$12)+1),ROWS($C$3:C8))),\"\")","v":""},{"$f":"IFERROR(INDEX('الإحصائية السنوية'!$P$6:$P$990,SMALL(IF('الإحصائية السنوية'!$P$6:$P$990>=3,ROW($C$12:$C$996)-ROW($C$12)+1),ROWS($C$3:C8))),\"\")","v":""}]
[null,7,{"$f":"IFERROR(INDEX('الإحصائية السنوية'!$C$6:$C$990,SMALL(IF('الإحصائية السنوية'!$P$6:$P$990>=3,ROW($C$12:$C$996)-ROW($C$12)+1),ROWS($C$3:C9))),\"\")","v":""},{"$f":"IFERROR(INDEX('الإحصائية السنوية'!$E$6:$E$990,SMALL(IF('الإحصائية السنوية'!$P$6:$P$990>=3,ROW($C$12:$C$996)-ROW($C$12)+1),ROWS($C$3:C9))),\"\")","v":""},{"$f":"IFERROR(INDEX('الإحصائية السنوية'!$D$6:$D$990,SMALL(IF('الإحصائية السنوية'!$P$6:$P$990>=3,ROW($C$12:$C$996)-ROW($C$12)+1),ROWS($C$3:C9))),\"\")","v":""},{"$f":"IFERROR(INDEX('الإحصائية السنوية'!$P$6:$P$990,SMALL(IF('الإحصائية السنوية'!$P$6:$P$990>=3,ROW($C$12:$C$996)-ROW($C$12)+1),ROWS($C$3:C9))),\"\")","v":""}]
[null,8,{"$f":"IFERROR(INDEX('الإحصائية السنوية'!$C$6:$C$990,SMALL(IF('الإحصائية السنوية'!$P$6:$P$990>=3,ROW($C$12:$C$996)-ROW($C$12)+1),ROWS($C$3:C10))),\"\")","v":""},{"$f":"IFERROR(INDEX('الإحصائية السنوية'!$E$6:$E$990,SMALL(IF('الإحصائية السنوية'!$P$6:$P$990>=3,ROW($C$12:$C$996)-ROW($C$12)+1),ROWS($C$3:C10))),\"\")","v":""},{"$f":"IFERROR(INDEX('الإحصائية السنوية'!$D$6:$D$990,SMALL(IF('الإحصائية السنوية'!$P$6:$P$990>=3,ROW($C$12:$C$996)-ROW($C$12)+1),ROWS($C$3:C10))),\"\")","v":""},{"$f":"IFERROR(INDEX('الإحصائية السنوية'!$P$6:$P$990,SMALL(IF('الإحصائية السنوية'!$P$6:$P$990>=3,ROW($C$12:$C$996)-ROW($C$12)+1),ROWS($C$3:C10))),\"\")","v":""}]
[null,9,{"$f":"IFERROR(INDEX('الإحصائية السنوية'!$C$6:$C$990,SMALL(IF('الإحصائية السنوية'!$P$6:$P$990>=3,ROW($C$12:$C$996)-ROW($C$12)+1),ROWS($C$3:C11))),\"\")","v":""},{"$f":"IFERROR(INDEX('الإحصائية السنوية'!$E$6:$E$990,SMALL(IF('الإحصائية السنوية'!$P$6:$P$990>=3,ROW($C$12:$C$996)-ROW($C$12)+1),ROWS($C$3:C11))),\"\")","v":""},{"$f":"IFERROR(INDEX('الإحصائية السنوية'!$D$6:$D$990,SMALL(IF('الإحصائية السنوية'!$P$6:$P$990>=3,ROW($C$12:$C$996)-ROW($C$12)+1),ROWS($C$3:C11))),\"\")","v":""},{"$f":"IFERROR(INDEX('الإحصائية السنوية'!$P$6:$P$990,SMALL(IF('الإحصائية السنوية'!$P$6:$P$990>=3,ROW($C$12:$C$996)-ROW($C$12)+1),ROWS($C$3:C11))),\"\")","v":""}]
[null,10,{"$f":"IFERROR(INDEX('الإحصائية السنوية'!$C$6:$C$990,SMALL(IF('الإحصائية السنوية'!$P$6:$P$990>=3,ROW($C$12:$C$996)-ROW($C$12)+1),ROWS($C$3:C12))),\"\")","v":""},{"$f":"IFERROR(INDEX('الإحصائية السنوية'!$E$6:$E$990,SMALL(IF('الإحصائية السنوية'!$P$6:$P$990>=3,ROW($C$12:$C$996)-ROW($C$12)+1),ROWS($C$3:C12))),\"\")","v":""},{"$f":"IFERROR(INDEX('الإحصائية السنوية'!$D$6:$D$990,SMALL(IF('الإحصائية السنوية'!$P$6:$P$990>=3,ROW($C$12:$C$996)-ROW($C$12)+1),ROWS($C$3:C12))),\"\")","v":""},{"$f":"IFERROR(INDEX('الإحصائية السنوية'!$P$6:$P$990,SMALL(IF('الإحصائية السنوية'!$P$6:$P$990>=3,ROW($C$12:$C$996)-ROW($C$12)+1),ROWS($C$3:C12))),\"\")","v":""}]
[null,{"$f":"ROW()-3","v":11},{"$f":"IFERROR(INDEX('الإحصائية السنوية'!$C$6:$C$990,SMALL(IF('الإحصائية السنوية'!$P$6:$P$990>=3,ROW($C$12:$C$996)-ROW($C$12)+1),ROWS($C$3:C13))),\"\")","v":""},{"$f":"IFERROR(INDEX('الإحصائية السنوية'!$E$6:$E$990,SMALL(IF('الإحصائية السنوية'!$P$6:$P$990>=3,ROW($C$12:$C$996)-ROW($C$12)+1),ROWS($C$3:C13))),\"\")","v":""},{"$f":"IFERROR(INDEX('الإحصائية السنوية'!$D$6:$D$990,SMALL(IF('الإحصائية السنوية'!$P$6:$P$990>=3,ROW($C$12:$C$996)-ROW($C$12)+1),ROWS($C$3:C13))),\"\")","v":""},{"$f":"IFERROR(INDEX('الإحصائية السنوية'!$P$6:$P$990,SMALL(IF('الإحصائية السنوية'!$P$6:$P$990>=3,ROW($C$12:$C$996)-ROW($C$12)+1),ROWS($C$3:C13))),\"\")","v":""}]
[null,12,{"$f":"IFERROR(INDEX('الإحصائية السنوية'!$C$6:$C$990,SMALL(IF('الإحصائية السنوية'!$P$6:$P$990>=3,ROW($C$12:$C$996)-ROW($C$12)+1),ROWS($C$3:C14))),\"\")","v":""},{"$f":"IFERROR(INDEX('الإحصائية السنوية'!$E$6:$E$990,SMALL(IF('الإحصائية السنوية'!$P$6:$P$990>=3,ROW($C$12:$C$996)-ROW($C$12)+1),ROWS($C$3:C14))),\"\")","v":""},{"$f":"IFERROR(INDEX('الإحصائية السنوية'!$D$6:$D$990,SMALL(IF('الإحصائية السنوية'!$P$6:$P$990>=3,ROW($C$12:$C$996)-ROW($C$12)+1),ROWS($C$3:C14))),\"\")","v":""},{"$f":"IFERROR(INDEX('الإحصائية السنوية'!$P$6:$P$990,SMALL(IF('الإحصائية السنوية'!$P$6:$P$990>=3,ROW($C$12:$C$996)-ROW($C$12)+1),ROWS($C$3:C14))),\"\")","v":""}]
[null,13,{"$f":"IFERROR(INDEX('الإحصائية السنوية'!$C$6:$C$990,SMALL(IF('الإحصائية السنوية'!$P$6:$P$990>=3,ROW($C$12:$C$996)-ROW($C$12)+1),ROWS($C$3:C15))),\"\")","v":""},{"$f":"IFERROR(INDEX('الإحصائية السنوية'!$E$6:$E$990,SMALL(IF('الإحصائية السنوية'!$P$6:$P$990>=3,ROW($C$12:$C$996)-ROW($C$12)+1),ROWS($C$3:C15))),\"\")","v":""},{"$f":"IFERROR(INDEX('الإحصائية السنوية'!$D$6:$D$990,SMALL(IF('الإحصائية السنوية'!$P$6:$P$990>=3,ROW($C$12:$C$996)-ROW($C$12)+1),ROWS($C$3:C15))),\"\")","v":""},{"$f":"IFERROR(INDEX('الإحصائية السنوية'!$P$6:$P$990,SMALL(IF('الإحصائية السنوية'!$P$6:$P$990>=3,ROW($C$12:$C$996)-ROW($C$12)+1),ROWS($C$3:C15))),\"\")","v":""}]
[null,14,{"$f":"IFERROR(INDEX('الإحصائية السنوية'!$C$6:$C$990,SMALL(IF('الإحصائية السنوية'!$P$6:$P$990>=3,ROW($C$12:$C$996)-ROW($C$12)+1),ROWS($C$3:C16))),\"\")","v":""},{"$f":"IFERROR(INDEX('الإحصائية السنوية'!$E$6:$E$990,SMALL(IF('الإحصائية السنوية'!$P$6:$P$990>=3,ROW($C$12:$C$996)-ROW($C$12)+1),ROWS($C$3:C16))),\"\")","v":""},{"$f":"IFERROR(INDEX('الإحصائية السنوية'!$D$6:$D$990,SMALL(IF('الإحصائية السنوية'!$P$6:$P$990>=3,ROW($C$12:$C$996)-ROW($C$12)+1),ROWS($C$3:C16))),\"\")","v":""},{"$f":"IFERROR(INDEX('الإحصائية السنوية'!$P$6:$P$990,SMALL(IF('الإحصائية السنوية'!$P$6:$P$990>=3,ROW($C$12:$C$996)-ROW($C$12)+1),ROWS($C$3:C16))),\"\")","v":""}]
[null,15,{"$f":"IFERROR(INDEX('الإحصائية السنوية'!$C$6:$C$990,SMALL(IF('الإحصائية السنوية'!$P$6:$P$990>=3,ROW($C$12:$C$996)-ROW($C$12)+1),ROWS($C$3:C17))),\"\")","v":""},{"$f":"IFERROR(INDEX('الإحصائية السنوية'!$E$6:$E$990,SMALL(IF('الإحصائية السنوية'!$P$6:$P$990>=3,ROW($C$12:$C$996)-ROW($C$12)+1),ROWS($C$3:C17))),\"\")","v":""},{"$f":"IFERROR(INDEX('الإحصائية السنوية'!$D$6:$D$990,SMALL(IF('الإحصائية السنوية'!$P$6:$P$990>=3,ROW($C$12:$C$996)-ROW($C$12)+1),ROWS($C$3:C17))),\"\")","v":""},{"$f":"IFERROR(INDEX('الإحصائية السنوية'!$P$6:$P$990,SMALL(IF('الإحصائية السنوية'!$P$6:$P$990>=3,ROW($C$12:$C$996)-ROW($C$12)+1),ROWS($C$3:C17))),\"\")","v":""}]
[null,16,{"$f":"IFERROR(INDEX('الإحصائية السنوية'!$C$6:$C$990,SMALL(IF('الإحصائية السنوية'!$P$6:$P$990>=3,ROW($C$12:$C$996)-ROW($C$12)+1),ROWS($C$3:C18))),\"\")","v":""},{"$f":"IFERROR(INDEX('الإحصائية السنوية'!$E$6:$E$990,SMALL(IF('الإحصائية السنوية'!$P$6:$P$990>=3,ROW($C$12:$C$996)-ROW($C$12)+1),ROWS($C$3:C18))),\"\")","v":""},{"$f":"IFERROR(INDEX('الإحصائية السنوية'!$D$6:$D$990,SMALL(IF('الإحصائية السنوية'!$P$6:$P$990>=3,ROW($C$12:$C$996)-ROW($C$12)+1),ROWS($C$3:C18))),\"\")","v":""},{"$f":"IFERROR(INDEX('الإحصائية السنوية'!$P$6:$P$990,SMALL(IF('الإحصائية السنوية'!$P$6:$P$990>=3,ROW($C$12:$C$996)-ROW($C$12)+1),ROWS($C$3:C18))),\"\")","v":""}]
[null,17,{"$f":"IFERROR(INDEX('الإحصائية السنوية'!$C$6:$C$990,SMALL(IF('الإحصائية السنوية'!$P$6:$P$990>=3,ROW($C$12:$C$996)-ROW($C$12)+1),ROWS($C$3:C19))),\"\")","v":""},{"$f":"IFERROR(INDEX('الإحصائية السنوية'!$E$6:$E$990,SMALL(IF('الإحصائية السنوية'!$P$6:$P$990>=3,ROW($C$12:$C$996)-ROW($C$12)+1),ROWS($C$3:C19))),\"\")","v":""},{"$f":"IFERROR(INDEX('الإحصائية السنوية'!$D$6:$D$990,SMALL(IF('الإحصائية السنوية'!$P$6:$P$990>=3,ROW($C$12:$C$996)-ROW($C$12)+1),ROWS($C$3:C19))),\"\")","v":""},{"$f":"IFERROR(INDEX('الإحصائية السنوية'!$P$6:$P$990,SMALL(IF('الإحصائية السنوية'!$P$6:$P$990>=3,ROW($C$12:$C$996)-ROW($C$12)+1),ROWS($C$3:C19))),\"\")","v":""}]
{"$rows_left_out":55}
{"sheet":"10-1","index":2,"n_rows":41,"n_cols":93,"rows_kept":41,"cut":false,"hidden":false,"merged":[[3,56,3,70],[5,68,5,70],[5,83,5,87],[5,88,5,92],[3,78,3,92],[5,73,5,77],[5,78,5,82],[4,71,4,92],[5,71,5,72],[38,1,40,1],[4,0,7,0],[4,1,7,1],[5,6,5,7],[4,2,5,4],[6,3,7,3],[6,4,7,4],[6,2,7,2],[23,0,29,4],[4,28,4,48],[3,35,3,48],[3,13,3,27],[5,28,5,32],[5,38,5,42],[5,33,5,37],[5,43,5,47],[5,13,5,17],[5,18,5,22],[5,23,5,27],[4,6,4,27],[5,8,5,12],[5,49,5,52],[5,63,5,67],[5,58,5,62],[5,53,5,57],[4,49,4,70]]}
["السنة",2021]
["الشهر","ديسمبر"]
[null,null,null,null,null,null,null,22,null,null,null,null,null,null,null,null,null,null,null,null,null,null,null,null,null,null,null,null,21,null,null,null,null,null,null,null,null,null,null,null,null,null,null,null,null,null,null,null,null,22,null,null,null,null,null,null,null,null,null,null,null,null,null,null,null,null,null,null,null,null,null,22]
[null,null,null,null,null,null,null,null,null,null,null,null,null,"10\\1",null,null,null,null,null,null,null,null,null,null,null,null,null,null,null,null,null,null,null,null,null,"10\\1",null,null,null,null,null,null,null,null,null,null,null,null,null,null,null,null,null,null,null,null,"10\\1",null,null,null,null,null,null,null,null,null,null,null,null,null,null,null,null,null,null,null,null,null,"10\\1"]
["م","اسم الطالب",null,null,null,"الشهر","سبتمبر",null,null,null,null,null,null,null,null,null,null,null,null,null,null,null,null,null,null,null,null,null,"أكتوبر",null,null,null,null,null,null,null,null,null,null,null,null,null,null,null,null,null,null,null,null,"نوفمبر",null,null,null,null,null,null,null,null,null,null,null,null,null,null,null,null,null,null,null,null,null,"ديسمبر"]
[null,null,null,null,null,"الأسبوع","الأسبوع الأول",null,"الأسبوع الثاني",null,null,null,null,"الأسبوع الثالث",null,null,null,null,"الأسبوع الرابع",null,null,null,null,"الأسبوع الخامس",null,null,null,null,"الأسبوع الأول",null,null,null,null,"الأسبوع الثاني",null,null,null,null,"الأسبوع الثالث",null,null,null,null,"الأسبوع الرابع",null,null,null,null,"الخامس","الأسبوع الأول",null,null,null,"الأسبوع الثاني",null,null,null,null,"الأسبوع الثالث",null,null,null,null,"الأسبوع الرابع",null,null,null,null,"الأسبوع الخامس",null,null,"الأول",null,"الأسبوع الثاني",null,null,null,null,"الأسبوع الثالث",null,null,null,null,"الأسبوع الرابع",null,null,null,null,"الأسبوع الخامس"]
[null,null,"أيام \nالحضور","بعذر","بدون \nعذر","اليوم",{"$f":"IF(G8=\"\",\"\",TEXT(G8,\"ddd\"))","v":"الأربعاء"},{"$f":"IF(H8=\"\",\"\",TEXT(H8,\"ddd\"))","v":"الخميس"},"الأحد","الإثنين","الثلاثاء","الأربعاء","الخميس","الأحد","الإثنين","الثلاثاء","الأربعاء","الخميس","الأحد","الإثنين","الثلاثاء","الأربعاء","الخميس","الأحد","الإثنين","الثلاثاء","الأربعاء","الإثنين","الأحد","الإثنين","الثلاثاء","الأربعاء","الخميس","الأحد","الإثنين","الثلاثاء","الأربعاء","الخميس","الأحد","الإثنين","الثلاثاء","الأربعاء","الخميس","الأحد","الإثنين","الثلاثاء","الأربعاء","الخميس","الأحد","الإثنين","الثلاثاء","الأربعاء","الخميس","الأحد","الإثنين","الثلاثاء","الأربعاء","الخميس","الأحد","الإثنين","الثلاثاء","الأربعاء","الخميس","الأحد","الإثنين","الثلاثاء","الأربعاء","الخميس",{"$f":"IF(BQ8=\"\",\"\",TEXT(BQ8,\"ddd\"))","v":"الأحد"},"الإثنين","الثلاثاء","الأربعاء","الخميس","الأحد","الإثنين","الثلاثاء","الأربعاء","الخميس","الأحد","الإثنين","الثلاثاء","الأربعاء","الخميس","الأحد","الإثنين","الثلاثاء","الأربعاء","الخميس","الأحد","الإثنين","الثلاثاء",{"$f":"IF(CN8=\"\",\"\",TEXT(CN8,\"ddd\"))","v":"الأربعاء"},{"$f":"IF(CO8=\"\",\"\",TEXT(CO8,\"ddd\"))","v":"الخميس"}]
[null,null,null,null,null,"التاريخ","2021-09-01","2021-09-02","2021-09-05","2021-09-06","2021-09-07","2021-09-08","2021-09-09","2021-09-12","2021-09-13","2021-09-14","2021-09-15","2021-09-16","2021-09-19","2021-09-20","2021-09-21","2021-09-22","2021-09-23","2021-09-26","2021-09-27","2021-09-28","2021-09-29",30,"2021-10-03","2021-10-04","2021-10-05","2021-10-06","2021-10-07","2021-10-10","2021-10-11","2021-10-12","2021-10-13","2021-10-14","2021-10-17","2021-10-18","2021-10-19","2021-10-20","2021-10-21","2021-10-24","2021-10-25","2021-10-26","2021-10-27","2021-10-28","2021-10-31","2021-11-01","2021-11-02","2021-11-03","2021-11-04","2021-11-07","2021-11-08","2021-11-09","2021-11-10","2021-11-11","2021-11-14","2021-11-15","2021-11-16","2021-11-17","2021-11-18","2021-11-21","2021-11-22","2021-11-23","2021-11-24","2021-11-25","2021-11-28","2021-11-29","2021-11-30","2021-12-01","2021-12-02","2021-12-05","2021-12-06","2021-12-07","2021-12-08","2021-12-09","2021-12-12","2021-12-13","2021-12-14","2021-12-15","2021-12-16","2021-12-19","2021-12-20","2021-12-21","2021-12-22","2021-12-23","2021-12-26","2021-12-27","2021-12-28","2021-12-29","2021-12-30"]
[1,"احمد ناصر احمد على المطوع",{"$f":"COUNTIF(G9:AB9,C$39)","v":0},{"$f":"COUNTIF(G9:AB9,C$41)","v":0},{"$f":"COUNTIF(G9:AB9,C$40)","v":0}]
[2,"اسلام محمود احمد خميس يوسف",0,0,0]
[3,"توفيق درغام توفيق بكليزي",0,0,0]
[4,"ثائر رائد تيسير محمود القيسى",0,0,0]
[5,"حسام الدين طارق مهدي عبيد",0,0,0]
[6,"حمد جاسم على محمد القايد",0,0,0]
[7,"حمد على راشد سالم المرى",0,0,0]
[8,"خالد عماد حمدى موسى الزرد",0,0,0]
[9,"خالد كرم صلاح الهوارى",0,0,0]
[10,"خالد محمد ناصر البكرى اليافعى",0,0,0]
[11,"سعيد حمد محمد على بن نوره",0,0,0]
[12,"عبدالرحمن سالم محمد ابوعرقوه المرى",0,0,0]
{"$rows_left_out":22}
{"sheet":"الإحصائية الشهرية","index":3,"n_rows":30,"n_cols":25,"rows_kept":30,"cut":false,"hidden":false,"merged":[[23,3,23,24],[26,1,28,1],[29,1,29,2],[9,3,9,23],[19,1,21,1],[22,1,22,2],[23,1,25,1],[23,2,25,2],[15,1,15,2],[16,1,18,1],[16,2,18,2],[16,3,16,24],[9,1,11,1],[9,2,11,2],[12,1,14,1],[8,1,8,2],[1,10,1,16],[2,1,4,1],[2,2,4,2],[2,3,2,24],[5,1,7,1]]}
[]
[null,null,null,null,null,null,null,null,null,null,"إحصائية الغياب الشهرية"]
[null,null,null,"سبتمبر"]
[null,null,null,{"$f":"IF(D5=\"\",\"\",TEXT(D5,\"ddd\"))","v":"الأربعاء"},{"$f":"IF(E5=\"\",\"\",TEXT(E5,\"ddd\"))","v":"الخميس"},"الأحد","الإثنين","الثلاثاء","الأربعاء","الخميس","الأحد","الإثنين","الثلاثاء","الأربعاء","الخميس","الأحد","الإثنين","الثلاثاء","الأربعاء","الخميس","الأحد","الإثنين","الثلاثاء","الأربعاء","الخميس"]
[null,null,null,"2021-09-01","2021-09-02","2021-09-05","2021-09-06","2021-09-07","2021-09-08","2021-09-09","2021-09-12","2021-09-13","2021-09-14","2021-09-15","2021-09-16","2021-09-19","2021-09-20","2021-09-21","2021-09-22","2021-09-23","2021-09-26","2021-09-27","2021-09-28","2021-09-29","2021-09-30"]
[null,"العاشر","الحضور"]
[null,null,"الغياب "]
[null,null,"غ بعذر"]
[null,"المجموع للعاشر",null,{"$f":"SUM(D6:D8)","v":0},{"$f":"SUM(E6:E8)","v":0},0,0,0,0,0,0,0,0,0,0,0,0,0,0,0,0,0,0,0,0]
[null,null,null,"أكتوبر"]
[null,null,null,{"$f":"IF(D12=\"\",\"\",TEXT(D12,\"ddd\"))","v":"الأحد"},"الإثنين","الثلاثاء","الأربعاء","الخميس","الأحد","الإثنين","الثلاثاء","الأربعاء","الخميس","الأحد","الإثنين","الثلاثاء","الأربعاء","الخميس","الأحد","الإثنين","الثلاثاء","الأربعاء","الخميس","الأحد"]
[null,null,null,"2021-10-03","2021-10-04","2021-10-05","2021-10-06","2021-10-07","2021-10-10","2021-10-11","2021-10-12","2021-10-13","2021-10-14","2021-10-17","2021-10-18","2021-10-19","2021-10-20","2021-10-21","2021-10-24","2021-10-25","2021-10-26","2021-10-27","2021-10-28","2021-10-31"]
[null,"العاشر","الحضور"]
[null,null,"الغياب "]
[null,null,"غ بعذر"]
[null,"المجموع للعاشر",null,{"$f":"SUM(D13:D15)","v":0},{"$f":"SUM(E13:E15)","v":0},{"$f":"SUM(F13:F15)","v":0},{"$f":"SUM(G13:G15)","v":0},{"$f":"SUM(H13:H15)","v":0},{"$f":"SUM(I13:I15)","v":0},0,0,0,0,0,0,0,0,0,0,0,0,0,0,0]
[null,null,null,"نوفمبر"]
[null,null,null,"الإثنين","الثلاثاء","الأربعاء","الخميس","الأحد","الإثنين","الثلاثاء","الأربعاء","الخميس","الأحد","الإثنين","الثلاثاء","الأربعاء","الخميس","الأحد","الإثنين","الثلاثاء","الأربعاء","الخميس","الأحد","الإثنين","الثلاثاء"]
[null,null,null,"2021-11-01","2021-11-02","2021-11-03","2021-11-04","2021-11-07","2021-11-08","2021-11-09","2021-11-10","2021-11-11","2021-11-14","2021-11-15","2021-11-16","2021-11-17","2021-11-18","2021-11-21","2021-11-22","2021-11-23","2021-11-24","2021-11-25","2021-11-28","2021-11-29","2021-11-30"]
[null,"العاشر","الحضور"]
{"$rows_left_out":11}
{"sheet":"الإحصائية السنوية","index":4,"n_rows":175,"n_cols":19,"rows_kept":175,"cut":false,"hidden":false,"merged":[[1,4,1,12],[2,16,2,17],[3,1,4,1],[3,2,4,2],[3,4,4,4],[3,5,4,5],[3,6,4,6],[3,7,4,7],[3,8,4,8],[3,15,4,15],[3,16,4,16],[3,17,4,17],[3,3,4,3],[3,18,4,18],[3,9,4,9],[3,10,4,10],[3,11,4,11],[3,12,4,12],[3,13,4,13],[3,14,4,14]]}
[]
[null,null,null,null,"الإحصائية السنوية"]
[null,null,null,null,null,null,null,null,null,null,null,null,null,null,null,null,"عدد أيام الدوام السنوي",null,{"$f":"SUMIF('10-1'!G3:BT3,\">0\",'10-1'!G3:BT3)","v":87}]
[null,"الرقم","اسم الطالب","رقم ولي الأمر","الشهر\nالصف",9,10,11,12,1,2,3,4,5,6,"مجموع أيام\nالغياب","مجموع أيام \nالحضور","نسبة\nالحضور","نسبة\nالغياب"]
[]
[null,1,"احمد ناصر احمد على المطوع",33334546,"10\\1",{"$f":"COUNTIFS('10-1'!$G9:$AB9,\"غائب\")","v":0},null,null,null,null,null,null,null,null,null,{"$f":"IF($C6=\"\",\"\",IF(SUM($F6:$O6)=0,0,SUM($F6:$O6)))","v":0},{"$f":"IF($C6=\"\",\"\",$S$3-$P6)","v":87},{"$f":"IF($C6=\"\",\"\",($Q6/$S$3)*100)","v":100},{"$f":"IF($C6=\"\",\"\",($P6/$S$3)*100)","v":0}]
[null,2,"اسلام محمود احمد خميس يوسف",5465454,"10\\1",{"$f":"COUNTIFS('10-1'!$G10:$AB10,\"غائب\")","v":0},null,null,null,null,null,null,null,null,null,0,87,100,0]
[null,3,"توفيق درغام توفيق بكليزي",5467687989,"10\\1",{"$f":"COUNTIFS('10-1'!$G11:$AB11,\"غائب\")","v":0},null,null,null,null,null,null,null,null,null,0,87,100,0]
[null,4,"ثائر رائد تيسير محمود القيسى",3333667,"10\\1",{"$f":"COUNTIFS('10-1'!$G12:$AB12,\"غائب\")","v":0},null,null,null,null,null,null,null,null,null,0,87,100,0]
[null,5,"حسام الدين طارق مهدي عبيد",555777,"10\\1",{"$f":"COUNTIFS('10-1'!$G13:$AB13,\"غائب\")","v":0},null,null,null,null,null,null,null,null,null,0,87,100,0]
[null,6,"حمد جاسم على محمد القايد",565656888,"10\\1",{"$f":"COUNTIFS('10-1'!$G14:$AB14,\"غائب\")","v":0},null,null,null,null,null,null,null,null,null,0,87,100,0]
[null,7,"حمد على راشد سالم المرى",7878798,"10\\1",{"$f":"COUNTIFS('10-1'!$G15:$AB15,\"غائب\")","v":0},null,null,null,null,null,null,null,null,null,0,87,100,0]
[null,8,"خالد عماد حمدى موسى الزرد",65543233,"10\\1",{"$f":"COUNTIFS('10-1'!$G16:$AB16,\"غائب\")","v":0},null,null,null,null,null,null,null,null,null,0,87,100,0]
[null,9,"خالد كرم صلاح الهوارى",343465,"10\\1",{"$f":"COUNTIFS('10-1'!$G17:$AB17,\"غائب\")","v":0},null,null,null,null,null,null,null,null,null,0,87,100,0]
[null,10,"خالد محمد ناصر البكرى اليافعى",76867566,"10\\1",{"$f":"COUNTIFS('10-1'!$G18:$AB18,\"غائب\")","v":0},null,null,null,null,null,null,null,null,null,0,87,100,0]
[null,11,"سعيد حمد محمد على بن نوره",767645656,"10\\1",{"$f":"COUNTIFS('10-1'!$G19:$AB19,\"غائب\")","v":0},null,null,null,null,null,null,null,null,null,0,87,100,0]
[null,12,"عبدالرحمن سالم محمد ابوعرقوه المرى",4564546456,"10\\1",{"$f":"COUNTIFS('10-1'!$G20:$AB20,\"غائب\")","v":0},null,null,null,null,null,null,null,null,null,0,87,100,0]
[null,13,"عبدالرحمن محمد علي احمد",45645645,"10\\1",{"$f":"COUNTIFS('10-1'!$G21:$AB21,\"غائب\")","v":0},null,null,null,null,null,null,null,null,null,0,87,100,0]
[null,14,"عبدالهادي اركان حسين المشهدانى",64564564564,"10\\1",{"$f":"COUNTIFS('10-1'!$G22:$AB22,\"غائب\")","v":0},null,null,null,null,null,null,null,null,null,0,87,100,0]
[null,15,"على محمد على احمد طليب",56575757,"10\\1",{"$f":"COUNTIFS('10-1'!$G23:$AB23,\"غائب\")","v":0},null,null,null,null,null,null,null,null,null,0,87,100,0]
{"$rows_left_out":155}