{"text_format":"1","workbook":"xlsx","n_sheets":5,"sheets":["بيانات المركز.","prof","حساب عدد الأيام","توزيع الحراس","أيام الحراسة"],"not_rendered":{"charts":0,"images":2,"macros":1,"external_links":29,"defined_names":409,"comments":1,"pivot_tables":0},"unopened":[],"bounds":{"document_bytes":16777216,"sheet_cells":100000,"rows_first":2000,"rows_last":500,"rows_between":2000,"halvings":0,"cell_chars":16384,"cell_head_chars":4096},"cells_cut":0,"cells_raw":0,"read":"whole","date_system":"1900"}

{"sheet":"بيانات المركز.","index":0,"n_rows":19,"n_cols":22,"rows_kept":19,"cut":false,"hidden":false,"merged":[[0,10,0,17],[18,21,18,25],[3,9,3,20],[16,5,16,7],[16,9,16,14],[17,0,17,5],[18,0,18,2],[18,3,18,7],[18,17,18,20],[12,0,12,5],[12,6,12,13],[12,15,12,20],[12,21,12,25],[13,0,13,1],[14,0,14,1],[14,2,14,6],[6,21,6,25],[14,7,14,8],[14,9,14,17],[8,0,8,2],[8,3,8,9],[8,10,8,15],[8,16,8,25],[10,0,10,2],[10,3,10,9],[10,11,10,14],[10,15,10,20],[10,21,10,25],[1,10,1,17],[4,0,4,7],[6,0,6,3],[6,4,6,9],[6,17,6,20]]}
[null,null,null,null,null,null,null,null,null,null,"الجمهوريــة الجزائريــة الديمقراطيــة الشعبيــة"]
[null,null,null,null,null,null,null,null,null,null,"وزارة التربية الوطنية"]
["الدّيوان الوطني للامتحانات و المسابقات "]
[null,null,null,null,null,null,null,null,null,"بطاقــة استعلامــات المركــز"]
[]
[]
["اختر نوع المركز",null,null,null,"الإجـــراء",null,null,null,null,null,null,null,null,null,null,null,null,"الرمـــــــز :",null,null,null,39044]
[]
["الولايـــة :",null,null,"الوادي",null,null,null,null,null,null,"مؤسسة الإجراء / الإغفال / التصحيح",null,null,null,null,null,"ثانوية المجتهد - الوادي"]
[]
["البلديـــة :",null,null,"النخلــــة",null,null,null,null,null,null,null,null,null,null,null,"رئيس(ة) مركز الإجراء :",null,null,null,null,null,"مصطفى مصطفى"]
[]
["اختـــر نوع امتحان شهادة   :",null,null,null,null,null,"بكالوريا التّعليم الثانوي",null,null,null,null,null,null,null,null,"الإطـــــــــــــــــار :",null,null,null,null,null,"مدير ثانوية"]
[]
["فــرع  :",null,"غرداية",null,null,null,null,"العنوان :",null,".ص . ب رقم 1454 بلغـــنم غرداية "]
[]
[null,null,null,null,null,"رقم الهاتف :",null,null,null,"023.45.47.14"]
[]
["الـــــدّورة  :",null,null,"جوان 2021",null,null,null,null,null,null,null,null,null,null,null,null,null,"تاريخ الامتحان :",null,null,null,"2021-06-20"]

{"sheet":"prof","index":1,"n_rows":657,"n_cols":15,"rows_kept":657,"cut":false,"hidden":false,"merged":[]}
["الرقم الترتيبي","الرقم","اللقب والاسم","الرتبة","الطور","مادة التدريس","المؤسسة","المقاطعة","العنوان","بلدية الاقامة","نوع المركز","اسم مركز التصحيح","مركز اجراء بكالوريا","مركز اجراء ش ت م","المهمة"]
[1,12453,"محمد1 علي1","أستاذ تعليم ثانوي","ثا -","العلوم الاسلامية","سعد شعباني - الرقيبة","","النخلة","النخلة","مركز اجراء امتحان ش البكالوريا","","ثانوية الشهيد بن حمده علي  - النخلة","",""]
[2,12454,"محمد1 علي2","أستاذ رئيسي في التعليم الثانوي","ثا -","الفرنسية","مفدي زكرياء - البياضة","","حي 18 فبراير","البياضة","مركز اجراء امتحان ش البكالوريا","","ثانوية الشهيد بن حمده علي  - النخلة","",""]
[3,12455,"محمد1 علي3","أستاذ مكون في التعليم الثانوي","ثا -","الانجليزية","مفدي زكرياء - البياضة","","حي الكرامة ا","البياضة","مركز اجراء امتحان ش البكالوريا","","ثانوية الشهيد بن حمده علي  - النخلة","",""]
[4,12456,"محمد1 علي4","أستاذ رئيسي في التعليم الثانوي","ثا -","الانجليزية","مفدي زكرياء - البياضة","","حي 1 نوفمبر","البياضة","مركز اجراء امتحان ش البكالوريا","","ثانوية الشهيد بن حمده علي  - النخلة","",""]
[5,12457,"محمد1 علي5","أستاذ مكون في التعليم الثانوي","ثا -","هندسة الطرائق","مفدي زكرياء - البياضة","","حي الصومام","البياضة","مركز اجراء امتحان ش البكالوريا","","ثانوية الشهيد بن حمده علي  - النخلة","",""]
[6,12458,"محمد1 علي6","أستاذ تعليم ثانوي","ثا -","الرياضيات","مفدي زكرياء - البياضة","","حي القدس","البياضة","مركز اجراء امتحان ش البكالوريا","","ثانوية الشهيد بن حمده علي  - النخلة","",""]
[7,12459,"محمد1 علي7","أستاذ تعليم ثانوي","ثا -","الاقتصاد و المناجمنت","لقرع محمد الضيف - الرباح","","حي علي دربال","الرباح","مركز اجراء امتحان ش البكالوريا","","ثانوية الشهيد بن حمده علي  - النخلة","",""]
[8,12460,"محمد1 علي8","أستاذ تعليم ثانوي","ثا -","الاقتصاد و المناجمنت","لقرع محمد الضيف - الرباح","","حي علي دربال","الرباح","مركز اجراء امتحان ش البكالوريا","","ثانوية الشهيد بن حمده علي  - النخلة","",""]
[9,12461,"محمد1 علي9","أستاذ تعليم ثانوي","ثا -","الرياضيات","مفدي زكرياء - البياضة","","النخلة","النخلة","مركز اجراء امتحان ش البكالوريا","","ثانوية الشهيد بن حمده علي  - النخلة","",""]
[10,12462,"محمد1 علي10","أستاذ رئيسي في التعليم الثانوي","ثا -","الفلسفة","مفدي زكرياء - البياضة","","حي 81 سكن","البياضة","مركز اجراء امتحان ش البكالوريا","","ثانوية الشهيد بن حمده علي  - النخلة","",""]
[11,12463,"محمد1 علي11","أستاذ مكون في التعليم الثانوي","ثا -","الرياضيات","مفدي زكرياء - البياضة","","حي اولاد عياد","البياضة","مركز اجراء امتحان ش البكالوريا","","ثانوية الشهيد بن حمده علي  - النخلة","",""]
[12,12464,"محمد1 علي12","أستاذ رئيسي في التعليم الثانوي","ثا -","الفيزياء","مفدي زكرياء - البياضة","","حي محمد بوضياف","البياضة","مركز اجراء امتحان ش البكالوريا","","ثانوية الشهيد بن حمده علي  - النخلة","",""]
[13,12465,"محمد1 علي13","أستاذ رئيسي في التعليم الثانوي","ثا -","الفيزياء","مفدي زكرياء - البياضة","","النخلة","النخلة","مركز اجراء امتحان ش البكالوريا","","ثانوية الشهيد بن حمده علي  - النخلة","",""]
[14,12466,"محمد1 علي14","أستاذ رئيسي في التعليم الثانوي","ثا -","علوم طبيعية","مفدي زكرياء - البياضة","","حي الصوالح","البياضة","مركز اجراء امتحان ش البكالوريا","","ثانوية الشهيد بن حمده علي  - النخلة","",""]
[15,12467,"محمد1 علي15","أستاذ رئيسي في التعليم الثانوي","ثا -","علوم طبيعية","مفدي زكرياء - البياضة","","حي الكرامة ا","البياضة","مركز اجراء امتحان ش البكالوريا","","ثانوية الشهيد بن حمده علي  - النخلة","",""]
[16,12468,"محمد1 علي16","أستاذ رئيسي في التعليم الثانوي","ثا -","الفيزياء","مفدي زكرياء - البياضة","","حي القدس","البياضة","مركز اجراء امتحان ش البكالوريا","","ثانوية الشهيد بن حمده علي  - النخلة","",""]
[17,12469,"محمد1 علي17","أستاذ رئيسي في التعليم الثانوي","ثا -","علوم طبيعية","مفدي زكرياء - البياضة","","حي الإستقلال","البياضة","مركز اجراء امتحان ش البكالوريا","","ثانوية الشهيد بن حمده علي  - النخلة","",""]
[18,12470,"محمد1 علي18","أستاذ رئيسي في التعليم الثانوي","ثا -","علوم طبيعية","مفدي زكرياء - البياضة","","حي 81 سكن","البياضة","مركز اجراء امتحان ش البكالوريا","","ثانوية الشهيد بن حمده علي  - النخلة","",""]
[19,12471,"محمد1 علي19","أستاذ تعليم ثانوي","ثا -","الفيزياء","خوازم الطاهر - البياضة","","أول نوفمبر 1954 البياضة","البياضة","مركز اجراء امتحان ش البكالوريا","","ثانوية الشهيد بن حمده علي  - النخلة","",""]
{"$rows_left_out":638}
{"sheet":"حساب عدد الأيام","index":2,"n_rows":178,"n_cols":15,"rows_kept":178,"cut":false,"hidden":false,"merged":[[5,9,5,10],[5,11,5,12],[5,13,6,13],[149,0,149,12],[0,4,0,7],[1,4,1,7],[5,0,6,0],[5,1,6,2],[5,3,5,4],[5,5,5,6],[5,7,5,8]]}
[null,null,null,null,"وزارة التربية الوطنية"]
[null,null,null,null,"مديرية التربية لولاية الوادي"]
[]
[]
[null,"مـركـــــز الإمتحـــان:",{"$f":"'بيانات المركز.'!Q9","v":"ثانوية المجتهد - الوادي"},null,null,null,null,"رقم المركز: ",null,{"$f":"'بيانات المركز.'!V7","v":39044},null,{"$f":"'بيانات المركز.'!D19","v":"جوان 2021"}]
["الرقم","اللقب و الإسم",null,"اليوم الاول",null,"اليوم الثاني",null,"اليوم الثالث",null,"اليوم الرابع",null,"اليوم الخامس",null,"عدد الايام"]
[null,null,null,"صباحا","مساءا","صباحا","مساءا","صباحا","مساءا","صباحا","مساءا","صباحا","مساءا"]
[1,{"$f":"'توزيع الحراس'!B3","v":"محمد1 علي1"},{"$f":"'توزيع الحراس'!A3","v":1},{"$f":"COUNTIF('توزيع الحراس'!D$3:F$42,$C8)","v":0},{"$f":"COUNTIF('توزيع الحراس'!G$3:I$42,$C8)","v":1},{"$f":"COUNTIF('توزيع الحراس'!K$3:M$42,$C8)","v":0},{"$f":"COUNTIF('توزيع الحراس'!N$3:P$42,$C8)","v":0},{"$f":"COUNTIF('توزيع الحراس'!Q$3:S$42,$C8)","v":0},{"$f":"COUNTIF('توزيع الحراس'!T$3:V$42,$C8)","v":0},{"$f":"COUNTIF('توزيع الحراس'!W$3:Y$42,$C8)","v":0},{"$f":"COUNTIF('توزيع الحراس'!Z$3:AB$42,$C8)","v":0},{"$f":"COUNTIF('توزيع الحراس'!AC$3:AE$42,$C8)","v":0},{"$f":"COUNTIF('توزيع الحراس'!AF$3:AH$42,$C8)","v":0},{"$f":"COUNTIF(D8:M8,\"x\")/2","v":0},{"$f":"SUM(D8:M8)","v":1}]
[2,{"$f":"'توزيع الحراس'!B4","v":"محمد1 علي2"},{"$f":"'توزيع الحراس'!A4","v":2},{"$f":"COUNTIF('توزيع الحراس'!D$3:F$42,$C9)","v":0},{"$f":"COUNTIF('توزيع الحراس'!G$3:I$42,$C9)","v":1},{"$f":"COUNTIF('توزيع الحراس'!K$3:M$42,$C9)","v":0},{"$f":"COUNTIF('توزيع الحراس'!N$3:P$42,$C9)","v":0},{"$f":"COUNTIF('توزيع الحراس'!Q$3:S$42,$C9)","v":0},{"$f":"COUNTIF('توزيع الحراس'!T$3:V$42,$C9)","v":0},{"$f":"COUNTIF('توزيع الحراس'!W$3:Y$42,$C9)","v":0},{"$f":"COUNTIF('توزيع الحراس'!Z$3:AB$42,$C9)","v":0},{"$f":"COUNTIF('توزيع الحراس'!AC$3:AE$42,$C9)","v":0},{"$f":"COUNTIF('توزيع الحراس'!AF$3:AH$42,$C9)","v":0},0,1]
[3,{"$f":"'توزيع الحراس'!B5","v":"محمد1 علي3"},{"$f":"'توزيع الحراس'!A5","v":3},{"$f":"COUNTIF('توزيع الحراس'!D$3:F$42,$C10)","v":0},{"$f":"COUNTIF('توزيع الحراس'!G$3:I$42,$C10)","v":1},{"$f":"COUNTIF('توزيع الحراس'!K$3:M$42,$C10)","v":0},{"$f":"COUNTIF('توزيع الحراس'!N$3:P$42,$C10)","v":0},{"$f":"COUNTIF('توزيع الحراس'!Q$3:S$42,$C10)","v":0},{"$f":"COUNTIF('توزيع الحراس'!T$3:V$42,$C10)","v":0},{"$f":"COUNTIF('توزيع الحراس'!W$3:Y$42,$C10)","v":0},{"$f":"COUNTIF('توزيع الحراس'!Z$3:AB$42,$C10)","v":0},{"$f":"COUNTIF('توزيع الحراس'!AC$3:AE$42,$C10)","v":0},{"$f":"COUNTIF('توزيع الحراس'!AF$3:AH$42,$C10)","v":0},0,1]
[4,{"$f":"'توزيع الحراس'!B6","v":"محمد1 علي4"},{"$f":"'توزيع الحراس'!A6","v":4},{"$f":"COUNTIF('توزيع الحراس'!D$3:F$42,$C11)","v":0},{"$f":"COUNTIF('توزيع الحراس'!G$3:I$42,$C11)","v":0},{"$f":"COUNTIF('توزيع الحراس'!K$3:M$42,$C11)","v":0},{"$f":"COUNTIF('توزيع الحراس'!N$3:P$42,$C11)","v":0},{"$f":"COUNTIF('توزيع الحراس'!Q$3:S$42,$C11)","v":0},{"$f":"COUNTIF('توزيع الحراس'!T$3:V$42,$C11)","v":0},{"$f":"COUNTIF('توزيع الحراس'!W$3:Y$42,$C11)","v":0},{"$f":"COUNTIF('توزيع الحراس'!Z$3:AB$42,$C11)","v":0},{"$f":"COUNTIF('توزيع الحراس'!AC$3:AE$42,$C11)","v":0},{"$f":"COUNTIF('توزيع الحراس'!AF$3:AH$42,$C11)","v":0},0,0]
[5,{"$f":"'توزيع الحراس'!B7","v":"محمد1 علي5"},{"$f":"'توزيع الحراس'!A7","v":5},{"$f":"COUNTIF('توزيع الحراس'!D$3:F$42,$C12)","v":0},{"$f":"COUNTIF('توزيع الحراس'!G$3:I$42,$C12)","v":0},{"$f":"COUNTIF('توزيع الحراس'!K$3:M$42,$C12)","v":0},{"$f":"COUNTIF('توزيع الحراس'!N$3:P$42,$C12)","v":0},{"$f":"COUNTIF('توزيع الحراس'!Q$3:S$42,$C12)","v":0},{"$f":"COUNTIF('توزيع الحراس'!T$3:V$42,$C12)","v":0},{"$f":"COUNTIF('توزيع الحراس'!W$3:Y$42,$C12)","v":0},{"$f":"COUNTIF('توزيع الحراس'!Z$3:AB$42,$C12)","v":0},{"$f":"COUNTIF('توزيع الحراس'!AC$3:AE$42,$C12)","v":0},{"$f":"COUNTIF('توزيع الحراس'!AF$3:AH$42,$C12)","v":0},0,0]
[6,{"$f":"'توزيع الحراس'!B8","v":"محمد1 علي6"},{"$f":"'توزيع الحراس'!A8","v":6},{"$f":"COUNTIF('توزيع الحراس'!D$3:F$42,$C13)","v":0},{"$f":"COUNTIF('توزيع الحراس'!G$3:I$42,$C13)","v":0},{"$f":"COUNTIF('توزيع الحراس'!K$3:M$42,$C13)","v":0},{"$f":"COUNTIF('توزيع الحراس'!N$3:P$42,$C13)","v":0},{"$f":"COUNTIF('توزيع الحراس'!Q$3:S$42,$C13)","v":0},{"$f":"COUNTIF('توزيع الحراس'!T$3:V$42,$C13)","v":0},{"$f":"COUNTIF('توزيع الحراس'!W$3:Y$42,$C13)","v":0},{"$f":"COUNTIF('توزيع الحراس'!Z$3:AB$42,$C13)","v":0},{"$f":"COUNTIF('توزيع الحراس'!AC$3:AE$42,$C13)","v":0},{"$f":"COUNTIF('توزيع الحراس'!AF$3:AH$42,$C13)","v":0},0,0]
[7,{"$f":"'توزيع الحراس'!B9","v":"محمد1 علي7"},{"$f":"'توزيع الحراس'!A9","v":7},{"$f":"COUNTIF('توزيع الحراس'!D$3:F$42,$C14)","v":0},{"$f":"COUNTIF('توزيع الحراس'!G$3:I$42,$C14)","v":0},{"$f":"COUNTIF('توزيع الحراس'!K$3:M$42,$C14)","v":0},{"$f":"COUNTIF('توزيع الحراس'!N$3:P$42,$C14)","v":0},{"$f":"COUNTIF('توزيع الحراس'!Q$3:S$42,$C14)","v":0},{"$f":"COUNTIF('توزيع الحراس'!T$3:V$42,$C14)","v":0},{"$f":"COUNTIF('توزيع الحراس'!W$3:Y$42,$C14)","v":0},{"$f":"COUNTIF('توزيع الحراس'!Z$3:AB$42,$C14)","v":0},{"$f":"COUNTIF('توزيع الحراس'!AC$3:AE$42,$C14)","v":0},{"$f":"COUNTIF('توزيع الحراس'!AF$3:AH$42,$C14)","v":0},0,0]
[8,{"$f":"'توزيع الحراس'!B10","v":"محمد1 علي8"},{"$f":"'توزيع الحراس'!A10","v":8},{"$f":"COUNTIF('توزيع الحراس'!D$3:F$42,$C15)","v":0},{"$f":"COUNTIF('توزيع الحراس'!G$3:I$42,$C15)","v":0},{"$f":"COUNTIF('توزيع الحراس'!K$3:M$42,$C15)","v":0},{"$f":"COUNTIF('توزيع الحراس'!N$3:P$42,$C15)","v":0},{"$f":"COUNTIF('توزيع الحراس'!Q$3:S$42,$C15)","v":0},{"$f":"COUNTIF('توزيع الحراس'!T$3:V$42,$C15)","v":0},{"$f":"COUNTIF('توزيع الحراس'!W$3:Y$42,$C15)","v":0},{"$f":"COUNTIF('توزيع الحراس'!Z$3:AB$42,$C15)","v":0},{"$f":"COUNTIF('توزيع الحراس'!AC$3:AE$42,$C15)","v":0},{"$f":"COUNTIF('توزيع الحراس'!AF$3:AH$42,$C15)","v":0},0,0]
[9,{"$f":"'توزيع الحراس'!B11","v":"محمد1 علي9"},{"$f":"'توزيع الحراس'!A11","v":9},{"$f":"COUNTIF('توزيع الحراس'!D$3:F$42,$C16)","v":0},{"$f":"COUNTIF('توزيع الحراس'!G$3:I$42,$C16)","v":0},{"$f":"COUNTIF('توزيع الحراس'!K$3:M$42,$C16)","v":0},{"$f":"COUNTIF('توزيع الحراس'!N$3:P$42,$C16)","v":0},{"$f":"COUNTIF('توزيع الحراس'!Q$3:S$42,$C16)","v":0},{"$f":"COUNTIF('توزيع الحراس'!T$3:V$42,$C16)","v":0},{"$f":"COUNTIF('توزيع الحراس'!W$3:Y$42,$C16)","v":0},{"$f":"COUNTIF('توزيع الحراس'!Z$3:AB$42,$C16)","v":0},{"$f":"COUNTIF('توزيع الحراس'!AC$3:AE$42,$C16)","v":0},{"$f":"COUNTIF('توزيع الحراس'!AF$3:AH$42,$C16)","v":0},0,0]
[10,{"$f":"'توزيع الحراس'!B12","v":"محمد1 علي10"},{"$f":"'توزيع الحراس'!A12","v":10},{"$f":"COUNTIF('توزيع الحراس'!D$3:F$42,$C17)","v":1},{"$f":"COUNTIF('توزيع الحراس'!G$3:I$42,$C17)","v":0},{"$f":"COUNTIF('توزيع الحراس'!K$3:M$42,$C17)","v":0},{"$f":"COUNTIF('توزيع الحراس'!N$3:P$42,$C17)","v":0},{"$f":"COUNTIF('توزيع الحراس'!Q$3:S$42,$C17)","v":0},{"$f":"COUNTIF('توزيع الحراس'!T$3:V$42,$C17)","v":0},{"$f":"COUNTIF('توزيع الحراس'!W$3:Y$42,$C17)","v":0},{"$f":"COUNTIF('توزيع الحراس'!Z$3:AB$42,$C17)","v":0},{"$f":"COUNTIF('توزيع الحراس'!AC$3:AE$42,$C17)","v":0},{"$f":"COUNTIF('توزيع الحراس'!AF$3:AH$42,$C17)","v":0},0,1]
[11,{"$f":"'توزيع الحراس'!B13","v":"محمد1 علي11"},{"$f":"'توزيع الحراس'!A13","v":11},{"$f":"COUNTIF('توزيع الحراس'!D$3:F$42,$C18)","v":1},{"$f":"COUNTIF('توزيع الحراس'!G$3:I$42,$C18)","v":0},{"$f":"COUNTIF('توزيع الحراس'!K$3:M$42,$C18)","v":0},{"$f":"COUNTIF('توزيع الحراس'!N$3:P$42,$C18)","v":0},{"$f":"COUNTIF('توزيع الحراس'!Q$3:S$42,$C18)","v":0},{"$f":"COUNTIF('توزيع الحراس'!T$3:V$42,$C18)","v":0},{"$f":"COUNTIF('توزيع الحراس'!W$3:Y$42,$C18)","v":0},{"$f":"COUNTIF('توزيع الحراس'!Z$3:AB$42,$C18)","v":0},{"$f":"COUNTIF('توزيع الحراس'!AC$3:AE$42,$C18)","v":0},{"$f":"COUNTIF('توزيع الحراس'!AF$3:AH$42,$C18)","v":0},0,1]
[12,{"$f":"'توزيع الحراس'!B14","v":"محمد1 علي12"},{"$f":"'توزيع الحراس'!A14","v":12},{"$f":"COUNTIF('توزيع الحراس'!D$3:F$42,$C19)","v":1},{"$f":"COUNTIF('توزيع الحراس'!G$3:I$42,$C19)","v":0},{"$f":"COUNTIF('توزيع الحراس'!K$3:M$42,$C19)","v":0},{"$f":"COUNTIF('توزيع الحراس'!N$3:P$42,$C19)","v":0},{"$f":"COUNTIF('توزيع الحراس'!Q$3:S$42,$C19)","v":0},{"$f":"COUNTIF('توزيع الحراس'!T$3:V$42,$C19)","v":0},{"$f":"COUNTIF('توزيع الحراس'!W$3:Y$42,$C19)","v":0},{"$f":"COUNTIF('توزيع الحراس'!Z$3:AB$42,$C19)","v":0},{"$f":"COUNTIF('توزيع الحراس'!AC$3:AE$42,$C19)","v":0},{"$f":"COUNTIF('توزيع الحراس'!AF$3:AH$42,$C19)","v":0},0,1]
[13,{"$f":"'توزيع الحراس'!B15","v":"محمد1 علي13"},{"$f":"'توزيع الحراس'!A15","v":13},{"$f":"COUNTIF('توزيع الحراس'!D$3:F$42,$C20)","v":0},{"$f":"COUNTIF('توزيع الحراس'!G$3:I$42,$C20)","v":0},{"$f":"COUNTIF('توزيع الحراس'!K$3:M$42,$C20)","v":1},{"$f":"COUNTIF('توزيع الحراس'!N$3:P$42,$C20)","v":0},{"$f":"COUNTIF('توزيع الحراس'!Q$3:S$42,$C20)","v":0},{"$f":"COUNTIF('توزيع الحراس'!T$3:V$42,$C20)","v":0},{"$f":"COUNTIF('توزيع الحراس'!W$3:Y$42,$C20)","v":0},{"$f":"COUNTIF('توزيع الحراس'!Z$3:AB$42,$C20)","v":0},{"$f":"COUNTIF('توزيع الحراس'!AC$3:AE$42,$C20)","v":0},{"$f":"COUNTIF('توزيع الحراس'!AF$3:AH$42,$C20)","v":0},0,1]
{"$rows_left_out":159}
{"sheet":"توزيع الحراس","index":3,"n_rows":252,"n_cols":37,"rows_kept":252,"cut":false,"hidden":false,"merged":[[1,25,1,27],[1,3,1,5],[1,6,1,8],[0,3,0,8],[0,10,0,15],[1,10,1,12],[1,13,1,15],[0,16,0,21],[1,16,1,18],[1,19,1,21],[32,2,42,2],[1,28,1,30],[1,31,1,33],[0,28,0,33],[32,3,32,5],[32,6,32,8],[32,10,32,12],[32,13,32,15],[32,16,32,18],[32,19,32,21],[32,22,32,24],[32,25,32,27],[32,28,32,30],[32,31,32,33],[0,22,0,27],[1,22,1,24]]}
[null,null,"أيام الامتحان             ","اليوم الأول",null,null,null,null,null,null,"اليوم الثاني",null,null,null,null,null,"اليوم الثالث",null,null,null,null,null,"اليوم الرابع",null,null,null,null,null,"اليوم الخامس"]
["الرقم"," لقب وإسم الحارس","القاعات","صباحا",null,null,"مساءً",null,null,null,"صباحا",null,null,"مساءً",null,null,"صباحا",null,null,"مساءً",null,null,"صباحا",null,null,"مساءً",null,null,"صباحا",null,null,"مساءً"]
[{"$f":"prof!A2","v":1},{"$f":"prof!C2","v":"محمد1 علي1"},1,10,11,12,1,2,3,null,15,13,20,77,100,101]
[{"$f":"prof!A3","v":2},{"$f":"prof!C3","v":"محمد1 علي2"},2,null,null,null,null,null,null,null,null,null,null,null,null,null,null,null,null,null,null,null,null,null,null,null,null,null,null,null,null,null,null,null,null,null,{"$f":"IF(C2:C32=G2,ROW(),\"\")","v":""}]
[{"$f":"prof!A4","v":3},{"$f":"prof!C4","v":"محمد1 علي3"},3]
[{"$f":"prof!A5","v":4},{"$f":"prof!C5","v":"محمد1 علي4"},4]
[{"$f":"prof!A6","v":5},{"$f":"prof!C6","v":"محمد1 علي5"},5]
[{"$f":"prof!A7","v":6},{"$f":"prof!C7","v":"محمد1 علي6"},6]
[{"$f":"prof!A8","v":7},{"$f":"prof!C8","v":"محمد1 علي7"},7]
[{"$f":"prof!A9","v":8},{"$f":"prof!C9","v":"محمد1 علي8"},8]
[{"$f":"prof!A10","v":9},{"$f":"prof!C10","v":"محمد1 علي9"},9]
[{"$f":"prof!A11","v":10},{"$f":"prof!C11","v":"محمد1 علي10"},10]
[{"$f":"prof!A12","v":11},{"$f":"prof!C12","v":"محمد1 علي11"},11]
[{"$f":"prof!A13","v":12},{"$f":"prof!C13","v":"محمد1 علي12"},12]
[{"$f":"prof!A14","v":13},{"$f":"prof!C14","v":"محمد1 علي13"},13]
[{"$f":"prof!A15","v":14},{"$f":"prof!C15","v":"محمد1 علي14"},14]
[{"$f":"prof!A16","v":15},{"$f":"prof!C16","v":"محمد1 علي15"},15]
[{"$f":"prof!A17","v":16},{"$f":"prof!C17","v":"محمد1 علي16"},16]
[{"$f":"prof!A18","v":17},{"$f":"prof!C18","v":"محمد1 علي17"},17]
[{"$f":"prof!A19","v":18},{"$f":"prof!C19","v":"محمد1 علي18"},18]
{"$rows_left_out":233}
{"sheet":"أيام الحراسة","index":4,"n_rows":39,"n_cols":13,"rows_kept":39,"cut":false,"hidden":false,"merged":[[34,0,36,3],[34,4,34,5],[34,8,34,9],[35,4,35,5],[35,8,35,9],[36,4,36,5],[36,8,36,9],[28,6,28,9],[31,1,31,5],[9,6,9,8],[30,1,30,5],[30,6,30,9],[25,1,25,5],[26,1,26,5],[27,1,27,5],[28,1,28,5],[29,1,29,5],[24,1,24,5],[24,6,24,9],[25,6,25,9],[26,6,26,9],[27,6,27,9],[17,1,17,5],[18,1,18,5],[19,1,19,5],[20,1,20,5],[16,6,16,9],[17,6,17,9],[18,6,18,9],[12,1,12,5],[13,1,13,5],[14,1,14,5],[15,1,15,5],[16,1,16,5],[13,10,13,14],[16,10,16,14],[17,10,17,14],[18,10,18,14],[19,10,19,14],[14,6,14,9],[15,6,15,9],[24,10,24,14],[23,10,23,14],[19,6,19,9],[21,6,21,9],[22,6,22,9],[23,6,23,9],[23,1,23,5],[9,0,9,2],[2,0,2,6],[9,3,9,4],[5,2,5,11],[11,10,11,14],[11,6,11,9],[11,1,11,5],[20,6,20,9],[20,10,20,14],[9,11,9,14],[14,10,14,14],[15,10,15,14],[12,10,12,14],[12,6,12,9],[13,6,13,9],[0,0,0,13],[1,0,1,13],[2,8,2,13],[4,8,4,10],[4,0,4,2],[4,3,4,6],[37,0,37,2],[37,4,37,5],[37,8,37,9],[21,10,21,14],[22,10,22,14],[25,10,25,14],[26,10,26,14],[27,10,27,14],[29,6,29,9],[31,6,31,9],[28,10,28,14],[29,10,29,14],[30,10,30,14],[31,10,31,14],[21,1,21,5],[22,1,22,5],[38,10,38,14],[34,12,34,14],[35,12,35,14],[36,12,36,14],[37,12,37,14]]}
["الجمهوريــة الجزائريــة الديمقراطيــة الشعبيــة"]
["وزارة التربيــة الوطنيـة"]
["مديريــة التربيـــة لولايـــة الــــوادي",null,null,null,null,null,null,null,"الديوان الوطني للامتحانات والمسابقات"]
[]
["مركز الإجراء: ",null,null,{"$f":"'بيانات المركز.'!Q9","v":"ثانوية المجتهد - الوادي"},null,null,null,null,"رمز المركز:  ",null,null,{"$f":"'بيانات المركز.'!V7","v":39044}]
[null,null,"إمتحــان شهـادة البكالـــوريا دورة جــــوان 2021"]
[]
[]
[]
["التاريــــخ:",null,null,{"$f":"TODAY()","v":"2021-06-30"},null,null,"اليــــوم الأول",null,null,null,"الفتـــرة:","مسائيـــــة"]
[]
["القاعة","الحـــــارس الأول",null,null,null,null,"الحـــــارس الثانـــي",null,null,null,"الحـــارس الثالـــث"]
[1,{"$f":"IFERROR(VLOOKUP(OFFSET('توزيع الحراس'!$A$1,MATCH($A13,'توزيع الحراس'!$C:$C,0)-1,MATCH($G$10,'توزيع الحراس'!$1:$1,0)+IF($L$10=\"صباحيـــــة\",0,3)+COUNTA($B$12:B$12)-2),prof,3,FALSE),\"\")","v":"محمد1 علي1"},null,null,null,null,{"$f":"IFERROR(VLOOKUP(OFFSET('توزيع الحراس'!$A$1,MATCH($A13,'توزيع الحراس'!$C:$C,0)-1,MATCH($G$10,'توزيع الحراس'!$1:$1,0)+IF($L$10=\"صباحيـــــة\",0,3)+COUNTA($B$12:G$12)-2),prof,3,FALSE),\"\")","v":"محمد1 علي2"},null,null,null,{"$f":"IFERROR(VLOOKUP(OFFSET('توزيع الحراس'!$A$1,MATCH($A13,'توزيع الحراس'!$C:$C,0)-1,MATCH($G$10,'توزيع الحراس'!$1:$1,0)+IF($L$10=\"صباحيـــــة\",0,3)+COUNTA($B$12:K$12)-2),prof,3,FALSE),\"\")","v":"محمد1 علي3"}]
[2,{"$f":"IFERROR(VLOOKUP(OFFSET('توزيع الحراس'!$A$1,MATCH($A14,'توزيع الحراس'!$C:$C,0)-1,MATCH($G$10,'توزيع الحراس'!$1:$1,0)+IF($L$10=\"صباحيـــــة\",0,3)+COUNTA($B$12:B$12)-2),prof,3,FALSE),\"\")","v":""},null,null,null,null,{"$f":"IFERROR(VLOOKUP(OFFSET('توزيع الحراس'!$A$1,MATCH($A14,'توزيع الحراس'!$C:$C,0)-1,MATCH($G$10,'توزيع الحراس'!$1:$1,0)+IF($L$10=\"صباحيـــــة\",0,3)+COUNTA($B$12:G$12)-2),prof,3,FALSE),\"\")","v":""},null,null,null,{"$f":"IFERROR(VLOOKUP(OFFSET('توزيع الحراس'!$A$1,MATCH($A14,'توزيع الحراس'!$C:$C,0)-1,MATCH($G$10,'توزيع الحراس'!$1:$1,0)+IF($L$10=\"صباحيـــــة\",0,3)+COUNTA($B$12:K$12)-2),prof,3,FALSE),\"\")","v":""}]
[3,{"$f":"IFERROR(VLOOKUP(OFFSET('توزيع الحراس'!$A$1,MATCH($A15,'توزيع الحراس'!$C:$C,0)-1,MATCH($G$10,'توزيع الحراس'!$1:$1,0)+IF($L$10=\"صباحيـــــة\",0,3)+COUNTA($B$12:B$12)-2),prof,3,FALSE),\"\")","v":""},null,null,null,null,{"$f":"IFERROR(VLOOKUP(OFFSET('توزيع الحراس'!$A$1,MATCH($A15,'توزيع الحراس'!$C:$C,0)-1,MATCH($G$10,'توزيع الحراس'!$1:$1,0)+IF($L$10=\"صباحيـــــة\",0,3)+COUNTA($B$12:G$12)-2),prof,3,FALSE),\"\")","v":""},null,null,null,{"$f":"IFERROR(VLOOKUP(OFFSET('توزيع الحراس'!$A$1,MATCH($A15,'توزيع الحراس'!$C:$C,0)-1,MATCH($G$10,'توزيع الحراس'!$1:$1,0)+IF($L$10=\"صباحيـــــة\",0,3)+COUNTA($B$12:K$12)-2),prof,3,FALSE),\"\")","v":""}]
[4,{"$f":"IFERROR(VLOOKUP(OFFSET('توزيع الحراس'!$A$1,MATCH($A16,'توزيع الحراس'!$C:$C,0)-1,MATCH($G$10,'توزيع الحراس'!$1:$1,0)+IF($L$10=\"صباحيـــــة\",0,3)+COUNTA($B$12:B$12)-2),prof,3,FALSE),\"\")","v":""},null,null,null,null,{"$f":"IFERROR(VLOOKUP(OFFSET('توزيع الحراس'!$A$1,MATCH($A16,'توزيع الحراس'!$C:$C,0)-1,MATCH($G$10,'توزيع الحراس'!$1:$1,0)+IF($L$10=\"صباحيـــــة\",0,3)+COUNTA($B$12:G$12)-2),prof,3,FALSE),\"\")","v":""},null,null,null,{"$f":"IFERROR(VLOOKUP(OFFSET('توزيع الحراس'!$A$1,MATCH($A16,'توزيع الحراس'!$C:$C,0)-1,MATCH($G$10,'توزيع الحراس'!$1:$1,0)+IF($L$10=\"صباحيـــــة\",0,3)+COUNTA($B$12:K$12)-2),prof,3,FALSE),\"\")","v":""}]
[5,{"$f":"IFERROR(VLOOKUP(OFFSET('توزيع الحراس'!$A$1,MATCH($A17,'توزيع الحراس'!$C:$C,0)-1,MATCH($G$10,'توزيع الحراس'!$1:$1,0)+IF($L$10=\"صباحيـــــة\",0,3)+COUNTA($B$12:B$12)-2),prof,3,FALSE),\"\")","v":""},null,null,null,null,{"$f":"IFERROR(VLOOKUP(OFFSET('توزيع الحراس'!$A$1,MATCH($A17,'توزيع الحراس'!$C:$C,0)-1,MATCH($G$10,'توزيع الحراس'!$1:$1,0)+IF($L$10=\"صباحيـــــة\",0,3)+COUNTA($B$12:G$12)-2),prof,3,FALSE),\"\")","v":""},null,null,null,{"$f":"IFERROR(VLOOKUP(OFFSET('توزيع الحراس'!$A$1,MATCH($A17,'توزيع الحراس'!$C:$C,0)-1,MATCH($G$10,'توزيع الحراس'!$1:$1,0)+IF($L$10=\"صباحيـــــة\",0,3)+COUNTA($B$12:K$12)-2),prof,3,FALSE),\"\")","v":""}]
[6,{"$f":"IFERROR(VLOOKUP(OFFSET('توزيع الحراس'!$A$1,MATCH($A18,'توزيع الحراس'!$C:$C,0)-1,MATCH($G$10,'توزيع الحراس'!$1:$1,0)+IF($L$10=\"صباحيـــــة\",0,3)+COUNTA($B$12:B$12)-2),prof,3,FALSE),\"\")","v":""},null,null,null,null,{"$f":"IFERROR(VLOOKUP(OFFSET('توزيع الحراس'!$A$1,MATCH($A18,'توزيع الحراس'!$C:$C,0)-1,MATCH($G$10,'توزيع الحراس'!$1:$1,0)+IF($L$10=\"صباحيـــــة\",0,3)+COUNTA($B$12:G$12)-2),prof,3,FALSE),\"\")","v":""},null,null,null,{"$f":"IFERROR(VLOOKUP(OFFSET('توزيع الحراس'!$A$1,MATCH($A18,'توزيع الحراس'!$C:$C,0)-1,MATCH($G$10,'توزيع الحراس'!$1:$1,0)+IF($L$10=\"صباحيـــــة\",0,3)+COUNTA($B$12:K$12)-2),prof,3,FALSE),\"\")","v":""}]
[7,{"$f":"IFERROR(VLOOKUP(OFFSET('توزيع الحراس'!$A$1,MATCH($A19,'توزيع الحراس'!$C:$C,0)-1,MATCH($G$10,'توزيع الحراس'!$1:$1,0)+IF($L$10=\"صباحيـــــة\",0,3)+COUNTA($B$12:B$12)-2),prof,3,FALSE),\"\")","v":""},null,null,null,null,{"$f":"IFERROR(VLOOKUP(OFFSET('توزيع الحراس'!$A$1,MATCH($A19,'توزيع الحراس'!$C:$C,0)-1,MATCH($G$10,'توزيع الحراس'!$1:$1,0)+IF($L$10=\"صباحيـــــة\",0,3)+COUNTA($B$12:G$12)-2),prof,3,FALSE),\"\")","v":""},null,null,null,{"$f":"IFERROR(VLOOKUP(OFFSET('توزيع الحراس'!$A$1,MATCH($A19,'توزيع الحراس'!$C:$C,0)-1,MATCH($G$10,'توزيع الحراس'!$1:$1,0)+IF($L$10=\"صباحيـــــة\",0,3)+COUNTA($B$12:K$12)-2),prof,3,FALSE),\"\")","v":""}]
[8,{"$f":"IFERROR(VLOOKUP(OFFSET('توزيع الحراس'!$A$1,MATCH($A20,'توزيع الحراس'!$C:$C,0)-1,MATCH($G$10,'توزيع الحراس'!$1:$1,0)+IF($L$10=\"صباحيـــــة\",0,3)+COUNTA($B$12:B$12)-2),prof,3,FALSE),\"\")","v":""},null,null,null,null,{"$f":"IFERROR(VLOOKUP(OFFSET('توزيع الحراس'!$A$1,MATCH($A20,'توزيع الحراس'!$C:$C,0)-1,MATCH($G$10,'توزيع الحراس'!$1:$1,0)+IF($L$10=\"صباحيـــــة\",0,3)+COUNTA($B$12:G$12)-2),prof,3,FALSE),\"\")","v":""},null,null,null,{"$f":"IFERROR(VLOOKUP(OFFSET('توزيع الحراس'!$A$1,MATCH($A20,'توزيع الحراس'!$C:$C,0)-1,MATCH($G$10,'توزيع الحراس'!$1:$1,0)+IF($L$10=\"صباحيـــــة\",0,3)+COUNTA($B$12:K$12)-2),prof,3,FALSE),\"\")","v":""}]
{"$rows_left_out":19}