{"text_format":"1","workbook":"xlsx","n_sheets":5,"sheets":["بيانات المركز.","prof","حساب عدد الأيام","توزيع الحراس","أيام الحراسة"],"not_rendered":{"charts":0,"images":5,"macros":1,"external_links":15,"defined_names":86,"comments":0,"pivot_tables":0},"unopened":[],"bounds":{"document_bytes":16777216,"sheet_cells":100000,"rows_first":2000,"rows_last":500,"rows_between":2000,"halvings":0,"cell_chars":16384,"cell_head_chars":4096},"cells_cut":0,"cells_raw":0,"read":"whole","date_system":"1900"}

{"sheet":"بيانات المركز.","index":0,"n_rows":19,"n_cols":22,"rows_kept":19,"cut":false,"hidden":false,"merged":[[1,10,1,17],[4,0,4,7],[6,0,6,3],[6,4,6,9],[6,17,6,20],[4,9,4,10],[4,15,4,16],[6,21,6,25],[14,7,14,8],[14,9,14,17],[8,0,8,2],[8,3,8,9],[8,10,8,15],[8,16,8,25],[10,0,10,2],[10,3,10,9],[10,11,10,14],[10,15,10,20],[10,21,10,25],[0,10,0,17],[18,21,18,25],[3,9,3,20],[16,5,16,7],[16,9,16,14],[17,0,17,5],[18,0,18,2],[18,3,18,7],[18,17,18,20],[12,0,12,5],[12,6,12,13],[12,15,12,20],[12,21,12,25],[13,0,13,1],[14,0,14,1],[14,2,14,6]]}
[null,null,null,null,null,null,null,null,null,null,"الجمهوريــة الجزائريــة الديمقراطيــة الشعبيــة"]
[null,null,null,null,null,null,null,null,null,null,"وزارة التربية الوطنية"]
["الدّيوان الوطني للامتحانات و المسابقات "]
[null,null,null,null,null,null,null,null,null,"بطاقــة استعلامــات المركــز"]
[]
[]
["اختر نوع المركز",null,null,null,"الإجـــراء",null,null,null,null,null,null,null,null,null,null,null,null,"الرمـــــــز :",null,null,null,39044]
[]
["الولايـــة :",null,null,"الوادي",null,null,null,null,null,null,"مؤسسة الإجراء / الإغفال / التصحيح",null,null,null,null,null,"ثانوية المجتهد - الوادي"]
[]
["البلديـــة :",null,null,"الوادي",null,null,null,null,null,null,null,null,null,null,null,"رئيس(ة) مركز الإجراء :",null,null,null,null,null,"مصطفى مصطفى"]
[]
["اختـــر نوع امتحان شهادة   :",null,null,null,null,null,"إمتحــان شهـادة البكالـــوريا",null,null,null,null,null,null,null,null,"الإطـــــــــــــــــار :",null,null,null,null,null,"مدير ثانوية"]
[]
["فــرع  :",null,"غرداية",null,null,null,null,"العنوان :",null,".ص . ب رقم 1454 بلغـــنم غرداية "]
[]
[null,null,null,null,null,"رقم الهاتف :",null,null,null,"023.45.47.14"]
[]
["الـــــدّورة  :",null,null,"جــــوان 2021",null,null,null,null,null,null,null,null,null,null,null,null,null,"تاريخ الامتحان :",null,null,null,"2021-06-20"]

{"sheet":"prof","index":1,"n_rows":657,"n_cols":15,"rows_kept":657,"cut":false,"hidden":false,"merged":[]}
["الرقم الترتيبي","الرقم","اللقب والاسم","الرتبة","الطور","مادة التدريس","المؤسسة","المقاطعة","العنوان","بلدية الاقامة","نوع المركز","اسم مركز التصحيح","مركز اجراء بكالوريا","مركز اجراء ش ت م","المهمة"]
[1,10000254621,"محمد علي1","أستاذ تعليم ثانوي","ثا -","العلوم الاسلامية","سعد شعباني - الرقيبة","","النخلة","النخلة","مركز اجراء امتحان ش البكالوريا","","ثانوية الشهيد بن حمده علي  - النخلة","",""]
[2,10000254622,"محمد علي2","أستاذ رئيسي في التعليم الثانوي","ثا -","الفرنسية","مفدي زكرياء - البياضة","","حي 18 فبراير","البياضة","مركز اجراء امتحان ش البكالوريا","","ثانوية الشهيد بن حمده علي  - النخلة","",""]
[3,10000254623,"محمد علي3","أستاذ مكون في التعليم الثانوي","ثا -","الانجليزية","مفدي زكرياء - البياضة","","حي الكرامة ا","البياضة","مركز اجراء امتحان ش البكالوريا","","ثانوية الشهيد بن حمده علي  - النخلة","",""]
[4,10000254624,"محمد علي4","أستاذ رئيسي في التعليم الثانوي","ثا -","الانجليزية","مفدي زكرياء - البياضة","","حي 1 نوفمبر","البياضة","مركز اجراء امتحان ش البكالوريا","","ثانوية الشهيد بن حمده علي  - النخلة","",""]
[5,10000254625,"محمد علي5","أستاذ مكون في التعليم الثانوي","ثا -","هندسة الطرائق","مفدي زكرياء - البياضة","","حي الصومام","البياضة","مركز اجراء امتحان ش البكالوريا","","ثانوية الشهيد بن حمده علي  - النخلة","",""]
[6,10000254626,"محمد علي6","أستاذ تعليم ثانوي","ثا -","الرياضيات","مفدي زكرياء - البياضة","","حي القدس","البياضة","مركز اجراء امتحان ش البكالوريا","","ثانوية الشهيد بن حمده علي  - النخلة","",""]
[7,10000254627,"محمد علي7","أستاذ تعليم ثانوي","ثا -","الاقتصاد و المناجمنت","لقرع محمد الضيف - الرباح","","حي علي دربال","الرباح","مركز اجراء امتحان ش البكالوريا","","ثانوية الشهيد بن حمده علي  - النخلة","",""]
[8,10000254628,"محمد علي8","أستاذ تعليم ثانوي","ثا -","الاقتصاد و المناجمنت","لقرع محمد الضيف - الرباح","","حي علي دربال","الرباح","مركز اجراء امتحان ش البكالوريا","","ثانوية الشهيد بن حمده علي  - النخلة","",""]
[9,10000254629,"محمد علي9","أستاذ تعليم ثانوي","ثا -","الرياضيات","مفدي زكرياء - البياضة","","النخلة","النخلة","مركز اجراء امتحان ش البكالوريا","","ثانوية الشهيد بن حمده علي  - النخلة","",""]
[10,10000254630,"محمد علي10","أستاذ رئيسي في التعليم الثانوي","ثا -","الفلسفة","مفدي زكرياء - البياضة","","حي 81 سكن","البياضة","مركز اجراء امتحان ش البكالوريا","","ثانوية الشهيد بن حمده علي  - النخلة","",""]
[11,10000254631,"محمد علي11","أستاذ مكون في التعليم الثانوي","ثا -","الرياضيات","مفدي زكرياء - البياضة","","حي اولاد عياد","البياضة","مركز اجراء امتحان ش البكالوريا","","ثانوية الشهيد بن حمده علي  - النخلة","",""]
[12,10000254632,"محمد علي12","أستاذ رئيسي في التعليم الثانوي","ثا -","الفيزياء","مفدي زكرياء - البياضة","","حي محمد بوضياف","البياضة","مركز اجراء امتحان ش البكالوريا","","ثانوية الشهيد بن حمده علي  - النخلة","",""]
[13,10000254633,"محمد علي13","أستاذ رئيسي في التعليم الثانوي","ثا -","الفيزياء","مفدي زكرياء - البياضة","","النخلة","النخلة","مركز اجراء امتحان ش البكالوريا","","ثانوية الشهيد بن حمده علي  - النخلة","",""]
[14,10000254634,"محمد علي14","أستاذ رئيسي في التعليم الثانوي","ثا -","علوم طبيعية","مفدي زكرياء - البياضة","","حي الصوالح","البياضة","مركز اجراء امتحان ش البكالوريا","","ثانوية الشهيد بن حمده علي  - النخلة","",""]
[15,10000254635,"محمد علي15","أستاذ رئيسي في التعليم الثانوي","ثا -","علوم طبيعية","مفدي زكرياء - البياضة","","حي الكرامة ا","البياضة","مركز اجراء امتحان ش البكالوريا","","ثانوية الشهيد بن حمده علي  - النخلة","",""]
[16,10000254636,"محمد علي16","أستاذ رئيسي في التعليم الثانوي","ثا -","الفيزياء","مفدي زكرياء - البياضة","","حي القدس","البياضة","مركز اجراء امتحان ش البكالوريا","","ثانوية الشهيد بن حمده علي  - النخلة","",""]
[17,10000254637,"محمد علي17","أستاذ رئيسي في التعليم الثانوي","ثا -","علوم طبيعية","مفدي زكرياء - البياضة","","حي الإستقلال","البياضة","مركز اجراء امتحان ش البكالوريا","","ثانوية الشهيد بن حمده علي  - النخلة","",""]
[18,10000254638,"محمد علي18","أستاذ رئيسي في التعليم الثانوي","ثا -","علوم طبيعية","مفدي زكرياء - البياضة","","حي 81 سكن","البياضة","مركز اجراء امتحان ش البكالوريا","","ثانوية الشهيد بن حمده علي  - النخلة","",""]
[19,10000254639,"محمد علي19","أستاذ تعليم ثانوي","ثا -","الفيزياء","خوازم الطاهر - البياضة","","أول نوفمبر 1954 البياضة","البياضة","مركز اجراء امتحان ش البكالوريا","","ثانوية الشهيد بن حمده علي  - النخلة","",""]
{"$rows_left_out":638}
{"sheet":"حساب عدد الأيام","index":2,"n_rows":151,"n_cols":15,"rows_kept":151,"cut":false,"hidden":false,"merged":[[6,14,7,14],[6,9,6,10],[6,11,6,12],[150,0,150,12],[6,0,7,0],[6,3,6,4],[6,5,6,6],[6,7,6,8],[6,13,7,13],[4,9,4,10],[4,2,4,6],[6,1,7,1],[6,2,7,2],[0,4,0,7],[1,4,1,7]]}
[null,null,null,null,"وزارة التربية الوطنية"]
[null,null,null,null,"مديرية التربية لولاية الوادي"]
[]
[]
[null,"مـركـــــز الإمتحـــان:",{"$f":"'بيانات المركز.'!Q9","v":"ثانوية المجتهد - الوادي"},null,null,null,null,"رمــز المركـــز: ",null,{"$f":"'بيانات المركز.'!V7","v":39044},null,{"$f":"'بيانات المركز.'!D19","v":"جــــوان 2021"}]
[]
["الرقم","اللقب و الإسم","القاعة","اليوم الاول",null,"اليوم الثاني",null,"اليوم الثالث",null,"اليوم الرابع",null,"اليوم الخامس",null,"عدد الايام","%"]
[null,null,null,"صباحا","مساءا","صباحا","مساءا","صباحا","مساءا","صباحا","مساءا","صباحا","مساءا"]
[1,{"$f":"'توزيع الحراس'!B3","v":"محمد علي1"},{"$f":"'توزيع الحراس'!A3","v":1},{"$f":"COUNTIF('توزيع الحراس'!D$3:F$30,$C9)","v":0},{"$f":"COUNTIF('توزيع الحراس'!G$3:I$30,$C9)","v":0},{"$f":"COUNTIF('توزيع الحراس'!K$3:M$30,$C9)","v":0},{"$f":"COUNTIF('توزيع الحراس'!N$3:P$30,$C9)","v":0},{"$f":"COUNTIF('توزيع الحراس'!Q$3:S$30,$C9)","v":0},{"$f":"COUNTIF('توزيع الحراس'!T$3:V$30,$C9)","v":0},{"$f":"COUNTIF('توزيع الحراس'!W$3:Y$30,$C9)","v":0},{"$f":"COUNTIF('توزيع الحراس'!Z$3:AB$30,$C9)","v":0},{"$f":"COUNTIF('توزيع الحراس'!AC$3:AE$30,$C9)","v":0},{"$f":"COUNTIF('توزيع الحراس'!AF$3:AH$30,$C9)","v":0},{"$f":"SUM(D9:M9)","v":0},{"$f":"N9*0.5","v":0}]
[2,{"$f":"'توزيع الحراس'!B4","v":"محمد علي2"},{"$f":"'توزيع الحراس'!A4","v":2},{"$f":"COUNTIF('توزيع الحراس'!D$3:F$30,$C10)","v":0},{"$f":"COUNTIF('توزيع الحراس'!G$3:I$30,$C10)","v":0},{"$f":"COUNTIF('توزيع الحراس'!K$3:M$30,$C10)","v":0},{"$f":"COUNTIF('توزيع الحراس'!N$3:P$30,$C10)","v":0},{"$f":"COUNTIF('توزيع الحراس'!Q$3:S$30,$C10)","v":2},{"$f":"COUNTIF('توزيع الحراس'!T$3:V$30,$C10)","v":3},{"$f":"COUNTIF('توزيع الحراس'!W$3:Y$30,$C10)","v":3},{"$f":"COUNTIF('توزيع الحراس'!Z$3:AB$30,$C10)","v":3},{"$f":"COUNTIF('توزيع الحراس'!AC$3:AE$30,$C10)","v":0},{"$f":"COUNTIF('توزيع الحراس'!AF$3:AH$30,$C10)","v":0},11,5.5]
[3,{"$f":"'توزيع الحراس'!B5","v":"محمد علي3"},{"$f":"'توزيع الحراس'!A5","v":3},{"$f":"COUNTIF('توزيع الحراس'!D$3:F$30,$C11)","v":0},{"$f":"COUNTIF('توزيع الحراس'!G$3:I$30,$C11)","v":0},{"$f":"COUNTIF('توزيع الحراس'!K$3:M$30,$C11)","v":0},{"$f":"COUNTIF('توزيع الحراس'!N$3:P$30,$C11)","v":0},{"$f":"COUNTIF('توزيع الحراس'!Q$3:S$30,$C11)","v":1},{"$f":"COUNTIF('توزيع الحراس'!T$3:V$30,$C11)","v":0},{"$f":"COUNTIF('توزيع الحراس'!W$3:Y$30,$C11)","v":0},{"$f":"COUNTIF('توزيع الحراس'!Z$3:AB$30,$C11)","v":0},{"$f":"COUNTIF('توزيع الحراس'!AC$3:AE$30,$C11)","v":0},{"$f":"COUNTIF('توزيع الحراس'!AF$3:AH$30,$C11)","v":0},1,0.5]
[4,{"$f":"'توزيع الحراس'!B6","v":"محمد علي4"},{"$f":"'توزيع الحراس'!A6","v":4},{"$f":"COUNTIF('توزيع الحراس'!D$3:F$30,$C12)","v":0},{"$f":"COUNTIF('توزيع الحراس'!G$3:I$30,$C12)","v":0},{"$f":"COUNTIF('توزيع الحراس'!K$3:M$30,$C12)","v":0},{"$f":"COUNTIF('توزيع الحراس'!N$3:P$30,$C12)","v":0},{"$f":"COUNTIF('توزيع الحراس'!Q$3:S$30,$C12)","v":0},{"$f":"COUNTIF('توزيع الحراس'!T$3:V$30,$C12)","v":0},{"$f":"COUNTIF('توزيع الحراس'!W$3:Y$30,$C12)","v":0},{"$f":"COUNTIF('توزيع الحراس'!Z$3:AB$30,$C12)","v":0},{"$f":"COUNTIF('توزيع الحراس'!AC$3:AE$30,$C12)","v":0},{"$f":"COUNTIF('توزيع الحراس'!AF$3:AH$30,$C12)","v":0},0,0]
[5,{"$f":"'توزيع الحراس'!B7","v":"محمد علي5"},{"$f":"'توزيع الحراس'!A7","v":5},{"$f":"COUNTIF('توزيع الحراس'!D$3:F$30,$C13)","v":0},{"$f":"COUNTIF('توزيع الحراس'!G$3:I$30,$C13)","v":0},{"$f":"COUNTIF('توزيع الحراس'!K$3:M$30,$C13)","v":0},{"$f":"COUNTIF('توزيع الحراس'!N$3:P$30,$C13)","v":0},{"$f":"COUNTIF('توزيع الحراس'!Q$3:S$30,$C13)","v":0},{"$f":"COUNTIF('توزيع الحراس'!T$3:V$30,$C13)","v":0},{"$f":"COUNTIF('توزيع الحراس'!W$3:Y$30,$C13)","v":0},{"$f":"COUNTIF('توزيع الحراس'!Z$3:AB$30,$C13)","v":0},{"$f":"COUNTIF('توزيع الحراس'!AC$3:AE$30,$C13)","v":1},{"$f":"COUNTIF('توزيع الحراس'!AF$3:AH$30,$C13)","v":2},3,1.5]
[6,{"$f":"'توزيع الحراس'!B8","v":"محمد علي6"},{"$f":"'توزيع الحراس'!A8","v":6},{"$f":"COUNTIF('توزيع الحراس'!D$3:F$30,$C14)","v":0},{"$f":"COUNTIF('توزيع الحراس'!G$3:I$30,$C14)","v":0},{"$f":"COUNTIF('توزيع الحراس'!K$3:M$30,$C14)","v":0},{"$f":"COUNTIF('توزيع الحراس'!N$3:P$30,$C14)","v":0},{"$f":"COUNTIF('توزيع الحراس'!Q$3:S$30,$C14)","v":0},{"$f":"COUNTIF('توزيع الحراس'!T$3:V$30,$C14)","v":0},{"$f":"COUNTIF('توزيع الحراس'!W$3:Y$30,$C14)","v":0},{"$f":"COUNTIF('توزيع الحراس'!Z$3:AB$30,$C14)","v":0},{"$f":"COUNTIF('توزيع الحراس'!AC$3:AE$30,$C14)","v":0},{"$f":"COUNTIF('توزيع الحراس'!AF$3:AH$30,$C14)","v":0},0,0]
[7,{"$f":"'توزيع الحراس'!B9","v":"محمد علي7"},{"$f":"'توزيع الحراس'!A9","v":7},{"$f":"COUNTIF('توزيع الحراس'!D$3:F$30,$C15)","v":0},{"$f":"COUNTIF('توزيع الحراس'!G$3:I$30,$C15)","v":0},{"$f":"COUNTIF('توزيع الحراس'!K$3:M$30,$C15)","v":0},{"$f":"COUNTIF('توزيع الحراس'!N$3:P$30,$C15)","v":0},{"$f":"COUNTIF('توزيع الحراس'!Q$3:S$30,$C15)","v":0},{"$f":"COUNTIF('توزيع الحراس'!T$3:V$30,$C15)","v":0},{"$f":"COUNTIF('توزيع الحراس'!W$3:Y$30,$C15)","v":0},{"$f":"COUNTIF('توزيع الحراس'!Z$3:AB$30,$C15)","v":0},{"$f":"COUNTIF('توزيع الحراس'!AC$3:AE$30,$C15)","v":0},{"$f":"COUNTIF('توزيع الحراس'!AF$3:AH$30,$C15)","v":1},1,0.5]
[8,{"$f":"'توزيع الحراس'!B10","v":"محمد علي8"},{"$f":"'توزيع الحراس'!A10","v":8},{"$f":"COUNTIF('توزيع الحراس'!D$3:F$30,$C16)","v":0},{"$f":"COUNTIF('توزيع الحراس'!G$3:I$30,$C16)","v":0},{"$f":"COUNTIF('توزيع الحراس'!K$3:M$30,$C16)","v":0},{"$f":"COUNTIF('توزيع الحراس'!N$3:P$30,$C16)","v":0},{"$f":"COUNTIF('توزيع الحراس'!Q$3:S$30,$C16)","v":0},{"$f":"COUNTIF('توزيع الحراس'!T$3:V$30,$C16)","v":0},{"$f":"COUNTIF('توزيع الحراس'!W$3:Y$30,$C16)","v":0},{"$f":"COUNTIF('توزيع الحراس'!Z$3:AB$30,$C16)","v":0},{"$f":"COUNTIF('توزيع الحراس'!AC$3:AE$30,$C16)","v":2},{"$f":"COUNTIF('توزيع الحراس'!AF$3:AH$30,$C16)","v":0},2,1]
[9,{"$f":"'توزيع الحراس'!B11","v":"محمد علي9"},{"$f":"'توزيع الحراس'!A11","v":9},{"$f":"COUNTIF('توزيع الحراس'!D$3:F$30,$C17)","v":0},{"$f":"COUNTIF('توزيع الحراس'!G$3:I$30,$C17)","v":0},{"$f":"COUNTIF('توزيع الحراس'!K$3:M$30,$C17)","v":0},{"$f":"COUNTIF('توزيع الحراس'!N$3:P$30,$C17)","v":0},{"$f":"COUNTIF('توزيع الحراس'!Q$3:S$30,$C17)","v":0},{"$f":"COUNTIF('توزيع الحراس'!T$3:V$30,$C17)","v":0},{"$f":"COUNTIF('توزيع الحراس'!W$3:Y$30,$C17)","v":0},{"$f":"COUNTIF('توزيع الحراس'!Z$3:AB$30,$C17)","v":0},{"$f":"COUNTIF('توزيع الحراس'!AC$3:AE$30,$C17)","v":0},{"$f":"COUNTIF('توزيع الحراس'!AF$3:AH$30,$C17)","v":0},0,0]
[10,{"$f":"'توزيع الحراس'!B12","v":"محمد علي10"},{"$f":"'توزيع الحراس'!A12","v":10},{"$f":"COUNTIF('توزيع الحراس'!D$3:F$30,$C18)","v":1},{"$f":"COUNTIF('توزيع الحراس'!G$3:I$30,$C18)","v":0},{"$f":"COUNTIF('توزيع الحراس'!K$3:M$30,$C18)","v":0},{"$f":"COUNTIF('توزيع الحراس'!N$3:P$30,$C18)","v":0},{"$f":"COUNTIF('توزيع الحراس'!Q$3:S$30,$C18)","v":0},{"$f":"COUNTIF('توزيع الحراس'!T$3:V$30,$C18)","v":0},{"$f":"COUNTIF('توزيع الحراس'!W$3:Y$30,$C18)","v":0},{"$f":"COUNTIF('توزيع الحراس'!Z$3:AB$30,$C18)","v":0},{"$f":"COUNTIF('توزيع الحراس'!AC$3:AE$30,$C18)","v":0},{"$f":"COUNTIF('توزيع الحراس'!AF$3:AH$30,$C18)","v":0},1,0.5]
[11,{"$f":"'توزيع الحراس'!B13","v":"محمد علي11"},{"$f":"'توزيع الحراس'!A13","v":11},{"$f":"COUNTIF('توزيع الحراس'!D$3:F$30,$C19)","v":0},{"$f":"COUNTIF('توزيع الحراس'!G$3:I$30,$C19)","v":0},{"$f":"COUNTIF('توزيع الحراس'!K$3:M$30,$C19)","v":0},{"$f":"COUNTIF('توزيع الحراس'!N$3:P$30,$C19)","v":0},{"$f":"COUNTIF('توزيع الحراس'!Q$3:S$30,$C19)","v":0},{"$f":"COUNTIF('توزيع الحراس'!T$3:V$30,$C19)","v":0},{"$f":"COUNTIF('توزيع الحراس'!W$3:Y$30,$C19)","v":0},{"$f":"COUNTIF('توزيع الحراس'!Z$3:AB$30,$C19)","v":0},{"$f":"COUNTIF('توزيع الحراس'!AC$3:AE$30,$C19)","v":0},{"$f":"COUNTIF('توزيع الحراس'!AF$3:AH$30,$C19)","v":0},0,{"$f":"N19*0.5","v":0}]
[12,{"$f":"'توزيع الحراس'!B14","v":"محمد علي12"},{"$f":"'توزيع الحراس'!A14","v":12},{"$f":"COUNTIF('توزيع الحراس'!D$3:F$30,$C20)","v":1},{"$f":"COUNTIF('توزيع الحراس'!G$3:I$30,$C20)","v":0},{"$f":"COUNTIF('توزيع الحراس'!K$3:M$30,$C20)","v":0},{"$f":"COUNTIF('توزيع الحراس'!N$3:P$30,$C20)","v":0},{"$f":"COUNTIF('توزيع الحراس'!Q$3:S$30,$C20)","v":0},{"$f":"COUNTIF('توزيع الحراس'!T$3:V$30,$C20)","v":0},{"$f":"COUNTIF('توزيع الحراس'!W$3:Y$30,$C20)","v":0},{"$f":"COUNTIF('توزيع الحراس'!Z$3:AB$30,$C20)","v":0},{"$f":"COUNTIF('توزيع الحراس'!AC$3:AE$30,$C20)","v":0},{"$f":"COUNTIF('توزيع الحراس'!AF$3:AH$30,$C20)","v":0},1,0.5]
{"$rows_left_out":132}
{"sheet":"توزيع الحراس","index":3,"n_rows":252,"n_cols":37,"rows_kept":252,"cut":false,"hidden":false,"merged":[[32,2,42,2],[1,28,1,30],[1,31,1,33],[0,28,0,33],[32,3,32,5],[32,6,32,8],[32,10,32,12],[32,13,32,15],[32,16,32,18],[32,19,32,21],[32,22,32,24],[32,25,32,27],[32,28,32,30],[32,31,32,33],[0,22,0,27],[1,22,1,24],[1,25,1,27],[1,3,1,5],[1,6,1,8],[0,3,0,8],[0,10,0,15],[1,10,1,12],[1,13,1,15],[0,16,0,21],[1,16,1,18],[1,19,1,21]]}
[null,null,"أيام الامتحان             ","اليوم الأول",null,null,null,null,null,null,"اليوم الثاني",null,null,null,null,null,"اليوم الثالث",null,null,null,null,null,"اليوم الرابع",null,null,null,null,null,"اليوم الخامس"]
["الرقم"," لقب وإسم الحارس","القاعات","صباحا",null,null,"مساءً",null,null,null,"صباحا",null,null,"مساءً",null,null,"صباحا",null,null,"مساءً",null,null,"صباحا",null,null,"مساءً",null,null,"صباحا",null,null,"مساءً"]
[{"$f":"prof!A2","v":1},{"$f":"prof!C2","v":"محمد علي1"},1,15,12,10,null,null,null,null,null,null,null,null,null,null,3,2,2,2,2,2,2,2,2,2,2,2,8,8,5,7,5,5]
[{"$f":"prof!A3","v":2},{"$f":"prof!C3","v":"محمد علي2"},2,null,null,null,null,null,null,null,null,null,null,null,null,null,null,null,null,null,null,null,null,null,null,null,null,null,null,null,null,null,null,null,null,null,{"$f":"IF(C2:C32=G2,ROW(),\"\")","v":""}]
[{"$f":"prof!A4","v":3},{"$f":"prof!C4","v":"محمد علي3"},3]
[{"$f":"prof!A5","v":4},{"$f":"prof!C5","v":"محمد علي4"},4]
[{"$f":"prof!A6","v":5},{"$f":"prof!C6","v":"محمد علي5"},5]
[{"$f":"prof!A7","v":6},{"$f":"prof!C7","v":"محمد علي6"},6]
[{"$f":"prof!A8","v":7},{"$f":"prof!C8","v":"محمد علي7"},7]
[{"$f":"prof!A9","v":8},{"$f":"prof!C9","v":"محمد علي8"},8]
[{"$f":"prof!A10","v":9},{"$f":"prof!C10","v":"محمد علي9"},9]
[{"$f":"prof!A11","v":10},{"$f":"prof!C11","v":"محمد علي10"},10]
[{"$f":"prof!A12","v":11},{"$f":"prof!C12","v":"محمد علي11"},11]
[{"$f":"prof!A13","v":12},{"$f":"prof!C13","v":"محمد علي12"},12]
[{"$f":"prof!A14","v":13},{"$f":"prof!C14","v":"محمد علي13"},13]
[{"$f":"prof!A15","v":14},{"$f":"prof!C15","v":"محمد علي14"},14]
[{"$f":"prof!A16","v":15},{"$f":"prof!C16","v":"محمد علي15"},15]
[{"$f":"prof!A17","v":16},{"$f":"prof!C17","v":"محمد علي16"},16]
[{"$f":"prof!A18","v":17},{"$f":"prof!C18","v":"محمد علي17"},17]
[{"$f":"prof!A19","v":18},{"$f":"prof!C19","v":"محمد علي18"},18]
{"$rows_left_out":233}
{"sheet":"أيام الحراسة","index":4,"n_rows":83,"n_cols":20,"rows_kept":83,"cut":false,"hidden":false,"merged":[[82,10,82,13],[74,1,74,5],[74,6,74,9],[74,10,74,13],[69,1,69,5],[69,6,69,9],[69,10,69,13],[70,1,70,5],[70,6,70,9],[70,10,70,13],[73,1,73,5],[73,6,73,9],[73,10,73,13],[71,1,71,5],[71,6,71,9],[71,10,71,13],[72,1,72,5],[72,6,72,9],[72,10,72,13],[76,0,80,1],[67,1,67,5],[67,6,67,9],[67,10,67,13],[68,1,68,5],[68,6,68,9],[68,10,68,13],[65,1,65,5],[65,6,65,9],[65,10,65,13],[66,1,66,5],[66,6,66,9],[66,10,66,13],[63,1,63,5],[63,6,63,9],[63,10,63,13],[64,1,64,5],[64,6,64,9],[64,10,64,13],[61,1,61,5],[61,6,61,9],[61,10,61,13],[62,1,62,5],[62,6,62,9],[62,10,62,13],[59,1,59,5],[59,6,59,9],[59,10,59,13],[60,1,60,5],[60,6,60,9],[60,10,60,13],[57,1,57,5],[57,6,57,9],[57,10,57,13],[58,1,58,5],[58,6,58,9],[58,10,58,13],[55,1,55,5],[55,6,55,9],[55,10,55,13],[56,1,56,5],[56,6,56,9],[56,10,56,13],[53,1,53,5],[53,6,53,9],[53,10,53,13],[54,1,54,5],[54,6,54,9],[54,10,54,13],[51,0,51,2],[51,3,51,4],[51,6,51,8],[51,11,51,13],[42,0,42,12],[43,0,43,12],[44,0,44,6],[44,8,44,12],[46,0,46,1],[46,2,46,6],[46,8,46,10],[46,11,46,12],[40,10,40,13],[21,10,21,13],[22,10,22,13],[25,10,25,13],[26,10,26,13],[27,10,27,13],[24,10,24,13],[23,10,23,13],[47,4,47,9],[47,11,47,12],[28,10,28,13],[29,10,29,13],[31,10,31,13],[32,10,32,13],[28,6,28,9],[21,1,21,5],[22,1,22,5],[23,6,23,9],[23,1,23,5],[30,10,30,13],[32,1,32,5],[31,1,31,5],[31,6,31,9],[25,1,25,5],[1,0,1,12],[2,8,2,12],[4,8,4,10],[15,6,15,9],[12,1,12,5],[13,1,13,5],[14,1,14,5],[15,1,15,5],[5,11,5,12],[4,11,4,12],[4,0,4,1],[4,2,4,6],[5,4,5,9],[12,6,12,9],[13,6,13,9],[14,6,14,9],[2,0,2,6],[20,10,20,13],[9,11,9,13],[14,10,14,13],[15,10,15,13],[12,10,12,13],[9,0,9,2],[9,3,9,4],[11,10,11,13],[11,6,11,9],[11,1,11,5],[13,10,13,13],[16,10,16,13],[17,10,17,13],[18,10,18,13],[19,10,19,13],[20,1,20,5],[16,6,16,9],[17,6,17,9],[18,6,18,9],[20,6,20,9],[9,6,9,8],[34,0,38,1],[27,6,27,9],[17,1,17,5],[19,1,19,5],[19,6,19,9],[21,6,21,9],[22,6,22,9],[16,1,16,5],[18,1,18,5],[30,1,30,5],[30,6,30,9],[29,6,29,9],[32,6,32,9],[26,1,26,5],[27,1,27,5],[28,1,28,5],[29,1,29,5],[24,1,24,5],[24,6,24,9],[25,6,25,9],[26,6,26,9]]}
["الجمهوريــة الجزائريــة الديمقراطيــة الشعبيــة"]
["وزارة التربيــة الوطنيـة"]
["مديريــة التربيـــة لولايـــة الــــوادي",null,null,null,null,null,null,null,"الديوان الوطني للامتحانات والمسابقات"]
[]
["مركـز الإجــراء: ",null,{"$f":"'بيانات المركز.'!Q9","v":"ثانوية المجتهد - الوادي"},null,null,null,null,null,"رمز المركز:  ",null,null,{"$f":"'بيانات المركز.'!V7","v":39044}]
[null,null,null,null,{"$f":"'بيانات المركز.'!G13","v":"إمتحــان شهـادة البكالـــوريا"},null,null,null,null,null," دورة:",{"$f":"'بيانات المركز.'!D19","v":"جــــوان 2021"}]
[]
[]
[]
["التاريــــخ:",null,null,{"$f":"TODAY()","v":"2021-07-09"},null,null,"اليــــوم الأول",null,null,null,"الفتـــرة:","صباحيـــــة",null,null,null,null,null,null,"صباحيـــــة","اليــــوم الأول"]
[null,null,null,null,null,null,null,null,null,null,null,null,null,null,null,null,null,null,"مسائيـــــة","اليــــوم الثانــي"]
["القاعة","الحـــــارس الأول",null,null,null,null,"الحـــــارس الثانـــي",null,null,null,"الحـــارس الثالـــث",null,null,null,null,null,null,null,null,"اليــــوم الثالــث"]
[1,{"$f":"IFERROR(VLOOKUP(OFFSET('توزيع الحراس'!$A$1,MATCH($A13,'توزيع الحراس'!$C:$C,0)-1,MATCH($G$10,'توزيع الحراس'!$1:$1,0)+IF($L$10=\"صباحيـــــة\",0,3)+COUNTA($B$12:B$12)-2),prof,1,FALSE),\"\")","v":15},null,null,null,null,{"$f":"IFERROR(VLOOKUP(OFFSET('توزيع الحراس'!$A$1,MATCH($A13,'توزيع الحراس'!$C:$C,0)-1,MATCH($G$10,'توزيع الحراس'!$1:$1,0)+IF($L$10=\"صباحيـــــة\",0,3)+COUNTA($B$12:J$12)-2),prof,1,FALSE),\"\")","v":12},null,null,null,{"$f":"IFERROR(VLOOKUP(OFFSET('توزيع الحراس'!$A$1,MATCH($A13,'توزيع الحراس'!$C:$C,0)-1,MATCH($G$10,'توزيع الحراس'!$1:$1,0)+IF($L$10=\"صباحيـــــة\",0,3)+COUNTA($B$12:N$12)-2),prof,1,FALSE),\"\")","v":10},null,null,null,null,null,null,null,null,"اليــــوم الرابــع"]
[2,{"$f":"IFERROR(VLOOKUP(OFFSET('توزيع الحراس'!$A$1,MATCH($A14,'توزيع الحراس'!$C:$C,0)-1,MATCH($G$10,'توزيع الحراس'!$1:$1,0)+IF($L$10=\"صباحيـــــة\",0,3)+COUNTA($B$12:B$12)-2),prof,1,FALSE),\"\")","v":""},null,null,null,null,{"$f":"IFERROR(VLOOKUP(OFFSET('توزيع الحراس'!$A$1,MATCH($A14,'توزيع الحراس'!$C:$C,0)-1,MATCH($G$10,'توزيع الحراس'!$1:$1,0)+IF($L$10=\"صباحيـــــة\",0,3)+COUNTA($B$12:J$12)-2),prof,1,FALSE),\"\")","v":""},null,null,null,{"$f":"IFERROR(VLOOKUP(OFFSET('توزيع الحراس'!$A$1,MATCH($A14,'توزيع الحراس'!$C:$C,0)-1,MATCH($G$10,'توزيع الحراس'!$1:$1,0)+IF($L$10=\"صباحيـــــة\",0,3)+COUNTA($B$12:N$12)-2),prof,1,FALSE),\"\")","v":""},null,null,null,null,null,null,null,null,"اليــــوم الخامــس"]
[3,{"$f":"IFERROR(VLOOKUP(OFFSET('توزيع الحراس'!$A$1,MATCH($A15,'توزيع الحراس'!$C:$C,0)-1,MATCH($G$10,'توزيع الحراس'!$1:$1,0)+IF($L$10=\"صباحيـــــة\",0,3)+COUNTA($B$12:B$12)-2),prof,1,FALSE),\"\")","v":""},null,null,null,null,{"$f":"IFERROR(VLOOKUP(OFFSET('توزيع الحراس'!$A$1,MATCH($A15,'توزيع الحراس'!$C:$C,0)-1,MATCH($G$10,'توزيع الحراس'!$1:$1,0)+IF($L$10=\"صباحيـــــة\",0,3)+COUNTA($B$12:J$12)-2),prof,1,FALSE),\"\")","v":""},null,null,null,{"$f":"IFERROR(VLOOKUP(OFFSET('توزيع الحراس'!$A$1,MATCH($A15,'توزيع الحراس'!$C:$C,0)-1,MATCH($G$10,'توزيع الحراس'!$1:$1,0)+IF($L$10=\"صباحيـــــة\",0,3)+COUNTA($B$12:N$12)-2),prof,1,FALSE),\"\")","v":""}]
[4,{"$f":"IFERROR(VLOOKUP(OFFSET('توزيع الحراس'!$A$1,MATCH($A16,'توزيع الحراس'!$C:$C,0)-1,MATCH($G$10,'توزيع الحراس'!$1:$1,0)+IF($L$10=\"صباحيـــــة\",0,3)+COUNTA($B$12:B$12)-2),prof,1,FALSE),\"\")","v":""},null,null,null,null,{"$f":"IFERROR(VLOOKUP(OFFSET('توزيع الحراس'!$A$1,MATCH($A16,'توزيع الحراس'!$C:$C,0)-1,MATCH($G$10,'توزيع الحراس'!$1:$1,0)+IF($L$10=\"صباحيـــــة\",0,3)+COUNTA($B$12:J$12)-2),prof,1,FALSE),\"\")","v":""},null,null,null,{"$f":"IFERROR(VLOOKUP(OFFSET('توزيع الحراس'!$A$1,MATCH($A16,'توزيع الحراس'!$C:$C,0)-1,MATCH($G$10,'توزيع الحراس'!$1:$1,0)+IF($L$10=\"صباحيـــــة\",0,3)+COUNTA($B$12:N$12)-2),prof,1,FALSE),\"\")","v":""}]
[5,{"$f":"IFERROR(VLOOKUP(OFFSET('توزيع الحراس'!$A$1,MATCH($A17,'توزيع الحراس'!$C:$C,0)-1,MATCH($G$10,'توزيع الحراس'!$1:$1,0)+IF($L$10=\"صباحيـــــة\",0,3)+COUNTA($B$12:B$12)-2),prof,1,FALSE),\"\")","v":""},null,null,null,null,{"$f":"IFERROR(VLOOKUP(OFFSET('توزيع الحراس'!$A$1,MATCH($A17,'توزيع الحراس'!$C:$C,0)-1,MATCH($G$10,'توزيع الحراس'!$1:$1,0)+IF($L$10=\"صباحيـــــة\",0,3)+COUNTA($B$12:J$12)-2),prof,1,FALSE),\"\")","v":""},null,null,null,{"$f":"IFERROR(VLOOKUP(OFFSET('توزيع الحراس'!$A$1,MATCH($A17,'توزيع الحراس'!$C:$C,0)-1,MATCH($G$10,'توزيع الحراس'!$1:$1,0)+IF($L$10=\"صباحيـــــة\",0,3)+COUNTA($B$12:N$12)-2),prof,1,FALSE),\"\")","v":""}]
[6,{"$f":"IFERROR(VLOOKUP(OFFSET('توزيع الحراس'!$A$1,MATCH($A18,'توزيع الحراس'!$C:$C,0)-1,MATCH($G$10,'توزيع الحراس'!$1:$1,0)+IF($L$10=\"صباحيـــــة\",0,3)+COUNTA($B$12:B$12)-2),prof,1,FALSE),\"\")","v":""},null,null,null,null,{"$f":"IFERROR(VLOOKUP(OFFSET('توزيع الحراس'!$A$1,MATCH($A18,'توزيع الحراس'!$C:$C,0)-1,MATCH($G$10,'توزيع الحراس'!$1:$1,0)+IF($L$10=\"صباحيـــــة\",0,3)+COUNTA($B$12:J$12)-2),prof,1,FALSE),\"\")","v":""},null,null,null,{"$f":"IFERROR(VLOOKUP(OFFSET('توزيع الحراس'!$A$1,MATCH($A18,'توزيع الحراس'!$C:$C,0)-1,MATCH($G$10,'توزيع الحراس'!$1:$1,0)+IF($L$10=\"صباحيـــــة\",0,3)+COUNTA($B$12:N$12)-2),prof,1,FALSE),\"\")","v":""}]
[7,{"$f":"IFERROR(VLOOKUP(OFFSET('توزيع الحراس'!$A$1,MATCH($A19,'توزيع الحراس'!$C:$C,0)-1,MATCH($G$10,'توزيع الحراس'!$1:$1,0)+IF($L$10=\"صباحيـــــة\",0,3)+COUNTA($B$12:B$12)-2),prof,1,FALSE),\"\")","v":""},null,null,null,null,{"$f":"IFERROR(VLOOKUP(OFFSET('توزيع الحراس'!$A$1,MATCH($A19,'توزيع الحراس'!$C:$C,0)-1,MATCH($G$10,'توزيع الحراس'!$1:$1,0)+IF($L$10=\"صباحيـــــة\",0,3)+COUNTA($B$12:J$12)-2),prof,1,FALSE),\"\")","v":""},null,null,null,{"$f":"IFERROR(VLOOKUP(OFFSET('توزيع الحراس'!$A$1,MATCH($A19,'توزيع الحراس'!$C:$C,0)-1,MATCH($G$10,'توزيع الحراس'!$1:$1,0)+IF($L$10=\"صباحيـــــة\",0,3)+COUNTA($B$12:N$12)-2),prof,1,FALSE),\"\")","v":""}]
[8,{"$f":"IFERROR(VLOOKUP(OFFSET('توزيع الحراس'!$A$1,MATCH($A20,'توزيع الحراس'!$C:$C,0)-1,MATCH($G$10,'توزيع الحراس'!$1:$1,0)+IF($L$10=\"صباحيـــــة\",0,3)+COUNTA($B$12:B$12)-2),prof,1,FALSE),\"\")","v":""},null,null,null,null,{"$f":"IFERROR(VLOOKUP(OFFSET('توزيع الحراس'!$A$1,MATCH($A20,'توزيع الحراس'!$C:$C,0)-1,MATCH($G$10,'توزيع الحراس'!$1:$1,0)+IF($L$10=\"صباحيـــــة\",0,3)+COUNTA($B$12:J$12)-2),prof,1,FALSE),\"\")","v":""},null,null,null,{"$f":"IFERROR(VLOOKUP(OFFSET('توزيع الحراس'!$A$1,MATCH($A20,'توزيع الحراس'!$C:$C,0)-1,MATCH($G$10,'توزيع الحراس'!$1:$1,0)+IF($L$10=\"صباحيـــــة\",0,3)+COUNTA($B$12:N$12)-2),prof,1,FALSE),\"\")","v":""}]
{"$rows_left_out":63}