{"text_format":"1","workbook":"xlsx","n_sheets":5,"sheets":["Table","Certification","Value","certificatnew","Sheet1"],"not_rendered":{"charts":0,"images":8,"macros":1,"external_links":0,"defined_names":9,"comments":0,"pivot_tables":0},"unopened":[],"bounds":{"document_bytes":16777216,"sheet_cells":100000,"rows_first":2000,"rows_last":500,"rows_between":2000,"halvings":0,"cell_chars":16384,"cell_head_chars":4096},"cells_cut":0,"cells_raw":0,"read":"whole","date_system":"1900"}

{"sheet":"Table","index":0,"n_rows":70,"n_cols":100,"rows_kept":70,"cut":false,"hidden":false,"merged":[[68,48,68,53],[6,53,9,53],[7,47,9,47],[69,45,69,47],[65,43,65,46],[66,39,66,44],[69,39,69,44],[68,45,68,47],[66,29,69,38],[69,48,69,53],[66,45,66,47],[67,45,67,47],[67,48,67,53],[66,48,66,53],[5,28,6,30],[7,30,8,30],[7,42,8,42],[7,31,8,31],[7,33,8,33],[7,38,8,38],[69,26,69,28],[69,19,69,22],[69,17,69,18],[69,23,69,25],[69,14,69,16],[5,44,8,44],[67,39,67,44],[68,39,68,44],[5,37,6,39],[7,32,8,32],[66,19,66,22],[7,17,8,17],[66,23,66,25],[5,40,6,42],[7,40,8,40],[7,41,8,41],[7,35,8,35],[7,36,8,36],[7,34,8,34],[68,26,68,28],[7,26,8,26],[7,27,8,27],[66,17,66,18],[7,18,8,18],[66,26,66,28],[67,26,67,28],[68,23,68,25],[68,17,68,18],[68,19,68,22],[7,20,8,20],[7,14,8,14],[7,9,8,9],[67,11,67,13],[68,11,68,13],[67,23,67,25],[67,19,67,22],[7,19,8,19],[67,14,67,16],[67,17,67,18],[7,16,8,16],[7,21,8,21],[7,24,8,24],[7,25,8,25],[69,0,69,4],[69,7,69,10],[67,7,67,10],[65,0,65,6],[67,0,67,4],[68,5,68,6],[68,0,68,4],[69,11,69,13],[69,5,69,6],[66,7,66,10],[5,13,6,15],[3,5,4,9],[4,0,4,4],[68,7,68,10],[67,5,67,6],[66,5,66,6],[5,16,6,18],[3,0,3,4],[5,0,9,0],[7,15,8,15],[7,7,8,7],[7,10,8,10],[7,5,9,5],[5,10,6,12],[7,6,9,6],[66,14,66,16],[66,11,66,13],[68,14,68,16],[0,55,0,58],[5,34,6,36],[5,46,5,54],[6,54,9,54],[7,46,9,46],[8,55,8,58],[0,0,2,54],[3,10,4,13],[5,25,6,27],[5,43,9,43],[7,1,8,1],[7,4,9,4],[5,1,6,1],[7,13,8,13],[5,19,6,21],[7,12,8,12],[7,11,8,11],[5,2,9,2],[5,7,6,9],[5,4,6,6],[5,3,9,3],[7,8,8,8],[3,14,4,17],[3,18,4,20],[3,21,4,23],[3,24,4,32],[5,22,6,24],[3,33,4,44],[7,23,8,23],[7,28,8,28],[7,37,8,37],[7,22,8,22],[5,31,6,33],[7,39,8,39],[9,88,9,89],[9,72,9,73],[9,74,9,75],[9,76,9,77],[9,78,9,79],[7,29,8,29],[9,86,9,87],[9,61,9,63],[9,66,9,68],[9,84,9,85],[7,49,9,49],[7,48,9,48],[9,80,9,81],[9,82,9,83],[3,48,4,53],[7,50,9,50],[3,54,4,54],[6,52,9,52],[7,51,9,51],[6,46,6,51],[3,45,4,47],[5,45,9,45]]}
[" جدول العلامات المدرسية للصفوف من الأول الى السابع الأساسي للعام الدراسي2020/2019",null,null,null,null,null,null,null,null,null,null,null,null,null,null,null,null,null,null,null,null,null,null,null,null,null,null,null,null,null,null,null,null,null,null,null,null,null,null,null,null,null,null,null,null,null,null,null,null,null,null,null,null,null,null,"مربوا الصفوف"]
[null,null,null,null,null,null,null,null,null,null,null,null,null,null,null,null,null,null,null,null,null,null,null,null,null,null,null,null,null,null,null,null,null,null,null,null,null,null,null,null,null,null,null,null,null,null,null,null,null,null,null,null,null,null,null,"اياد عبد الحليم ابو حميدان","عاصم ابو سلطان","احمد طه اسماعيل","احمد سليمان الزاملي"]
[null,null,null,null,null,null,null,null,null,null,null,null,null,null,null,null,null,null,null,null,null,null,null,null,null,null,null,null,null,null,null,null,null,null,null,null,null,null,null,null,null,null,null,null,null,null,null,null,null,null,null,null,null,null,null,"عادل اسماعيل ابو حميدان","مجاهد الشريدة","عمر عبد الحميد حسين"]
["وكالة الامم المتحدة لإغاثة وتشغيل اللاجئين الفلسطينيين في الشرق الادنى",null,null,null,null,"المنطقــة التعليمية :",null,null,null,null,"شمال عمان",null,null,null,"البلـدة/المـخيـم:",null,null,null,"البقعة",null,null,"المـدرسـة:",null,null,"ذكور البقعة الاعدادية الرابعة",null,null,null,null,null,null,null,null,"  الصــف :",null,null,null,null,null,null,null,null,null,null,null,"(  السادس  ) ",null,null,"الـشعـبـة :",null,null,null,null,null," (  أ  ) ","علاء اسماعيل العزة","صهيب خليل بنات","غسان احمد سبيتان"]
["دائرة التربية والتعليم",null,null,null,null,null,null,null,null,null,null,null,null,null,null,null,null,null,null,null,null,null,null,null,null,null,null,null,null,null,null,null,null,null,null,null,null,null,null,null,null,null,null,null,null,null,null,null,null,null,null,null,null,null,null,"رائد حسين ابو عوض","زهير يوسف ابو جخيدب","مروان عودة ابو جويعد"]
["الرقم  المتسلسل","إســم الطـالــب","الجنـسيـة"," مكـان الـولادة","تاريخ الولادة",null,null,"التربية الاسلامية",null,null,"اللغة العربية",null,null,"اللغة الانجليزية",null,null,"الرياضيات",null,null,"التربية الاجتماعية والوطنية",null,null,"العلـــوم",null,null,"التربية الفنية",null,null,"التربية الرياضية",null,null,"الموسيقا والاناشيد",null,null,"التربية المهنية",null,null,"الحاسوب",null,null,"الثقافة المالية",null,null,"إحترام النظام","عدد أيام الغياب من","الصف/الصفوف التي اعادها الطالب","( تعبأ المعلومات المطلوبة الواردة في هذه الحقول في نهاية العام الدراسي )",null,null,null,null,null,null,null,null,"سالم سليمان ابو رجل","عودة مفلح العمرو","سليم محمد ابو رفيع"]
{"$rows_left_out":65}
{"sheet":"Certification","index":1,"n_rows":45,"n_cols":17,"rows_kept":45,"cut":false,"hidden":true,"merged":[[44,1,44,4],[44,9,44,10],[37,1,37,10],[38,1,38,10],[40,1,40,10],[42,1,42,4],[42,5,42,6],[42,8,42,9],[35,7,36,8],[35,9,36,10],[33,0,34,1],[33,2,34,2],[35,0,36,0],[35,1,36,2],[35,3,36,3],[35,4,36,6],[33,3,34,5],[33,6,34,6],[29,0,30,0],[29,1,30,10],[31,0,32,1],[31,2,32,10],[33,7,34,8],[33,9,34,10],[27,0,27,2],[27,7,27,10],[28,0,28,2],[28,5,28,8],[25,0,25,2],[25,7,25,10],[26,0,26,2],[26,7,26,10],[23,0,23,2],[23,7,23,10],[24,0,24,2],[24,7,24,10],[21,0,21,2],[21,7,21,10],[22,0,22,2],[22,7,22,10],[19,7,19,10],[20,0,20,2],[20,7,20,10],[17,0,17,2],[17,7,17,10],[18,0,18,2],[18,7,18,10],[11,0,11,1],[11,2,11,3],[13,0,15,2],[13,3,15,3],[19,0,19,2],[13,4,13,10],[14,6,14,10],[15,7,15,10],[16,0,16,2],[16,7,16,10],[9,0,9,1],[9,2,9,3],[9,5,9,7],[9,9,9,10],[5,0,6,10],[7,1,7,3],[7,6,7,7],[7,8,7,10],[0,0,1,3],[0,4,1,6],[0,7,1,10],[2,0,3,3],[2,4,4,6],[2,7,3,10],[4,0,4,3],[4,7,4,10]]}
[null,null,null,null,"بسم الله الرحمن الرحيم",null,null,null,null,null,null," "]
[]
["وكالة الأمم المتحدة لإغاثة وتشغيل اللاجئين الفلسطينيين في الشرق الأدنى",null,null,null,null,null,null,"   دائرة التربية والتعليم"]
["اللاجئين الفلسطينيين في الشرق الأدنى"]
[]
[{"$f":"\" النتائج المدرسية  \" & Value!$F$35 & \" الأساسي  للعام الدراسي \" & Value!$F$10","v":" النتائج المدرسية  للصفوف من الأول الى السابع الأساسي  للعام الدراسي 2020/2019"}]
{"$rows_left_out":40}
{"sheet":"Value","index":2,"n_rows":218,"n_cols":11,"rows_kept":218,"cut":false,"hidden":true,"merged":[[205,6,205,7],[204,1,204,2],[204,6,204,7],[209,1,209,2],[209,6,209,7],[206,1,206,2],[206,6,206,7],[207,1,207,2],[207,6,207,7],[208,1,208,2],[208,6,208,7],[180,6,180,7],[186,1,186,2],[180,1,180,2],[185,6,185,7],[190,6,190,7],[189,6,189,7],[190,1,190,2],[183,1,183,2],[194,6,194,7],[194,1,194,2],[199,1,199,2],[201,1,201,2],[191,1,191,2],[192,1,192,2],[211,6,211,9],[211,1,211,4],[181,6,181,7],[191,6,191,7],[192,6,192,7],[193,1,193,2],[193,6,193,7],[188,6,188,7],[184,6,184,7],[197,1,197,2],[197,6,197,7],[198,1,198,2],[198,6,198,7],[195,1,195,2],[195,6,195,7],[196,1,196,2],[196,6,196,7],[203,1,203,2],[203,6,203,7],[205,1,205,2],[217,1,217,3],[212,6,212,8],[213,6,213,8],[214,6,214,8],[215,6,215,8],[217,6,217,8],[216,1,216,3],[215,1,215,3],[214,1,214,3],[216,6,216,8],[212,1,212,3],[213,1,213,3],[179,6,179,7],[183,6,183,7],[184,1,184,2],[167,1,167,3],[168,1,168,3],[172,1,172,3],[178,1,178,2],[173,1,173,3],[178,6,178,7],[179,1,179,2],[182,1,182,2],[189,1,189,2],[186,6,186,7],[187,1,187,2],[187,6,187,7],[188,1,188,2],[199,6,199,7],[200,1,200,2],[200,6,200,7],[202,1,202,2],[202,6,202,7],[201,6,201,7],[165,1,165,3],[166,1,166,3],[169,1,169,3],[185,1,185,2],[155,1,155,3],[156,1,156,3],[163,1,163,3],[164,1,164,3],[161,1,161,3],[150,1,150,3],[147,1,147,3],[148,1,148,3],[145,1,145,3],[146,1,146,3],[139,1,139,3],[136,4,136,6],[176,0,177,9],[182,6,182,7],[181,1,181,2],[143,1,143,3],[144,1,144,3],[153,1,153,3],[154,1,154,3],[151,1,151,3],[152,1,152,3],[149,1,149,3],[159,1,159,3],[160,1,160,3],[157,1,157,3],[158,1,158,3],[170,1,170,3],[162,1,162,3],[171,1,171,3],[136,7,136,8],[141,1,141,3],[142,1,142,3],[140,1,140,3],[133,1,133,4],[133,5,133,9],[136,0,136,1],[136,2,136,3],[137,0,138,0],[137,1,138,3],[137,4,137,9],[135,4,135,6],[125,1,125,4],[125,5,125,9],[126,1,126,4],[126,5,126,9],[123,1,123,4],[123,5,123,9],[124,1,124,4],[124,5,124,9],[132,1,132,4],[132,5,132,9],[127,1,127,4],[127,5,127,9],[128,1,128,4],[128,5,128,9],[129,1,129,4],[129,5,129,9],[130,1,130,4],[130,5,130,9],[131,1,131,4],[131,5,131,9],[121,1,121,4],[121,5,121,9],[122,1,122,4],[122,5,122,9],[107,5,107,9],[119,1,119,4],[119,5,119,9],[120,1,120,4],[120,5,120,9],[117,1,117,4],[118,1,118,4],[118,5,118,9],[111,1,111,4],[111,5,111,9],[116,1,116,4],[116,5,116,9],[113,1,113,4],[113,5,113,9],[114,1,114,4],[115,1,115,4],[115,5,115,9],[110,1,110,4],[105,0,105,1],[105,2,105,3],[117,5,117,9],[56,1,56,4],[56,5,56,9],[114,5,114,9],[110,5,110,9],[109,5,109,9],[109,1,109,4],[112,1,112,4],[112,5,112,9],[104,0,104,1],[104,4,104,6],[105,4,105,6],[105,7,105,8],[107,1,107,4],[0,3,1,7],[45,0,45,1],[45,2,45,3],[44,4,44,6],[45,4,45,6],[45,7,45,8],[65,1,65,4],[65,5,65,9],[104,2,104,3],[104,7,104,8],[66,1,66,4],[66,5,66,9],[67,1,67,4],[67,5,67,9],[72,1,72,4],[108,1,108,4],[108,5,108,9],[103,4,103,6],[55,1,55,4],[55,5,55,9],[71,1,71,4],[68,1,68,4],[68,5,68,9],[69,1,69,4],[69,5,69,9],[60,1,60,4],[60,5,60,9],[61,1,61,4],[72,5,72,9],[70,5,70,9],[61,5,61,9],[59,1,59,4],[59,5,59,9],[64,5,64,9],[63,1,63,4],[62,1,62,4],[54,1,54,4],[54,5,54,9],[46,1,46,4],[46,5,46,9],[47,1,47,4],[47,5,47,9],[48,1,48,4],[48,5,48,9],[52,5,52,9],[49,1,49,4],[50,5,50,9],[51,1,51,4],[51,5,51,9],[49,5,49,9],[50,1,50,4],[52,1,52,4],[57,5,57,9],[58,1,58,4],[58,5,58,9],[53,1,53,4],[71,5,71,9],[70,1,70,4],[62,5,62,9],[63,5,63,9],[64,1,64,4],[57,1,57,4],[53,5,53,9],[77,1,77,4],[77,5,77,9],[78,1,78,4],[78,5,78,9],[79,1,79,4],[79,5,79,9],[73,1,73,4],[76,1,76,4],[76,5,76,9],[75,1,75,4],[75,5,75,9],[73,5,73,9],[74,1,74,4],[74,5,74,9],[83,1,83,4],[83,5,83,9],[90,1,90,4],[90,5,90,9],[88,1,88,4],[88,5,88,9],[89,1,89,4],[89,5,89,9],[80,1,80,4],[80,5,80,9],[84,1,84,4],[84,5,84,9],[85,1,85,4],[85,5,85,9],[82,1,82,4],[82,5,82,9],[81,1,81,4],[81,5,81,9],[92,1,92,4],[92,5,92,9],[87,1,87,4],[87,5,87,9],[93,1,93,4],[93,5,93,9],[91,1,91,4],[91,5,91,9],[86,1,86,4],[86,5,86,9],[94,1,94,4],[94,5,94,9],[101,1,101,4],[101,5,101,9],[98,1,98,4],[98,5,98,9],[99,1,99,4],[99,5,99,9],[100,1,100,4],[100,5,100,9],[95,1,95,4],[95,5,95,9],[97,1,97,4],[97,5,97,9],[96,1,96,4],[96,5,96,9]]}
[null,null,null,"الثوابت"]
[]
[null," ",null,null,"المنطقـة التعليمية","شمال عمان","إختر"]
[null,null,null,null,"البلـدة / المخيـم","البقعة","ممتاز"]
[null,null,null,null,"اسـم المدرسـة","ذكور البقعة الاعدادية الرابعة","جيد جدا"]
[null,null,null,null,"الصـف","السادس","جيد"]
{"$rows_left_out":213}
{"sheet":"certificatnew","index":3,"n_rows":71,"n_cols":93,"rows_kept":71,"cut":false,"hidden":true,"merged":[[18,10,19,10],[16,14,16,15],[21,14,21,15],[18,11,19,11],[16,8,17,8],[20,10,21,10],[20,8,21,8],[26,2,26,5],[20,1,21,5],[20,7,21,7],[26,8,26,11],[18,1,19,5],[23,1,23,2],[26,6,26,7],[24,1,25,11],[36,13,36,18],[35,10,35,11],[24,17,24,18],[25,18,25,19],[24,13,25,15],[28,8,28,11],[31,13,31,18],[29,13,29,18],[33,13,33,18],[34,13,34,18],[35,13,35,18],[27,13,27,15],[13,23,15,23],[11,14,11,15],[10,22,15,22],[12,18,12,19],[14,14,14,15],[13,18,13,19],[10,23,11,23],[14,18,14,19],[10,14,10,15],[11,18,11,19],[10,18,10,19],[19,13,19,15],[21,17,21,19],[20,17,20,19],[19,17,19,19],[15,18,15,19],[16,18,16,19],[20,14,20,15],[17,14,17,15],[4,35,5,35],[10,25,11,25],[2,27,3,27],[12,14,12,15],[15,14,15,15],[13,14,13,15],[1,37,1,40],[2,37,3,37],[2,38,3,38],[2,39,3,39],[2,40,3,40],[1,36,3,36],[5,16,5,17],[7,13,8,19],[9,13,9,15],[9,17,9,19],[3,13,6,14],[3,15,3,17],[4,15,4,17],[4,18,4,19],[5,18,5,19],[10,24,11,24],[13,24,15,25],[1,33,1,35],[2,30,3,30],[1,27,1,30],[2,29,3,29],[2,28,3,28],[14,34,14,35],[1,13,2,19],[1,22,3,22],[1,26,3,26],[4,24,5,24],[1,32,3,32],[4,23,5,23],[4,22,9,22],[1,23,1,25],[7,23,9,23],[4,25,5,25],[7,24,9,25],[7,33,11,33],[4,32,11,32],[7,34,9,35],[4,34,5,34],[4,33,5,33],[23,25,24,25],[23,24,24,24],[23,22,30,22],[26,24,28,25],[31,22,37,22],[34,23,37,23],[31,23,32,23],[37,34,37,35],[12,32,14,32],[16,24,17,24],[16,25,17,25],[23,23,24,23],[34,24,36,25],[19,24,21,25],[33,10,33,11],[34,10,34,11],[34,5,34,6],[32,13,32,18],[30,13,30,18],[28,13,28,15],[31,25,32,25],[31,24,32,24],[26,23,30,23],[19,23,22,23],[16,22,22,22],[10,6,11,6],[12,6,13,6],[8,6,9,6],[23,13,23,19],[16,23,17,23],[17,18,17,19],[14,7,15,7],[12,10,13,10],[14,8,15,8],[20,11,21,11],[16,9,17,9],[14,10,15,10],[14,11,15,11],[16,7,17,7],[18,6,19,6],[18,7,19,7],[16,6,17,6],[16,10,17,10],[18,9,19,9],[20,9,21,9],[20,6,21,6],[16,11,17,11],[35,3,35,6],[33,5,33,6],[14,1,15,5],[6,1,7,5],[8,1,9,5],[10,9,11,9],[10,8,11,8],[14,6,15,6],[14,9,15,9],[6,7,7,7],[6,9,7,9],[34,1,34,2],[35,1,35,2],[16,1,17,5],[18,8,19,8],[33,1,33,2],[4,1,5,5],[10,1,11,5],[12,1,13,5],[10,11,11,11],[8,7,9,7],[6,11,7,11],[4,6,4,8],[8,8,9,8],[10,10,11,10],[8,10,9,10],[6,10,7,10],[4,9,4,11],[6,6,7,6],[6,8,7,8],[12,11,13,11],[10,7,11,7],[12,7,13,7],[12,8,13,8],[8,11,9,11],[8,9,9,9],[12,9,13,9],[35,32,37,32],[15,33,16,33],[27,34,27,35],[18,34,20,35],[31,32,34,32],[30,34,30,35],[31,35,32,35],[24,32,27,32],[34,34,34,35],[15,35,16,35],[31,33,32,33],[24,33,25,33],[24,34,25,34],[24,35,25,35],[31,34,32,34],[15,32,23,32],[28,32,30,32],[15,34,16,34],[18,33,23,33]]}
[null,null,null,null,null,null,null,null,null,null,null,null,null,null,null,null,null,null,null,null,null,null,null,null,null,null,null,null,null,null,null,null,null,null,null,null,null,null,null,null,null,null,null,null,null,null,null,null,null,null,null,null,null,null,null,null,null,null,null,null,null,null,null,null,null,null,null,null,null,null,null,null,null,null,null,null,null,null,null,null,null,null,null,null,null,null,null,null,null,null,null,null," "]
[null,null,null,null,null,null,null,null,null,null,null,null,null,"بسم الله الرحمن الرحيم",null,null,null,null,null,null,null,null,"المبحث","العلامة المستحقة",null,null,"مهارات التعلم الاساسية","الدرجــــة",null,null,null,null,"المبحث","العلامة المستحقة",null,null,"مهارات التعلم الاساسية","الدرجــــة"]
[null,null,null,null,null,null,null,null,null,null,null,null,null,null,null,null,null,null,null,null,null,null,null,"الفصل الاول","الفصل الثاني","المعـدل",null,"متقدم","جيد","مرض","بحاجة الى مساعدة",null,null,"الفصل الاول","الفصل الثاني","المعـدل",null,"متقدم","جيد","مرض","بحاجة الى مساعدة",null,null,null,null,null,null,null,null,null,null,null,null,null,null,null,null,null,null,null,null,null,null,null,null,null,null,null,null,null,null,null,null,null,null,null,null,null,null,null,null,"اول","ثاني","ثالث","رابع","خامس","سادس","سابع","ثامن","تاسع","عاشر"]
[null,"الكفايات العامة :",null,null,null,null,null,null,null,null,null,null,null,null,null,"تقرير تقويم الطالب",null,null,null,null,null,null,null,"رقماً","رقماً","رقما",null,null,null,null,null,null,null,"رقماً","رقماً","رقما"]
[null,"الكفاية",null,null,null,null,"الفصل الاول",null,null,"الفصل الثاني",null,null,null,null,null,{"$f":"\" للصف  \" & Value!$F$6 & \"  الأساسي  \"","v":" للصف  السادس  الأساسي  "},null,null,"وكالة الغوث الدولية",null,null,null,{"$f":"Table!$H$6","v":"التربية الاسلامية"},null,null,null,null,{"$f":"IF(AA5=\"\",\"\",IF(((Z5/Z7)*100)>=95,\"X\",\"\"))","v":""},{"$f":"IF(AA5=\"\",\"\",IF((Z5/Z7)*100>=95,\"\",IF((Z5/Z7)*100>=80,\"X\",)))","v":""},{"$f":"IF(AA5=\"\",\"\",IF((Z5/Z7)*100>=80,\"\",IF((Z5/Z7)*100>=65,\"X\",)))","v":""},{"$f":"IF(Z5=0,\"\",IF(AA5=\"\",\"\",IF(Z5=\"\",\"\",IF((Z5/Z7)*100<65,\"X\",\"\"))))","v":""},null,{"$f":"Table!$W$6","v":"العلـــوم"},null,null,null,null,{"$f":"IF(AK5=\"\",\"\",IF(((AJ5/AJ7)*100)>=95,\"X\",\"\"))","v":""},{"$f":"IF(AK5=\"\",\"\",IF((AJ5/AJ7)*100>=95,\"\",IF((AJ5/AJ7)*100>=80,\"X\",)))","v":""},{"$f":"IF(AK5=\"\",\"\",IF((AJ5/AJ7)*100>=80,\"\",IF((AJ5/AJ7)*100>=65,\"X\",)))","v":""},{"$f":"IF(AJ5=0,\"\",IF(AK5=\"\",\"\",IF(AJ5=\"\",\"\",IF((AJ5/AJ7)*100<65,\"X\",\"\"))))","v":""},null,null,null,null,null,null,null,null,null,null,null,null,null,null,null,null,null,null,null,null,null,null,null,null,null,null,null,null,null,null,null,null,null,null,null,null,null,null,null,{"$f":"IF(Value!$F$6=\"الأول\",\"1\",IF(Value!$F$6=\"الثاني\",\"2\",IF(Value!$F$6=\"الثالث\",\"3\",IF(Value!$F$6=\"الرابع\",\"4\",IF(Value!$F$6=\"الخامس\",\"5\",IF(Value!$F$6=\"السادس\",\"6\",IF(Value!$F$6=\"السابع\",\"7\",IF(Value!$F$6=\"الثامن\",\"8\",))))))))&(IF(Value!$F$6=\"التاسع\",\"9\",IF(Value!$F$6=\"العاشر\",\"10\",)))","v":"6"},"تلاوة السور الكريمة مثل ( الفاتحة,العصر, ... ) تلاوة سليمة غيبا","تلاوة ايات كريمة مثل ( التوبة,الرحمن,الضحى,الشرح,, ... ) تلاوة سليمة غيبا","تلاوة  آيات كريمة من سور ( البقرة,الأعلى,الشمس,...) تلاوة سليمة غيبا","تلاوة  آيات كريمة من سور ( البقرة,الكهف,النبأ,البروج,...) تلاوة سليمة غيبا","تلاوة  ايات كريمة من سور (يونس,التوبة,نور,الملك) غيبا مراعيا احكام الغنة والنون الساكنة والتنوين","تلاوة  ايات كريمة من سور (مريم,الفتح) غيبا مراعيا احكام الميم الساكنة والميم والنون المشددة والقلقلة","تلاوة ايات كريمة من سور (الانفال,النحل,الصف,...) غيبا مراعيا احكام الادغام والإظهار","تلاوة ايات كريمة من سورة الاسراء غيبا مراعيا احكام المد والهمزات والهاءات","تلاوة ايات كريمة من سور (الانفال,الحجرات,ق) غيبا مراعيا احكام التفخيم والترقيم","تلاوة ايات كريمة من سور (ال عمران,المؤمنون,الاحقاف,المدثر) غيبا مراعيا احكام الوقف والسكت والابتداء"]
[null,null,null,null,null,null,"غالبا","احيانا","نادرا","غالبا","احيانا","نادرا",null,null,null,"العام الدراسي",{"$f":"Value!$F$10","v":"2020/2019"},null," دائرة التربية والتعليم",null,null,null,null,null,null,null,null,{"$f":"IF(AA6=\"\",\"\",IF((Z5/Z7)*100>=85,\"X\",\"\"))","v":""},{"$f":"IF(AA6=\"\",\"\",IF((Z5/Z7)*100>=85,\"\",IF((Z5/Z7)*100>=70,\"X\",)))","v":""},{"$f":"IF(AA6=\"\",\"\",IF((Z5/Z7)*100>=70,\"\",IF((Z5/Z7)*100>=55,\"X\",)))","v":""},{"$f":"IF(Z5=0,\"\",IF(AA6=\"\",\"\",IF(Z5=\"\",\"\",IF((Z5/Z7)*100<55,\"X\",\"\"))))","v":""},null,null,null,null,null,null,{"$f":"IF(AK6=\"\",\"\",IF((AJ5/AJ7)*100>=85,\"X\",\"\"))","v":""},{"$f":"IF(AK6=\"\",\"\",IF((AJ5/AJ7)*100>=85,\"\",IF((AJ5/AJ7)*100>=70,\"X\",)))","v":""},{"$f":"IF(AK6=\"\",\"\",IF((AJ5/AJ7)*100>=70,\"\",IF((AJ5/AJ7)*100>=55,\"X\",)))","v":""},{"$f":"IF(AJ5=0,\"\",IF(AK6=\"\",\"\",IF(AJ5=\"\",\"\",IF((AJ5/AJ7)*100<55,\"X\",\"\"))))","v":""},null,null,null,null,null,null,null,null,null,null,null,null,null,null,null,null,null,null,null,null,null,null,null,null,null,null,null,null,null,null,null,null,null,null,null,null,null,null,null,null,"قراءة الأحاديث الشريفة مثل ( اركان الاسلام,اداب الطعام والشراب, ... ) قراءة صحيحة غيبا","قراءة الأحاديث الشريفة مثل ( من توضأ فأحسن,خيركم من تعلم القرآن,, ... ) قراءة صحيحة غيبا ","قراءة الأحاديث الشريفة مثل ( من قرأ حرفا,الصدق يهدي, ... )  قراءة صحيحة غيبا ","قراءة الأحاديث الشريفة مثل ( المؤمن القوي,حق المسلم,, ... )  قراءة صحيحة غيبا ","قراءة الأحاديث الشريفة مثل (اي الاعمال افضل,لا يدخل الجنة, ... )  قراءة صحيحة غيبا","قراءة الأحاديث الشريفة مثل (يا غلام,اية المنافق ...) قراءة صحيحة غيبا","قراءة الأحاديث الشريفة مثل (انما الاعمال بالنيات,من رأى منكم منكرا ...) قراءة صحيحة غيبا","قراءة الأحاديث الشريفة مثل (من عاد لي وليا,من نفس عن مؤمن, ...) قراءة صحيحة غيبا","قراءة الأحاديث الشريفة مثل (القائم على حدود,رغم انف رجل, ...) قراءة صحيحة غيبا","قراءة الأحاديث الشريفة مثل (افضل الاعمل الى الله,تحمل المسؤولية في الاسلام ...) قراءة صحيحة غيبا"]
{"$rows_left_out":66}
{"sheet":"Sheet1","index":4,"n_rows":112,"n_cols":57,"rows_kept":112,"cut":false,"hidden":true,"merged":[]}
[]
[]
[]
[]
[null,null,null,null,null,null,null,null,null,null,"جدول العلامات المدرسية  للعام الدراسي   2020-2021    \n   المنطقة التعليمية :    شمال عمان                           المدرسة  :  ذكور البقعة الاعدادية الرابعة                  الصف  :   (  الصف السادس )                 الشعبة :    ( 1 )"]
[]
{"$rows_left_out":106}