{"text_format":"1","workbook":"xlsx","n_sheets":17,"sheets":["كشف المستحقات","كشف المستحقات -النتيجة المطلوبة","تحليلي دفعة 1 - مع الفنيين","تحليلي دفعة 2 - مع الفنيين","كشف البنك د1 مع الفنيين","كشف البنك د2 مع الفنيين","مستحقات الفني 1 تصحيح","مستحقات الفني 2 تصحيح","مستحقات الفني 1","مستحقات الفني 2","جملة منصرف مع نسبة الإنجاز","ورقة5","مطابقة البطائق","ورقة2","ورقة1","ورقة4","بيانات الملاك"],"not_rendered":{"charts":0,"images":1,"macros":1,"external_links":0,"defined_names":47,"comments":0,"pivot_tables":0},"unopened":[],"bounds":{"document_bytes":16777216,"sheet_cells":100000,"rows_first":2000,"rows_last":500,"rows_between":2000,"halvings":0,"cell_chars":16384,"cell_head_chars":4096},"cells_cut":0,"cells_raw":0,"read":"whole","date_system":"1900"}

{"sheet":"كشف المستحقات","index":0,"n_rows":117,"n_cols":6,"rows_kept":117,"cut":false,"hidden":false,"merged":[[0,0,0,5],[117,0,117,1],[117,4,117,5],[118,0,118,1],[118,4,118,5],[116,0,116,3]]}
["كشف مستحقات العاملين للفترة من  1/ 7/ 2021م وحتى 2021/7/31م"]
["م","رقم الخزان","رقم المالك","اسم مالك الخزان","المبلغ ","التوقيع أو البصمة"]
[1,1,"911-13583-1","زين احمد احمد",60000]
[2,2,"911-13583-2","يحيى ناصر محمد ",120000]
[3,3,"911-13583-3","صلاح الدين ناصر محمد ",86000]
[4,4,"911-13583-4","لطيفه حسن علي ناصر",0]
[5,5,"911-13583-5","جمال أحمد ثابت محمد ",40000]
[6,6,"911-13583-6","بدره أحمد ثابت محمد سعيد",40000]
{"$rows_left_out":110}
{"sheet":"كشف المستحقات -النتيجة المطلوبة","index":1,"n_rows":119,"n_cols":9,"rows_kept":119,"cut":false,"hidden":false,"merged":[[106,0,106,3],[118,0,118,3],[119,0,119,1],[119,4,119,5],[120,0,120,1],[120,4,120,5],[91,0,91,3],[103,0,103,3],[104,0,104,1],[104,4,104,5],[105,0,105,1],[105,4,105,5],[76,0,76,3],[88,0,88,3],[89,0,89,1],[89,4,89,5],[90,0,90,1],[90,4,90,5],[61,0,61,3],[73,0,73,3],[74,0,74,1],[74,4,74,5],[75,0,75,1],[75,4,75,5],[46,0,46,3],[58,0,58,3],[59,0,59,1],[59,4,59,5],[60,0,60,1],[60,4,60,5],[31,0,31,3],[43,0,43,3],[44,0,44,1],[44,4,44,5],[45,0,45,1],[45,4,45,5],[30,0,30,1],[30,4,30,5],[29,4,29,5],[0,0,0,5],[13,0,13,3],[14,0,14,1],[15,0,15,1],[16,0,16,3],[28,0,28,3],[29,0,29,1]]}
["كشف مستحقات العاملين للفترة من  1/ 7/ 2021م وحتى 2021/7/31م",null,null,null,null,null,null,null,{"$f":"MAX('كشف المستحقات'!A1:A30028)","v":86}]
["م","رقم الخزان","رقم المالك","اسم مالك الخزان","المبلغ ","التوقيع أو البصمة"]
[1,{"$f":"IFERROR(VLOOKUP(A3,'كشف المستحقات'!A$3:F$628,2,FALSE),\"\")","v":1},{"$f":"IFERROR(VLOOKUP(A3,'كشف المستحقات'!A$3:F$628,3,FALSE),\"\")","v":"911-13583-1"},{"$f":"IFERROR(VLOOKUP(A3,'كشف المستحقات'!A$3:F$628,4,FALSE),\"\")","v":"زين احمد احمد"},{"$f":"IFERROR(VLOOKUP(A3,'كشف المستحقات'!A$3:F$628,5,FALSE),\"\")","v":60000}]
[2,{"$f":"IFERROR(VLOOKUP(A4,'كشف المستحقات'!A$3:F$628,2,FALSE),\"\")","v":2},{"$f":"IFERROR(VLOOKUP(A4,'كشف المستحقات'!A$3:F$628,3,FALSE),\"\")","v":"911-13583-2"},{"$f":"IFERROR(VLOOKUP(A4,'كشف المستحقات'!A$3:F$628,4,FALSE),\"\")","v":"يحيى ناصر محمد "},{"$f":"IFERROR(VLOOKUP(A4,'كشف المستحقات'!A$3:F$628,5,FALSE),\"\")","v":120000}]
[3,{"$f":"IFERROR(VLOOKUP(A5,'كشف المستحقات'!A$3:F$628,2,FALSE),\"\")","v":3},{"$f":"IFERROR(VLOOKUP(A5,'كشف المستحقات'!A$3:F$628,3,FALSE),\"\")","v":"911-13583-3"},{"$f":"IFERROR(VLOOKUP(A5,'كشف المستحقات'!A$3:F$628,4,FALSE),\"\")","v":"صلاح الدين ناصر محمد "},{"$f":"IFERROR(VLOOKUP(A5,'كشف المستحقات'!A$3:F$628,5,FALSE),\"\")","v":86000}]
[4,{"$f":"IFERROR(VLOOKUP(A6,'كشف المستحقات'!A$3:F$628,2,FALSE),\"\")","v":4},{"$f":"IFERROR(VLOOKUP(A6,'كشف المستحقات'!A$3:F$628,3,FALSE),\"\")","v":"911-13583-4"},{"$f":"IFERROR(VLOOKUP(A6,'كشف المستحقات'!A$3:F$628,4,FALSE),\"\")","v":"لطيفه حسن علي ناصر"},{"$f":"IFERROR(VLOOKUP(A6,'كشف المستحقات'!A$3:F$628,5,FALSE),\"\")","v":0}]
[5,{"$f":"IFERROR(VLOOKUP(A7,'كشف المستحقات'!A$3:F$628,2,FALSE),\"\")","v":5},{"$f":"IFERROR(VLOOKUP(A7,'كشف المستحقات'!A$3:F$628,3,FALSE),\"\")","v":"911-13583-5"},{"$f":"IFERROR(VLOOKUP(A7,'كشف المستحقات'!A$3:F$628,4,FALSE),\"\")","v":"جمال أحمد ثابت محمد "},{"$f":"IFERROR(VLOOKUP(A7,'كشف المستحقات'!A$3:F$628,5,FALSE),\"\")","v":40000}]
[6,{"$f":"IFERROR(VLOOKUP(A8,'كشف المستحقات'!A$3:F$628,2,FALSE),\"\")","v":6},{"$f":"IFERROR(VLOOKUP(A8,'كشف المستحقات'!A$3:F$628,3,FALSE),\"\")","v":"911-13583-6"},{"$f":"IFERROR(VLOOKUP(A8,'كشف المستحقات'!A$3:F$628,4,FALSE),\"\")","v":"بدره أحمد ثابت محمد سعيد"},{"$f":"IFERROR(VLOOKUP(A8,'كشف المستحقات'!A$3:F$628,5,FALSE),\"\")","v":40000}]
{"$rows_left_out":112}
{"sheet":"تحليلي دفعة 1 - مع الفنيين","index":2,"n_rows":215,"n_cols":22,"rows_kept":215,"cut":false,"hidden":true,"merged":[[210,18,211,18],[210,0,210,3],[210,17,211,17],[211,0,211,3],[212,4,212,16],[213,4,213,16],[204,1,205,1],[204,18,205,18],[206,1,207,1],[206,18,207,18],[208,1,209,1],[208,18,209,18],[198,1,199,1],[198,18,199,18],[200,1,201,1],[200,18,201,18],[202,1,203,1],[202,18,203,18],[192,1,193,1],[192,18,193,18],[194,1,195,1],[194,18,195,18],[196,1,197,1],[196,18,197,18],[186,1,187,1],[186,18,187,18],[188,1,189,1],[188,18,189,18],[190,1,191,1],[190,18,191,18],[178,1,180,1],[178,18,180,18],[181,1,183,1],[181,18,183,18],[184,1,185,1],[184,18,185,18],[169,1,171,1],[169,18,171,18],[172,1,174,1],[172,18,174,18],[175,1,177,1],[175,18,177,18],[162,1,163,1],[162,18,163,18],[164,1,166,1],[164,18,166,18],[167,1,168,1],[167,18,168,18],[155,1,157,1],[155,18,157,18],[158,1,159,1],[158,18,159,18],[160,1,161,1],[160,18,161,18],[148,1,149,1],[148,18,149,18],[150,1,152,1],[150,18,152,18],[153,1,154,1],[153,18,154,18],[139,1,141,1],[139,18,141,18],[142,1,144,1],[142,18,144,18],[145,1,147,1],[145,18,147,18],[132,1,133,1],[132,18,133,18],[134,1,136,1],[134,18,136,18],[137,1,138,1],[137,18,138,18],[126,1,127,1],[126,18,127,18],[128,1,129,1],[128,18,129,18],[130,1,131,1],[130,18,131,18],[118,1,120,1],[118,18,120,18],[121,1,123,1],[121,18,123,18],[124,1,125,1],[124,18,125,18],[111,19,112,19],[112,1,113,1],[112,18,113,18],[114,1,115,1],[114,18,115,18],[116,1,117,1],[116,18,117,18],[104,1,106,1],[104,18,106,18],[107,1,109,1],[107,18,109,18],[110,1,111,1],[110,18,111,18],[95,1,97,1],[95,18,97,18],[98,1,100,1],[98,18,100,18],[101,1,103,1],[101,18,103,18],[87,1,88,1],[87,18,88,18],[89,1,91,1],[89,18,91,18],[92,1,94,1],[92,18,94,18],[83,1,84,1],[83,18,84,18],[85,1,86,1],[85,18,86,18],[73,1,74,1],[73,18,74,18],[75,1,77,1],[75,18,77,18],[78,1,80,1],[78,18,80,18],[70,1,72,1],[70,18,72,18],[59,1,60,1],[59,18,60,18],[61,1,62,1],[61,18,62,18],[63,1,64,1],[63,18,64,18],[81,1,82,1],[81,18,82,18],[46,1,47,1],[46,18,47,18],[48,1,49,1],[48,18,49,18],[64,19,65,19],[65,1,66,1],[65,18,66,18],[67,1,69,1],[67,18,69,18],[4,21,4,24],[5,0,6,0],[5,1,6,1],[5,2,6,2],[5,3,6,3],[5,18,6,18],[37,1,38,1],[37,18,38,18],[39,1,41,1],[39,18,41,18],[32,1,33,1],[32,18,33,18],[34,1,36,1],[34,18,36,18],[214,0,214,16],[214,17,214,18],[212,17,212,18],[213,17,213,18],[19,1,21,1],[19,18,21,18],[29,1,31,1],[29,18,31,18],[22,1,23,1],[22,18,23,18],[24,1,25,1],[24,18,25,18],[26,1,28,1],[26,18,28,18],[42,1,43,1],[42,18,43,18],[50,1,52,1],[50,18,52,18],[53,1,55,1],[53,18,55,18],[56,1,58,1],[56,18,58,18],[44,1,45,1],[44,18,45,18],[0,0,0,2],[0,4,0,12],[0,13,0,18],[1,0,1,2],[1,4,1,12],[1,13,1,18],[15,1,16,1],[15,18,16,18],[17,1,18,1],[17,18,18,18],[7,1,9,1],[7,18,9,18],[10,1,12,1],[10,18,12,18],[13,1,14,1],[13,18,14,18],[2,0,2,3],[2,13,2,18],[3,0,3,2],[3,4,3,12],[3,13,3,18],[4,0,4,2],[4,13,4,14],[4,15,4,18]]}
["الجمهورية اليمنية",null,null,null,"كشف تحليلي للدفعة رقم (1) (مستخلص 1) المستحقة لمالكي السقايات",null,null,null,null,null,null,null,null,"مشروع: السقايات الخاصة لقرية الموقعة - عزلة موشك "]
["رثاسة مجلس الوزراء",null,null,null,"للفترة من 07 / 03 / 2021 م  الى  11 /  03 / 2021 م",null,null,null,null,null,null,null,null,"مديرية مغرب عنس - ذمار"]
["الصندوق الإجتماعي للتنمية فرع ذمار - البيضاء",null,null,null,null,null,null,null,null,null,null,null,null,"رقم المشروع: 13583 - 911"]
["وحدة المياه والبيئة",null,null,null,"  نسبة الإنجاز =4,224,000 * 100 / 36,288,000  =  11.64% ",null,null,null,null,null,null,null,null,"رقم الدفعة: (1)"]
["قطاع المياه",null,null,null,null,null,null,null,null,null,null,null,null,"مبلغ الدفعة =",null,{"$f":"R215","v":4425120}]
["م","رقم السقاية","كود المستفيد","                                البند\n\n\n\n\n\n  اسم مالك السقاية    ","الحفر(أ)","الحفر(ب)","المباني بانواعها المختلفة (أ)","المباني بانواعها المختلفة (ب)","ارضية السقايات (أ)","ارضية السقايات (ب)","التلبيس (أ)","التلبيس (ب)","انجاز 50% من السطح بانواعة المختلفة","اكمال السقف مع المعالجة بطلاء مناسب للبيئة","ملحقات السقاية (انابيب التوصيل, حنفيه ان وجدت,غطاء فتحة السقف,فلتر التنظيف)","تنظيف المساحات الساكبه","رفع المخلفات","الاجمالي","إجمالي المبلغ المنصرف لكل سقاية",null,null,36288000]
[null,null,null,null,26000,14000,60000,60000,26000,26000,30000,30000,70000,40000,22000,14000,14000,{"$f":"SUM(E7:Q7)","v":432000}]
[1,1,"911-13583-1","زين احمد احمد الظاهري",26000,14000,60000,null,null,null,null,null,null,null,null,null,null,100000,{"$f":"SUM(R8:R10)","v":100000}]
{"$rows_left_out":208}
{"sheet":"تحليلي دفعة 2 - مع الفنيين","index":3,"n_rows":215,"n_cols":22,"rows_kept":215,"cut":false,"hidden":true,"merged":[[26,1,28,1],[26,18,28,18],[37,1,38,1],[37,18,38,18],[39,1,41,1],[39,18,41,18],[42,1,43,1],[42,18,43,18],[29,1,31,1],[29,18,31,18],[32,1,33,1],[32,18,33,18],[34,1,36,1],[34,18,36,18],[0,0,0,2],[0,4,0,12],[0,13,0,18],[1,0,1,2],[1,4,1,12],[1,13,1,18],[7,1,9,1],[7,18,9,18],[10,1,12,1],[10,18,12,18],[2,0,2,3],[2,13,2,18],[3,0,3,2],[3,4,3,12],[3,13,3,18],[4,0,4,2],[4,13,4,14],[4,15,4,18],[4,21,4,24],[5,0,6,0],[5,1,6,1],[5,2,6,2],[5,3,6,3],[5,18,6,18],[22,1,23,1],[22,18,23,18],[24,1,25,1],[24,18,25,18],[15,1,16,1],[15,18,16,18],[17,1,18,1],[17,18,18,18],[19,1,21,1],[19,18,21,18],[13,1,14,1],[13,18,14,18],[50,1,52,1],[50,18,52,18],[53,1,55,1],[53,18,55,18],[56,1,58,1],[56,18,58,18],[44,1,45,1],[44,18,45,18],[46,1,47,1],[46,18,47,18],[48,1,49,1],[48,18,49,18],[64,19,65,19],[65,1,66,1],[65,18,66,18],[67,1,69,1],[67,18,69,18],[70,1,72,1],[70,18,72,18],[59,1,60,1],[59,18,60,18],[61,1,62,1],[61,18,62,18],[63,1,64,1],[63,18,64,18],[81,1,82,1],[81,18,82,18],[83,1,84,1],[83,18,84,18],[85,1,86,1],[85,18,86,18],[73,1,74,1],[73,18,74,18],[75,1,77,1],[75,18,77,18],[78,1,80,1],[78,18,80,18],[95,1,97,1],[95,18,97,18],[98,1,100,1],[98,18,100,18],[101,1,103,1],[101,18,103,18],[87,1,88,1],[87,18,88,18],[89,1,91,1],[89,18,91,18],[92,1,94,1],[92,18,94,18],[111,19,112,19],[112,1,113,1],[112,18,113,18],[114,1,115,1],[114,18,115,18],[116,1,117,1],[116,18,117,18],[104,1,106,1],[104,18,106,18],[107,1,109,1],[107,18,109,18],[110,1,111,1],[110,18,111,18],[126,1,127,1],[126,18,127,18],[128,1,129,1],[128,18,129,18],[130,1,131,1],[130,18,131,18],[118,1,120,1],[118,18,120,18],[121,1,123,1],[121,18,123,18],[124,1,125,1],[124,18,125,18],[139,1,141,1],[139,18,141,18],[142,1,144,1],[142,18,144,18],[145,1,147,1],[145,18,147,18],[132,1,133,1],[132,18,133,18],[134,1,136,1],[134,18,136,18],[137,1,138,1],[137,18,138,18],[155,1,157,1],[155,18,157,18],[158,1,159,1],[158,18,159,18],[160,1,161,1],[160,18,161,18],[148,1,149,1],[148,18,149,18],[150,1,152,1],[150,18,152,18],[153,1,154,1],[153,18,154,18],[169,1,171,1],[169,18,171,18],[172,1,174,1],[172,18,174,18],[175,1,177,1],[175,18,177,18],[162,1,163,1],[162,18,163,18],[164,1,166,1],[164,18,166,18],[167,1,168,1],[167,18,168,18],[186,1,187,1],[186,18,187,18],[188,1,189,1],[188,18,189,18],[190,1,191,1],[190,18,191,18],[178,1,180,1],[178,18,180,18],[181,1,183,1],[181,18,183,18],[184,1,185,1],[184,18,185,18],[198,1,199,1],[198,18,199,18],[200,1,201,1],[200,18,201,18],[202,1,203,1],[202,18,203,18],[192,1,193,1],[192,18,193,18],[194,1,195,1],[194,18,195,18],[196,1,197,1],[196,18,197,18],[214,17,214,18],[210,17,211,17],[210,18,211,18],[212,17,212,18],[213,17,213,18],[210,0,210,3],[211,0,211,3],[204,1,205,1],[204,18,205,18],[206,1,207,1],[206,18,207,18],[208,1,209,1],[208,18,209,18],[214,0,214,16],[212,4,212,16],[213,4,213,16]]}
["الجمهورية اليمنية",null,null,null,"كشف تحليلي للدفعة رقم (2) (مستخلص 2) المستحقة لمالكي السقايات",null,null,null,null,null,null,null,null,"مشروع: السقايات الخاصة لقرية الموقعة - عزلة موشك "]
["رثاسة مجلس الوزراء",null,null,null,"للفترة من 12 /  03 / 2021 م  الى  21 /  03 / 2021 م",null,null,null,null,null,null,null,null,"مديرية مغرب عنس - ذمار"]
["الصندوق الإجتماعي للتنمية فرع ذمار - البيضاء",null,null,null,null,null,null,null,null,null,null,null,null,"رقم المشروع: 13583 - 911"]
["وحدة المياه والبيئة",null,null,null,"  نسبة الإنجاز = 6,196,000 * 100 / 36,288,000  =  17.07% ",null,null,null,null,null,null,null,null,"رقم الدفعة: (2)"]
["قطاع المياه",null,null,null,null,null,null,null,null,null,null,null,null,"مبلغ الدفعة =",null,{"$f":"R215","v":6468510}]
["م","رقم السقاية","كود المستفيد","                                البند\n\n\n\n\n\n  اسم مالك السقاية    ","الحفر(أ)","الحفر(ب)","المباني بانواعها المختلفة (أ)","المباني بانواعها المختلفة (ب)","ارضية السقايات (أ)","ارضية السقايات (ب)","التلبيس (أ)","التلبيس (ب)","انجاز 50% من السطح بانواعة المختلفة","اكمال السقف مع المعالجة بطلاء مناسب للبيئة","ملحقات السقاية (انابيب التوصيل, حنفيه ان وجدت,غطاء فتحة السقف,فلتر التنظيف)","تنظيف المساحات الساكبه","رفع المخلفات","الاجمالي","إجمالي المبلغ المنصرف لكل سقاية",null,null,36288000]
[null,null,null,null,26000,14000,60000,60000,26000,26000,30000,30000,70000,40000,22000,14000,14000,{"$f":"SUM(E7:Q7)","v":432000}]
[1,1,"911-13583-1","زين احمد احمد الظاهري",null,null,null,60000,null,null,null,null,null,null,null,null,null,60000,{"$f":"SUM(R8:R10)","v":60000}]
{"$rows_left_out":208}
{"sheet":"كشف البنك د1 مع الفنيين","index":4,"n_rows":123,"n_cols":8,"rows_kept":123,"cut":false,"hidden":true,"merged":[[0,0,0,2],[0,4,0,5],[1,0,1,2],[1,4,1,5],[2,0,2,2],[2,4,2,5],[35,4,35,5],[3,0,3,2],[3,4,3,5],[4,0,4,2],[5,0,5,2],[6,0,6,5],[19,0,19,3],[20,0,20,1],[21,0,21,1],[22,0,22,3],[34,0,34,3],[35,0,35,1],[36,0,36,1],[36,4,36,5],[37,0,37,3],[49,0,49,3],[50,0,50,1],[50,4,50,5],[51,0,51,1],[51,4,51,5],[52,0,52,3],[64,0,64,3],[65,0,65,1],[65,4,65,5],[66,0,66,1],[66,4,66,5],[67,0,67,3],[79,0,79,3],[80,0,80,1],[80,4,80,5],[81,0,81,1],[81,4,81,5],[82,0,82,3],[94,0,94,3],[95,0,95,1],[95,4,95,5],[96,0,96,1],[96,4,96,5],[97,0,97,3],[109,0,109,3],[110,0,110,1],[110,4,110,5],[124,0,124,1],[124,4,124,5],[111,0,111,1],[111,4,111,5],[112,0,112,3],[122,0,122,3],[123,0,123,1],[123,4,123,5]]}
["الجمهورية اليمنية",null,null,null,"مشروع: السقايات الخاصة لقرية الموقعة "]
["رثاسة مجلس الوزراء",null,null,null,"عزلة موشك - مديرية مغرب عنس - م ذمار"]
["الصندوق الإجتماعي للتنمية",null,null,null,"رقم المشروع: 13583 - 911"]
[" فرع ذمار - البيضاء",null,null,null,"رقم الدفعة: (1)"]
["وحدة المياه والبيئة",null,null,null,"مبلغ الدفعة: ",{"$f":"E123","v":4425120}]
["قطاع المياه"]
["كشف مستحقات العاملين للفترة من  6/ 3/ 2021م وحتى 2021/3/11م"]
["م","رقم السقاية","رقم المالك","اسم مالك السقاية","المبلغ ","التوقيع أو البصمة"]
{"$rows_left_out":116}
{"sheet":"كشف البنك د2 مع الفنيين","index":5,"n_rows":123,"n_cols":7,"rows_kept":123,"cut":false,"hidden":true,"merged":[[124,0,124,1],[124,4,124,5],[111,0,111,1],[111,4,111,5],[112,0,112,3],[122,0,122,3],[123,0,123,1],[123,4,123,5],[96,0,96,1],[96,4,96,5],[97,0,97,3],[109,0,109,3],[110,0,110,1],[110,4,110,5],[81,0,81,1],[81,4,81,5],[82,0,82,3],[94,0,94,3],[95,0,95,1],[95,4,95,5],[66,0,66,1],[66,4,66,5],[67,0,67,3],[79,0,79,3],[80,0,80,1],[80,4,80,5],[51,0,51,1],[51,4,51,5],[52,0,52,3],[64,0,64,3],[65,0,65,1],[65,4,65,5],[36,0,36,1],[36,4,36,5],[37,0,37,3],[49,0,49,3],[50,0,50,1],[50,4,50,5],[35,4,35,5],[3,0,3,2],[3,4,3,5],[4,0,4,2],[5,0,5,2],[6,0,6,5],[19,0,19,3],[20,0,20,1],[21,0,21,1],[22,0,22,3],[34,0,34,3],[35,0,35,1],[0,0,0,2],[0,4,0,5],[1,0,1,2],[1,4,1,5],[2,0,2,2],[2,4,2,5]]}
["الجمهورية اليمنية",null,null,null,"مشروع: السقايات الخاصة لقرية الموقعة "]
["رثاسة مجلس الوزراء",null,null,null,"عزلة موشك - مديرية مغرب عنس - م ذمار"]
["الصندوق الإجتماعي للتنمية",null,null,null,"رقم المشروع: 13583 - 911"]
[" فرع ذمار - البيضاء",null,null,null,"رقم الدفعة: (2)"]
["وحدة المياه والبيئة",null,null,null,"مبلغ الدفعة: ",{"$f":"E123","v":6468510},6468510]
["قطاع المياه"]
["كشف مستحقات العاملين للفترة من  12/ 3/ 2021م وحتى 2021/3/21م"]
["م","رقم السقاية","رقم المالك","اسم مالك السقاية","المبلغ ","التوقيع أو البصمة"]
{"$rows_left_out":116}
{"sheet":"مستحقات الفني 1 تصحيح","index":6,"n_rows":45,"n_cols":5,"rows_kept":45,"cut":false,"hidden":true,"merged":[[14,1,14,3],[8,2,8,3],[9,2,9,3],[1,1,2,1],[1,2,2,4],[3,2,3,3],[4,2,4,4],[6,2,6,3],[7,2,7,3]]}
[]
[null,"الجمهورية اليمنية","مشروع السقايات الخاصة لقرية الموقعة -موشك -مغرب عنس-ذمار"]
[]
[null,"رئاسة مجلس الوزراء","رقم المشروع:",null,"911-13583"]
[null,"الصندوق الاجتماعي للتنمية","كشف صرف مستحقات الفني"]
[null,"فرع ذمار/ البيضاء","06/03/2021  من ","إلى","2021-03-11"]
[null,"وحدة المياه والبيئة","رقم الدفعة =",null,1]
[null,"قطاع المياه","نسبة الأعمال المنجزة =",null,0.1164]
{"$rows_left_out":38}
{"sheet":"مستحقات الفني 2 تصحيح","index":7,"n_rows":45,"n_cols":5,"rows_kept":45,"cut":false,"hidden":true,"merged":[[8,2,8,3],[9,2,9,3],[14,1,14,3],[1,1,2,1],[1,2,2,4],[3,2,3,3],[4,2,4,4],[6,2,6,3],[7,2,7,3]]}
[]
[null,"الجمهورية اليمنية","مشروع السقايات الخاصة لقرية الموقعة -موشك -مغرب عنس-ذمار"]
[]
[null,"رئاسة مجلس الوزراء","رقم المشروع:",null,"911-13583"]
[null,"الصندوق الاجتماعي للتنمية","كشف صرف مستحقات الفني"]
[null,"فرع ذمار/ البيضاء","06/03/2021  من ","إلى","2021-03-11"]
[null,"وحدة المياه والبيئة","رقم الدفعة =",null,1]
[null,"قطاع المياه","نسبة الأعمال المنجزة =",null,0.1164]
{"$rows_left_out":38}
{"sheet":"مستحقات الفني 1","index":8,"n_rows":45,"n_cols":5,"rows_kept":45,"cut":false,"hidden":true,"merged":[[13,1,13,3],[16,1,17,1],[16,2,17,2],[1,1,2,1],[1,2,2,4],[3,2,3,3],[4,2,4,4],[6,2,6,3],[7,2,7,3]]}
[]
[null,"الجمهورية اليمنية","مشروع السقايات الخاصة لقرية الموقعة -موشك -مغرب عنس-ذمار"]
[]
[null,"رئاسة مجلس الوزراء","رقم المشروع:",null,"911-13583"]
[null,"الصندوق الاجتماعي للتنمية","كشف صرف مستحقات الفني"]
[null,"فرع ذمار/ البيضاء","06/03/2021  من ","إلى","2021-03-11"]
[null,"وحدة المياه والبيئة","رقم الدفعة =",null,1]
[null,"قطاع المياه","نسبة الأعمال المنجزة =",null,0.1164]
{"$rows_left_out":38}
{"sheet":"مستحقات الفني 2","index":9,"n_rows":45,"n_cols":5,"rows_kept":45,"cut":false,"hidden":true,"merged":[[13,1,13,3],[16,1,17,1],[16,2,17,2],[1,1,2,1],[1,2,2,4],[3,2,3,3],[4,2,4,4],[6,2,6,3],[7,2,7,3]]}
[]
[null,"الجمهورية اليمنية","مشروع السقايات الخاصة لقرية الموقعة -موشك -مغرب عنس-ذمار"]
[]
[null,"رئاسة مجلس الوزراء","رقم المشروع:",null,"911-13583"]
[null,"الصندوق الاجتماعي للتنمية","كشف صرف مستحقات الفني"]
[null,"فرع ذمار/ البيضاء","06/03/2021  من ","إلى","2021-03-11"]
[null,"وحدة المياه والبيئة","رقم الدفعة =",null,1]
[null,"قطاع المياه","نسبة الأعمال المنجزة =",null,0.1164]
{"$rows_left_out":38}
{"sheet":"جملة منصرف مع نسبة الإنجاز","index":10,"n_rows":10,"n_cols":6,"rows_kept":10,"cut":false,"hidden":true,"merged":[[0,0,0,5],[6,0,6,2]]}
["جدول يوضح إجمالي المنصرف للعاملين على مستوى كل دفعة مالية على حدة"]
["م","البيان","عدد الأسر","عدد المستفيدين بحسب كشوفات الصرف","إجمالي الأجور","نسبة الإنجاز %"]
[1,"الدفعة الأولى",68,68,4224000,{"$f":"E3/$D$10","v":0.1164021164021164}]
[2,"الدفعة الثانية",70,70,6196000,{"$f":"E4/$D$10","v":0.17074514991181658}]
[3,"الدفعة الثالثة",null,null,null,0]
[4,"الدفعة الرابعة",null,null,null,0]
["الإجمــــــــــــــــــــــــالي",null,null,{"$f":"SUM(D3:D6)","v":138},{"$f":"SUM(E3:E6)","v":10420000},0.28714726631393295]
[]
{"$rows_left_out":3}
{"sheet":"ورقة5","index":11,"n_rows":72,"n_cols":7,"rows_kept":72,"cut":false,"hidden":true,"merged":[]}
[]
[]
[]
[]
[null,null,null,null,null,1,26000]
[null,null,null,null,null,2,26000]
[null,null,null,null,null,3,26000]
[null,null,null,null,null,4,26000]
{"$rows_left_out":65}
{"sheet":"مطابقة البطائق","index":12,"n_rows":86,"n_cols":12,"rows_kept":86,"cut":false,"hidden":true,"merged":[[87,0,87,1],[87,4,87,5],[86,0,86,1],[86,4,86,5],[0,0,0,5]]}
["كشف البطائق الشخصية لملاك السقايات الخاصة بقرية الموقعة موشك مغرب عنس"]
["م","رقم السقاية","رقم المالك","اسم مالك السقاية بحسب كشوفاتنا","اسم مالك السقاية من واقع البطاقة الشخصية","رقم البطاقة الإلكترونية","ملاحظات",null,"رقم السقاية","الاسم الصحيح من عدم الممانعة - عمار طاهر","رقم البطاقة"]
[1,1,"911-13583-1","زين احمد احمد الظاهري","زين احمد احمد الظاهري",17000076145,null,null,1,"زين احمد احمد الظاهري",17000076145]
[2,2,"911-13583-2","يحيى ناصر محمد الموشكي","يحيى ناصر محمد الموشكي",17010027563,null,null,2,"يحيى ناصر محمد الموشكي",17010027563]
[3,3,"911-13583-3","صلاح الدين ناصر محمد الموشكي","صلاح الدين ناصر محمد الموشكي",17010040204,null,null,3,"صلاح الدين ناصر محمد الموشكي",17010040204]
[4,4,"911-13583-4","لطيفه حسن علي ناصر اليريمي","؟؟؟",17000072751,"البطاقة غير موجودة",null,4,"لطيفه حسن علي ناصر اليريمي",17000072751]
[5,5,"911-13583-5","جمال أحمد ثابت محمد الموشكي","جمال أحمد ثابت الموشكي",17010230045,null,null,5,"جمال أحمد ثابت محمد الموشكي",17010230045]
[6,6,"911-13583-6","بدره أحمد ثابت محمد سعيد","بدره أحمد ثابت محمد سعيد",17000050469,null,null,6,"بدره أحمد ثابت محمد سعيد",17000050469]
{"$rows_left_out":79}
{"sheet":"ورقة2","index":13,"n_rows":64,"n_cols":5,"rows_kept":64,"cut":false,"hidden":true,"merged":[]}
[]
[]
[]
[]
[null,null,null,1,0]
[null,null,null,2,0]
[null,null,null,3,0]
[null,null,null,4,0]
{"$rows_left_out":57}
{"sheet":"ورقة1","index":14,"n_rows":23,"n_cols":8,"rows_kept":23,"cut":false,"hidden":true,"merged":[]}
[]
[]
[]
[null,null,null,null,null,"البطائق التي لا يوجد صور عندي لها"]
[null,null,null,null,null,"م","رقم السقاية","الاسم"]
[null,null,null,null,null,1,4,"لطيفه حسن علي ناصر اليريمي"]
[null,null,null,null,null,2,10,"عبدالملك محمد علي سعيد الموشكي"]
[null,null,null,null,null,3,11,"كريمه حسن علي سعيد"]
{"$rows_left_out":16}
{"sheet":"ورقة4","index":15,"n_rows":0,"n_cols":0,"rows_kept":0,"cut":false,"hidden":true,"merged":[]}

{"sheet":"بيانات الملاك","index":16,"n_rows":268,"n_cols":28,"rows_kept":268,"cut":false,"hidden":true,"merged":[[0,4,0,15],[0,19,0,20],[0,21,0,22],[1,1,2,1],[1,2,2,2],[1,3,2,3],[1,4,2,4],[1,5,2,5],[1,6,2,6],[1,7,2,7],[1,26,1,27],[1,14,1,15],[1,16,1,17],[1,18,1,20],[1,21,1,22],[1,23,2,23],[1,24,2,24],[1,8,2,8],[1,9,2,9],[1,10,2,10],[1,11,2,11],[1,12,2,12],[1,13,2,13],[90,2,92,2],[90,3,92,3],[90,14,90,15],[90,16,90,17],[37,2,38,2],[37,3,38,3],[11,2,12,2],[11,3,12,3],[1,25,2,25],[153,6,153,12],[154,2,157,2],[154,3,157,3],[154,6,155,6],[154,7,155,7],[154,8,155,8],[154,9,154,10],[154,11,154,12],[156,6,159,6],[168,2,170,2],[168,3,170,3],[171,2,173,2],[171,3,173,3],[174,2,175,2],[174,3,175,3],[162,6,162,8],[162,9,162,10],[162,11,162,12],[164,6,164,15],[165,2,167,2],[165,3,167,3],[184,2,186,2],[184,3,186,3],[187,2,189,2],[187,3,189,3],[190,2,192,2],[190,3,192,3],[176,2,177,2],[176,3,177,3],[178,2,180,2],[178,3,180,3],[181,2,183,2],[181,3,183,3],[202,2,204,2],[202,3,204,3],[205,2,207,2],[205,3,207,3],[208,2,210,2],[208,3,210,3],[193,2,195,2],[193,3,195,3],[196,2,198,2],[196,3,198,3],[199,2,201,2],[199,3,201,3],[220,2,222,2],[220,3,222,3],[223,2,225,2],[223,3,225,3],[226,2,228,2],[226,3,228,3],[211,2,213,2],[211,3,213,3],[214,2,216,2],[214,3,216,3],[217,2,219,2],[217,3,219,3],[238,2,240,2],[238,3,240,3],[241,2,243,2],[241,3,243,3],[244,2,246,2],[244,3,246,3],[229,2,231,2],[229,3,231,3],[232,2,234,2],[232,3,234,3],[235,2,237,2],[235,3,237,3],[265,2,267,2],[265,3,267,3],[256,2,258,2],[256,3,258,3],[259,2,261,2],[259,3,261,3],[262,2,264,2],[262,3,264,3],[247,2,249,2],[247,3,249,3],[250,2,252,2],[250,3,252,3],[253,2,255,2],[253,3,255,3]]}
[null,null,null,null,"كشف بيانات الأسر الخاص بالدراسة الفنية لمشروع السقايات الخاصه لقربه :الموقعة.-عزلة: موشك.-مديريه :مغرب عنس -محافظة:ذمار",null,null,null,null,null,null,null,null,null,null,null,null,null,null,"رقم المشروع  :",null,"911-13583"]
[null,"N","رقم السقاية","رقم الاسره","ققيذ","المالك"," رقم الهوية ش/ع","نوعها","رقم الهاتف ","القريه","اسم المحل","العمر","الجنس","الصفة     أب ام زوجه ابن ابنة","عدد الافراد  ضمن الاسره",null,"عدد الافراد العاملين",null,"نوع تاثر الاسره في المجتمع",null,null,"منطقة النزوح",null,"عامل ماهر ","المستوى التعليمي","استخدام الاندرويد","الموقع الجغرافي"]
[null,null,null,null,null,null,null,null,null,null,null,null,null,null,"ذكور","اناث","ذكور","اناث","اصلي","نازح","عائد","محافظه","مديريه",null,null,null,"longitude","Atitude"]
[null,1,1,1,"زين احمد احمد الظاهري","√",17000076145,"شخصيه",772903323,"الموقعة","الموقعه",43,"ذكر","رب الاسره",3,4,2,1,"√",null,null,null,null,null,null,null," 44.135249°"," 14.538923°"]
[null,{"$f":"#REF!+1","v":{"$error":"#REF!"}},2,2,"يحيى ناصر محمد الموشكي","√",17010027563,"شخصيه",775958420,"الموقعة","الموقعه",44,"ذكر","رب الاسره",2,1,2,1,"√",null,null,null,null,null,"دبلوم",1," 44.135385°"," 14.538980°"]
[null,{"$f":"#REF!+1","v":{"$error":"#REF!"}},3,3,"صلاح الدين ناصر محمد الموشكي","√",17010040204,"شخصيه",773456139,"الموقعة","الموقعه",31,"ذكر","رب اسره",1,2,1,1,"√",null,null,null,null,null,"دبلوم",1," 44.135492°"," 14.538755°"]
[null,{"$f":"#REF!+1","v":{"$error":"#REF!"}},4,4,"لطيفه حسن علي ناصر اليريمي","√",17000072751,"شخصيه",777608971,"الموقعة","الموقعه",35,"انثى","ربة اسره",4,5,1,1,"√",null,null,null,null,null,"ثانوي",1," 44.135378°"," 14.538749°"]
[null,{"$f":"#REF!+1","v":{"$error":"#REF!"}},5,5,"جمال أحمد ثابت محمد الموشكي","√",17010230045,"شخصيه",773730403,"الموقعة","الموقعه",39,"ذكر","رب اسره",3,1,1,1,null,null,null,null,null,null,"جامعي",1," 44.135635°"," 14.539070°"]
{"$rows_left_out":260}