{"text_format":"1","workbook":"xlsx","n_sheets":3,"sheets":["اساس 2016 مرتب ","الارقام القياسية 2016","نسب التأثير والسعر والكمية"],"not_rendered":{"charts":0,"images":0,"macros":1,"external_links":0,"defined_names":0,"comments":0,"pivot_tables":0},"unopened":[],"bounds":{"document_bytes":16777216,"sheet_cells":100000,"rows_first":2000,"rows_last":500,"rows_between":2000,"halvings":0,"cell_chars":16384,"cell_head_chars":4096},"cells_cut":0,"cells_raw":0,"read":"whole","date_system":"1900"}

{"sheet":"اساس 2016 مرتب ","index":0,"n_rows":392,"n_cols":19,"rows_kept":392,"cut":false,"hidden":false,"merged":[[2,2,3,2],[5,2,15,2],[22,2,22,3],[15,12,21,12]]}
[]
[null,null,null,null,null,";         ]            ["]
[null,null,"تاريخ الفتح الفني","تاريخ المستخلص ( من )","(الى )","جملة الأيام"]
[null,null,null,"2019-09-12","2020-04-11",{"$f":"E4-D4","v":212},null,null,null,"تاريخ المستخلص ( من )","(الى )"]
[null,null,"2019-01-01","2019-09-01","2020-04-01",null,null,null,null,"2019-09-12","2020-04-11"]
[null,null,"ملحوظة للأستاذ / محمد صالح\nعدد شهور المستخلص الفعلية \nقمت بكتابتها يدويا لعدم قدرتي على ادراج معادلة\nلتقسيم الشهور الموجودة في الخانتين c4 , d4\nكما قمت بتقريب الخلية c4  الى أول الشهر الخاص بها وكتابتها يدويا في الخلية c5\nوكذلك الخلية c4 وكتابتها في c5","شهور المستخلص الفعلية","نهاية الشهر","أيام الشهر","جملة الأيام","النسبة",null,"2019-09-01","2020-04-01"]
[null,null,null,{"$f":"D4","v":"2019-09-12"},{"$f":"EOMONTH(D7,0)","v":"2019-09-30"},{"$f":"E7-D7+1","v":19},{"$f":"$F$4","v":212},{"$f":"F7/G7","v":8.9622641509433956E-2},null,"شهور المستخلص مكتوبة بأول الشهر لاستخراج الأرقام القياسية"]
[null,null,null,{"$f":"DATE(YEAR(D7),MONTH(D7),DAY(D7)+(F7))","v":"2019-10-01"},{"$f":"EOMONTH(D8,0)","v":"2019-10-31"},{"$f":"E8-D8+1","v":31},{"$f":"$F$4","v":212},{"$f":"F8/G8","v":0.14622641509433962},null,"2019-09-01"]
[null,null,null,"2019-11-01","2019-11-30",30,212,0.14150943396226415,null,"2019-10-01"]
[null,null,null,"2019-12-01","2019-12-31",31,212,0.14622641509433962,null,"2019-11-01"]
[null,null,null,"2020-01-01","2020-01-31",31,212,0.14622641509433962,null,"2019-12-01"]
[null,null,null,"2020-02-01","2020-02-29",29,212,0.13679245283018868,null,"2020-01-01"]
[null,null,null,"2020-03-01","2020-03-31",31,212,0.14622641509433962,null,"2020-02-01"]
[null,null,null,"2020-04-01","2020-04-11",11,212,5.1886792452830191E-2,null,"2020-03-01"]
[null,null,null,null,null,null,null,null,null,"2020-04-01"]
[null,null,null,null,null,null,null,null,null,null,null,null,"ملحوظة للأستاذ / محمد صالح\nالمعادلة الموجود في العمود الحالي \n=($j$8;'الارقام القياسية 2016'!$A$2:$I$73;2;0)\nحيث j8 هي المتغير المؤثر لاختيار تاريخ المستخلص\nوالتي ستظهر في حالة الشهر التالي باسم j9\nوالتالي باسم j10\n"]
[]
[null,null,null,"فترة المستحلص"]
[null,null,null,{"$f":"DATEDIF(D5,E5,\"m\")+1","v":8},"شهور"]
[]
[]
[null,null,{"$f":"AbuHani.NoToTxt(C23,\"جنيه\",\"قرش\")","v":"فقط مائة وسبعة وتسعون مليون وستة وخمسون ألف وثمانمائة واثنان وخمسون جنيه وخمسة وخمسون قرش"}]
[null,null,{"$f":"SUM(S25:S393)","v":197056852.55301881}]
[null,null,null,null,null,null,null,null,null,"رقم البند","البند","الرقم القياسي تاريخ الفتح الفني","الرقم القياسي في شهر المستخلص","نسبة التأثير","كمية البند","سعر البند","عدد الأيام للشهر","الأيام الكلية للمستخلص","الإجمالي"]
[null,null,null,null,null,null,null,null,null,1,"سولار",{"$f":"VLOOKUP($C$5,'الارقام القياسية 2016'!$A$2:$I$73,2,0)","v":266.2},{"$f":"VLOOKUP($J$8,'الارقام القياسية 2016'!$A$2:$I$73,2,0)","v":319.60000000000002},{"$f":"VLOOKUP($J$25,'نسب التأثير والسعر والكمية'!$A$4:$T$100,4,0)","v":0.1},{"$f":"VLOOKUP($J$25,'نسب التأثير والسعر والكمية'!$A$4:$C$100,3,0)","v":120},{"$f":"VLOOKUP($J$25,'نسب التأثير والسعر والكمية'!$A$4:$C$100,2,0)","v":5},{"$f":"$F$7","v":19},{"$f":"$F$4","v":212},{"$f":"IFERROR((L25*M25)/L25*N25*O25*P25*Q25/R25,\"\")","v":1718.6037735849059}]
[null,null,null,null,null,null,null,null,null,null,"اسمنت بورتلاند",{"$f":"VLOOKUP($C$5,'الارقام القياسية 2016'!$A$2:$I$73,3,0)","v":131.9},{"$f":"VLOOKUP($J$8,'الارقام القياسية 2016'!$A$2:$I$73,3,0)","v":137.6},{"$f":"VLOOKUP($J$25,'نسب التأثير والسعر والكمية'!$A$4:$T$100,5,0)","v":0},{"$f":"VLOOKUP($J$25,'نسب التأثير والسعر والكمية'!$A$4:$C$100,3,0)","v":120},{"$f":"VLOOKUP($J$25,'نسب التأثير والسعر والكمية'!$A$4:$C$100,2,0)","v":5},{"$f":"$F$7","v":19},{"$f":"$F$4","v":212},0]
[null,null,null,null,null,null,null,null,null,null,"حديد",{"$f":"VLOOKUP($C$5,'الارقام القياسية 2016'!$A$2:$I$73,4,0)","v":263.7},{"$f":"VLOOKUP($J$8,'الارقام القياسية 2016'!$A$2:$I$73,4,0)","v":270.2},{"$f":"VLOOKUP($J$25,'نسب التأثير والسعر والكمية'!$A$4:$T$100,6,0)","v":0},{"$f":"VLOOKUP($J$25,'نسب التأثير والسعر والكمية'!$A$4:$C$100,3,0)","v":120},{"$f":"VLOOKUP($J$25,'نسب التأثير والسعر والكمية'!$A$4:$C$100,2,0)","v":5},19,212,0]
[null,null,null,null,null,null,null,null,null,null,"اسفلت",{"$f":"VLOOKUP($C$5,'الارقام القياسية 2016'!$A$2:$I$73,5,0)","v":311},{"$f":"VLOOKUP($J$8,'الارقام القياسية 2016'!$A$2:$I$73,5,0)","v":311},{"$f":"VLOOKUP($J$25,'نسب التأثير والسعر والكمية'!$A$4:$T$100,7,0)","v":0},{"$f":"VLOOKUP($J$25,'نسب التأثير والسعر والكمية'!$A$4:$C$100,3,0)","v":120},{"$f":"VLOOKUP($J$25,'نسب التأثير والسعر والكمية'!$A$4:$C$100,2,0)","v":5},19,212,0]
[null,null,null,null,null,null,null,null,null,null,"قطاعات معدنية",{"$f":"VLOOKUP($C$5,'الارقام القياسية 2016'!$A$2:$I$73,6,0)","v":250.6},{"$f":"VLOOKUP($J$8,'الارقام القياسية 2016'!$A$2:$I$73,6,0)","v":233.5},{"$f":"VLOOKUP($J$25,'نسب التأثير والسعر والكمية'!$A$4:$T$100,8,0)","v":0},{"$f":"VLOOKUP($J$25,'نسب التأثير والسعر والكمية'!$A$4:$C$100,3,0)","v":120},{"$f":"VLOOKUP($J$25,'نسب التأثير والسعر والكمية'!$A$4:$C$100,2,0)","v":5},19,212,0]
[null,null,null,null,null,null,null,null,null,null,"غلاف معدني",{"$f":"VLOOKUP($C$5,'الارقام القياسية 2016'!$A$2:$I$73,7,0)","v":278.2},{"$f":"VLOOKUP($J$8,'الارقام القياسية 2016'!$A$2:$I$73,7,0)","v":238.5},{"$f":"VLOOKUP($J$25,'نسب التأثير والسعر والكمية'!$A$4:$T$100,9,0)","v":0},{"$f":"VLOOKUP($J$25,'نسب التأثير والسعر والكمية'!$A$4:$C$100,3,0)","v":120},{"$f":"VLOOKUP($J$25,'نسب التأثير والسعر والكمية'!$A$4:$C$100,2,0)","v":5},19,212,0]
[null,null,null,null,null,null,null,null,null,null,"زوايا وكمرات",{"$f":"VLOOKUP($C$5,'الارقام القياسية 2016'!$A$2:$I$73,8,0)","v":271.60000000000002},{"$f":"VLOOKUP($J$8,'الارقام القياسية 2016'!$A$2:$I$73,8,0)","v":276.89999999999998},{"$f":"VLOOKUP($J$25,'نسب التأثير والسعر والكمية'!$A$4:$T$100,10,0)","v":0},{"$f":"VLOOKUP($J$25,'نسب التأثير والسعر والكمية'!$A$4:$C$100,3,0)","v":120},{"$f":"VLOOKUP($J$25,'نسب التأثير والسعر والكمية'!$A$4:$C$100,2,0)","v":5},19,212,0]
[null,null,null,null,null,null,null,null,null,null,"مواسير صلب",{"$f":"VLOOKUP($C$5,'الارقام القياسية 2016'!$A$2:$I$73,9,0)","v":0},{"$f":"VLOOKUP($J$8,'الارقام القياسية 2016'!$A$2:$I$73,9,0)","v":0},{"$f":"VLOOKUP($J$25,'نسب التأثير والسعر والكمية'!$A$4:$T$100,11,0)","v":0},{"$f":"VLOOKUP($J$25,'نسب التأثير والسعر والكمية'!$A$4:$C$100,3,0)","v":120},{"$f":"VLOOKUP($J$25,'نسب التأثير والسعر والكمية'!$A$4:$C$100,2,0)","v":5},19,212,""]
[]
[null,null,null,null,null,null,null,null,null,"رقم البند","البند","الرقم القياسي تاريخ الفتح الفني","الرقم القياسي في شهر المستخلص","نسبة التأثير","كمية البند","سعر البند","عدد الأيام للشهر","الأيام الكلية للمستخلص","الإجمالي"]
[null,null,null,null,null,null,null,null,null,2,"سولار",{"$f":"VLOOKUP($C$5,'الارقام القياسية 2016'!$A$2:$I$73,2,0)","v":266.2},{"$f":"VLOOKUP($J$8,'الارقام القياسية 2016'!$A$2:$I$73,2,0)","v":319.60000000000002},{"$f":"VLOOKUP($J$35,'نسب التأثير والسعر والكمية'!$A$4:$T$100,4,0)","v":0.2},{"$f":"VLOOKUP($J$35,'نسب التأثير والسعر والكمية'!$A$4:$C$100,3,0)","v":15},{"$f":"VLOOKUP($J$35,'نسب التأثير والسعر والكمية'!$A$4:$C$100,2,0)","v":12},{"$f":"$F$7","v":19},{"$f":"$F$4","v":212},{"$f":"IFERROR((L35*M35)/L35*N35*O35*P35*Q35/R35,\"\")","v":1031.1622641509437}]
[null,null,null,null,null,null,null,null,null,null,"اسمنت بورتلاند",{"$f":"VLOOKUP($C$5,'الارقام القياسية 2016'!$A$2:$I$73,3,0)","v":131.9},{"$f":"VLOOKUP($J$8,'الارقام القياسية 2016'!$A$2:$I$73,3,0)","v":137.6},{"$f":"VLOOKUP($J$35,'نسب التأثير والسعر والكمية'!$A$4:$T$100,5,0)","v":0},{"$f":"VLOOKUP($J$35,'نسب التأثير والسعر والكمية'!$A$4:$C$100,3,0)","v":15},{"$f":"VLOOKUP($J$35,'نسب التأثير والسعر والكمية'!$A$4:$C$100,2,0)","v":12},{"$f":"$F$7","v":19},{"$f":"$F$4","v":212},0]
[null,null,null,null,null,null,null,null,null,null,"حديد",{"$f":"VLOOKUP($C$5,'الارقام القياسية 2016'!$A$2:$I$73,4,0)","v":263.7},{"$f":"VLOOKUP($J$8,'الارقام القياسية 2016'!$A$2:$I$73,4,0)","v":270.2},{"$f":"VLOOKUP($J$35,'نسب التأثير والسعر والكمية'!$A$4:$T$100,6,0)","v":0},{"$f":"VLOOKUP($J$35,'نسب التأثير والسعر والكمية'!$A$4:$C$100,3,0)","v":15},{"$f":"VLOOKUP($J$35,'نسب التأثير والسعر والكمية'!$A$4:$C$100,2,0)","v":12},19,212,0]
[null,null,null,null,null,null,null,null,null,null,"اسفلت",{"$f":"VLOOKUP($C$5,'الارقام القياسية 2016'!$A$2:$I$73,5,0)","v":311},{"$f":"VLOOKUP($J$8,'الارقام القياسية 2016'!$A$2:$I$73,5,0)","v":311},{"$f":"VLOOKUP($J$35,'نسب التأثير والسعر والكمية'!$A$4:$T$100,7,0)","v":0},{"$f":"VLOOKUP($J$35,'نسب التأثير والسعر والكمية'!$A$4:$C$100,3,0)","v":15},{"$f":"VLOOKUP($J$35,'نسب التأثير والسعر والكمية'!$A$4:$C$100,2,0)","v":12},19,212,0]
[null,null,null,null,null,null,null,null,null,null,"قطاعات معدنية",{"$f":"VLOOKUP($C$5,'الارقام القياسية 2016'!$A$2:$I$73,6,0)","v":250.6},{"$f":"VLOOKUP($J$8,'الارقام القياسية 2016'!$A$2:$I$73,6,0)","v":233.5},{"$f":"VLOOKUP($J$35,'نسب التأثير والسعر والكمية'!$A$4:$T$100,8,0)","v":0},{"$f":"VLOOKUP($J$35,'نسب التأثير والسعر والكمية'!$A$4:$C$100,3,0)","v":15},{"$f":"VLOOKUP($J$35,'نسب التأثير والسعر والكمية'!$A$4:$C$100,2,0)","v":12},19,212,0]
[null,null,null,null,null,null,null,null,null,null,"غلاف معدني",{"$f":"VLOOKUP($C$5,'الارقام القياسية 2016'!$A$2:$I$73,7,0)","v":278.2},{"$f":"VLOOKUP($J$8,'الارقام القياسية 2016'!$A$2:$I$73,7,0)","v":238.5},{"$f":"VLOOKUP($J$35,'نسب التأثير والسعر والكمية'!$A$4:$T$100,9,0)","v":0},{"$f":"VLOOKUP($J$35,'نسب التأثير والسعر والكمية'!$A$4:$C$100,3,0)","v":15},{"$f":"VLOOKUP($J$35,'نسب التأثير والسعر والكمية'!$A$4:$C$100,2,0)","v":12},19,212,0]
[null,null,null,null,null,null,null,null,null,null,"زوايا وكمرات",{"$f":"VLOOKUP($C$5,'الارقام القياسية 2016'!$A$2:$I$73,8,0)","v":271.60000000000002},{"$f":"VLOOKUP($J$8,'الارقام القياسية 2016'!$A$2:$I$73,8,0)","v":276.89999999999998},{"$f":"VLOOKUP($J$35,'نسب التأثير والسعر والكمية'!$A$4:$T$100,10,0)","v":0},{"$f":"VLOOKUP($J$35,'نسب التأثير والسعر والكمية'!$A$4:$C$100,3,0)","v":15},{"$f":"VLOOKUP($J$35,'نسب التأثير والسعر والكمية'!$A$4:$C$100,2,0)","v":12},19,212,0]
[null,null,null,null,null,null,null,null,null,null,"مواسير صلب",{"$f":"VLOOKUP($C$5,'الارقام القياسية 2016'!$A$2:$I$73,9,0)","v":0},{"$f":"VLOOKUP($J$8,'الارقام القياسية 2016'!$A$2:$I$73,9,0)","v":0},{"$f":"VLOOKUP($J$35,'نسب التأثير والسعر والكمية'!$A$4:$T$100,11,0)","v":0},{"$f":"VLOOKUP($J$35,'نسب التأثير والسعر والكمية'!$A$4:$C$100,3,0)","v":15},{"$f":"VLOOKUP($J$35,'نسب التأثير والسعر والكمية'!$A$4:$C$100,2,0)","v":12},19,212,""]
[]
[null,null,null,null,null,null,null,null,null,"رقم البند","البند","الرقم القياسي تاريخ الفتح الفني","الرقم القياسي في شهر المستخلص","نسبة التأثير","كمية البند","سعر البند","عدد الأيام للشهر","الأيام الكلية للمستخلص","الإجمالي"]
[null,null,null,null,null,null,null,null,null,3,"سولار",{"$f":"VLOOKUP($C$5,'الارقام القياسية 2016'!$A$2:$I$73,2,0)","v":266.2},{"$f":"VLOOKUP($J$8,'الارقام القياسية 2016'!$A$2:$I$73,2,0)","v":319.60000000000002},{"$f":"VLOOKUP($J$45,'نسب التأثير والسعر والكمية'!$A$4:$T$100,4,0)","v":0.3},{"$f":"VLOOKUP($J$45,'نسب التأثير والسعر والكمية'!$A$4:$C$100,3,0)","v":156},{"$f":"VLOOKUP($J$45,'نسب التأثير والسعر والكمية'!$A$4:$C$100,2,0)","v":7},{"$f":"$F$7","v":19},{"$f":"$F$4","v":212},{"$f":"IFERROR((L45*M45)/L45*N45*O45*P45*Q45/R45,\"\")","v":9383.5766037735866}]
[null,null,null,null,null,null,null,null,null,null,"اسمنت بورتلاند",{"$f":"VLOOKUP($C$5,'الارقام القياسية 2016'!$A$2:$I$73,3,0)","v":131.9},{"$f":"VLOOKUP($J$8,'الارقام القياسية 2016'!$A$2:$I$73,3,0)","v":137.6},{"$f":"VLOOKUP($J$45,'نسب التأثير والسعر والكمية'!$A$4:$T$100,5,0)","v":0},{"$f":"VLOOKUP($J$45,'نسب التأثير والسعر والكمية'!$A$4:$C$100,3,0)","v":156},{"$f":"VLOOKUP($J$45,'نسب التأثير والسعر والكمية'!$A$4:$C$100,2,0)","v":7},{"$f":"$F$7","v":19},{"$f":"$F$4","v":212},0]
[null,null,null,null,null,null,null,null,null,null,"حديد",{"$f":"VLOOKUP($C$5,'الارقام القياسية 2016'!$A$2:$I$73,4,0)","v":263.7},{"$f":"VLOOKUP($J$8,'الارقام القياسية 2016'!$A$2:$I$73,4,0)","v":270.2},{"$f":"VLOOKUP($J$45,'نسب التأثير والسعر والكمية'!$A$4:$T$100,6,0)","v":0},{"$f":"VLOOKUP($J$45,'نسب التأثير والسعر والكمية'!$A$4:$C$100,3,0)","v":156},{"$f":"VLOOKUP($J$45,'نسب التأثير والسعر والكمية'!$A$4:$C$100,2,0)","v":7},19,212,0]
[null,null,null,null,null,null,null,null,null,null,"اسفلت",{"$f":"VLOOKUP($C$5,'الارقام القياسية 2016'!$A$2:$I$73,5,0)","v":311},{"$f":"VLOOKUP($J$8,'الارقام القياسية 2016'!$A$2:$I$73,5,0)","v":311},{"$f":"VLOOKUP($J$45,'نسب التأثير والسعر والكمية'!$A$4:$T$100,7,0)","v":0},{"$f":"VLOOKUP($J$45,'نسب التأثير والسعر والكمية'!$A$4:$C$100,3,0)","v":156},{"$f":"VLOOKUP($J$45,'نسب التأثير والسعر والكمية'!$A$4:$C$100,2,0)","v":7},19,212,0]
[null,null,null,null,null,null,null,null,null,null,"قطاعات معدنية",{"$f":"VLOOKUP($C$5,'الارقام القياسية 2016'!$A$2:$I$73,6,0)","v":250.6},{"$f":"VLOOKUP($J$8,'الارقام القياسية 2016'!$A$2:$I$73,6,0)","v":233.5},{"$f":"VLOOKUP($J$45,'نسب التأثير والسعر والكمية'!$A$4:$T$100,8,0)","v":0},{"$f":"VLOOKUP($J$45,'نسب التأثير والسعر والكمية'!$A$4:$C$100,3,0)","v":156},{"$f":"VLOOKUP($J$45,'نسب التأثير والسعر والكمية'!$A$4:$C$100,2,0)","v":7},19,212,0]
[null,null,null,null,null,null,null,null,null,null,"غلاف معدني",{"$f":"VLOOKUP($C$5,'الارقام القياسية 2016'!$A$2:$I$73,7,0)","v":278.2},{"$f":"VLOOKUP($J$8,'الارقام القياسية 2016'!$A$2:$I$73,7,0)","v":238.5},{"$f":"VLOOKUP($J$45,'نسب التأثير والسعر والكمية'!$A$4:$T$100,9,0)","v":0},{"$f":"VLOOKUP($J$45,'نسب التأثير والسعر والكمية'!$A$4:$C$100,3,0)","v":156},{"$f":"VLOOKUP($J$45,'نسب التأثير والسعر والكمية'!$A$4:$C$100,2,0)","v":7},19,212,0]
[null,null,null,null,null,null,null,null,null,null,"زوايا وكمرات",{"$f":"VLOOKUP($C$5,'الارقام القياسية 2016'!$A$2:$I$73,8,0)","v":271.60000000000002},{"$f":"VLOOKUP($J$8,'الارقام القياسية 2016'!$A$2:$I$73,8,0)","v":276.89999999999998},{"$f":"VLOOKUP($J$45,'نسب التأثير والسعر والكمية'!$A$4:$T$100,10,0)","v":0},{"$f":"VLOOKUP($J$45,'نسب التأثير والسعر والكمية'!$A$4:$C$100,3,0)","v":156},{"$f":"VLOOKUP($J$45,'نسب التأثير والسعر والكمية'!$A$4:$C$100,2,0)","v":7},19,212,0]
[null,null,null,null,null,null,null,null,null,null,"مواسير صلب",{"$f":"VLOOKUP($C$5,'الارقام القياسية 2016'!$A$2:$I$73,9,0)","v":0},{"$f":"VLOOKUP($J$8,'الارقام القياسية 2016'!$A$2:$I$73,9,0)","v":0},{"$f":"VLOOKUP($J$45,'نسب التأثير والسعر والكمية'!$A$4:$T$100,11,0)","v":0},{"$f":"VLOOKUP($J$45,'نسب التأثير والسعر والكمية'!$A$4:$C$100,3,0)","v":156},{"$f":"VLOOKUP($J$45,'نسب التأثير والسعر والكمية'!$A$4:$C$100,2,0)","v":7},19,212,""]
[]
[null,null,null,null,null,null,null,null,null,"رقم البند","البند","الرقم القياسي تاريخ الفتح الفني","الرقم القياسي في شهر المستخلص","نسبة التأثير","كمية البند","سعر البند","عدد الأيام للشهر","الأيام الكلية للمستخلص","الإجمالي"]
[null,null,null,null,null,null,null,null,null,4,"سولار",{"$f":"VLOOKUP($C$5,'الارقام القياسية 2016'!$A$2:$I$73,2,0)","v":266.2},{"$f":"VLOOKUP($J$8,'الارقام القياسية 2016'!$A$2:$I$73,2,0)","v":319.60000000000002},{"$f":"VLOOKUP($J$55,'نسب التأثير والسعر والكمية'!$A$4:$T$100,4,0)","v":0.4},{"$f":"VLOOKUP($J$55,'نسب التأثير والسعر والكمية'!$A$4:$C$100,3,0)","v":125},{"$f":"VLOOKUP($J$55,'نسب التأثير والسعر والكمية'!$A$4:$C$100,2,0)","v":3},{"$f":"$F$7","v":19},{"$f":"$F$4","v":212},{"$f":"IFERROR((L55*M55)/L55*N55*O55*P55*Q55/R55,\"\")","v":4296.5094339622647}]
[null,null,null,null,null,null,null,null,null,null,"اسمنت بورتلاند",{"$f":"VLOOKUP($C$5,'الارقام القياسية 2016'!$A$2:$I$73,3,0)","v":131.9},{"$f":"VLOOKUP($J$8,'الارقام القياسية 2016'!$A$2:$I$73,3,0)","v":137.6},{"$f":"VLOOKUP($J$55,'نسب التأثير والسعر والكمية'!$A$4:$T$100,5,0)","v":0},{"$f":"VLOOKUP($J$55,'نسب التأثير والسعر والكمية'!$A$4:$C$100,3,0)","v":125},{"$f":"VLOOKUP($J$55,'نسب التأثير والسعر والكمية'!$A$4:$C$100,2,0)","v":3},{"$f":"$F$7","v":19},{"$f":"$F$4","v":212},0]
[null,null,null,null,null,null,null,null,null,null,"حديد",{"$f":"VLOOKUP($C$5,'الارقام القياسية 2016'!$A$2:$I$73,4,0)","v":263.7},{"$f":"VLOOKUP($J$8,'الارقام القياسية 2016'!$A$2:$I$73,4,0)","v":270.2},{"$f":"VLOOKUP($J$55,'نسب التأثير والسعر والكمية'!$A$4:$T$100,6,0)","v":0},{"$f":"VLOOKUP($J$55,'نسب التأثير والسعر والكمية'!$A$4:$C$100,3,0)","v":125},{"$f":"VLOOKUP($J$55,'نسب التأثير والسعر والكمية'!$A$4:$C$100,2,0)","v":3},19,212,0]
[null,null,null,null,null,null,null,null,null,null,"اسفلت",{"$f":"VLOOKUP($C$5,'الارقام القياسية 2016'!$A$2:$I$73,5,0)","v":311},{"$f":"VLOOKUP($J$8,'الارقام القياسية 2016'!$A$2:$I$73,5,0)","v":311},{"$f":"VLOOKUP($J$55,'نسب التأثير والسعر والكمية'!$A$4:$T$100,7,0)","v":0},{"$f":"VLOOKUP($J$55,'نسب التأثير والسعر والكمية'!$A$4:$C$100,3,0)","v":125},{"$f":"VLOOKUP($J$55,'نسب التأثير والسعر والكمية'!$A$4:$C$100,2,0)","v":3},19,212,0]
[null,null,null,null,null,null,null,null,null,null,"قطاعات معدنية",{"$f":"VLOOKUP($C$5,'الارقام القياسية 2016'!$A$2:$I$73,6,0)","v":250.6},{"$f":"VLOOKUP($J$8,'الارقام القياسية 2016'!$A$2:$I$73,6,0)","v":233.5},{"$f":"VLOOKUP($J$55,'نسب التأثير والسعر والكمية'!$A$4:$T$100,8,0)","v":0},{"$f":"VLOOKUP($J$55,'نسب التأثير والسعر والكمية'!$A$4:$C$100,3,0)","v":125},{"$f":"VLOOKUP($J$55,'نسب التأثير والسعر والكمية'!$A$4:$C$100,2,0)","v":3},19,212,0]
[null,null,null,null,null,null,null,null,null,null,"غلاف معدني",{"$f":"VLOOKUP($C$5,'الارقام القياسية 2016'!$A$2:$I$73,7,0)","v":278.2},{"$f":"VLOOKUP($J$8,'الارقام القياسية 2016'!$A$2:$I$73,7,0)","v":238.5},{"$f":"VLOOKUP($J$55,'نسب التأثير والسعر والكمية'!$A$4:$T$100,9,0)","v":0},{"$f":"VLOOKUP($J$55,'نسب التأثير والسعر والكمية'!$A$4:$C$100,3,0)","v":125},{"$f":"VLOOKUP($J$55,'نسب التأثير والسعر والكمية'!$A$4:$C$100,2,0)","v":3},19,212,0]
{"$rows_left_out":333}
{"sheet":"الارقام القياسية 2016","index":1,"n_rows":73,"n_cols":9,"rows_kept":73,"cut":false,"hidden":false,"merged":[]}
["البند / الشهر","سولار","اسمنت بورتلاند","حديد","اسفلت","قطاعات معدنية","غلاف معدني","زوايا وكمرات","مواسير صلب ملحومة"]
["2016-01-01"]
["2016-02-01"]
["2016-03-01"]
["2016-04-01"]
["2016-05-01"]
["2016-06-01"]
["2016-07-01"]
["2016-08-01"]
["2016-09-01"]
["2016-10-01"]
["2016-11-01"]
["2016-12-01"]
["2017-01-01"]
["2017-02-01"]
["2017-03-01"]
["2017-04-01"]
["2017-05-01"]
["2017-06-01"]
["2017-07-01"]
["2017-08-01",187.1,123.2,259.10000000000002,231.5,238.9,260.5,238.2]
["2017-09-01",187.1,125,267.60000000000002,231.5,239,263,240.7]
["2017-10-01",187.1,117.5,272.10000000000002,284.89999999999998,245.9,267.3,254.1]
["2017-11-01",187.1,138.5,272.10000000000002,284.89999999999998,245.9,267.3,254.1]
["2017-12-01",187.1,144.1,272.10000000000002,284.89999999999998,245.9,267.3,252.9]
["2018-01-01",187.1,144.1,272.10000000000002,284.89999999999998,248.9,267.3,252.9]
["2018-02-01",187.1,144.1,272.10000000000002,284.89999999999998,248.9,267.3,252.9]
["2018-03-01",187.1,175.4,290.7,284.89999999999998,255.6,275.10000000000002,260.7]
["2018-04-01",187.1,144.6,284.7,311,261.3,284,271.39999999999998]
["2018-05-01",187.1,137.9,284.7,311,261.3,284,271.39999999999998]
["2018-06-01",266.2,142.5,284.7,311,261.3,284,271.39999999999998]
["2018-07-01",266.2,143,284.7,311,261.3,284,271.39999999999998]
["2018-08-01",266.2,132.1,284.7,311,261.3,284,271.39999999999998]
["2018-09-01",266.2,132.1,284.7,311,261.3,284,271.39999999999998]
["2018-10-01",266.2,134.69999999999999,277.2,311,261.3,284,271.39999999999998]
["2018-11-01",266.2,134.69999999999999,277.2,311,261.3,284,271.39999999999998]
["2018-12-01",266.2,131.9,263.7,311,256.60000000000002,284,271.39999999999998]
["2019-01-01",266.2,131.9,263.7,311,250.6,278.2,271.60000000000002]
["2019-02-01",266.2,131.9,263.7,311,249.2,274.5,271.60000000000002]
["2019-03-01",266.2,131.9,263.7,311,249.2,274.5,271.60000000000002]
["2019-04-01",266.2,131.9,263.7,311,249.2,274.5,271.60000000000002]
["2019-05-01",266.2,131.9,267.7,311,249.2,272.3,271.60000000000002]
["2019-06-01",266.2,131.9,270.2,311,249.2,272.3,271.60000000000002]
["2019-07-01",319.60000000000002,137.80000000000001,270.2,311,246.6,263,271.60000000000002]
["2019-08-01",319.60000000000002,137.6,270.2,311,243.1,246.3,271.60000000000002]
["2019-09-01",319.60000000000002,137.6,270.2,311,233.5,238.5,276.89999999999998]
["2019-10-01",315.5,137.6,247.7,311,230.6,234.4,276.89999999999998]
["2019-11-01",315.5,137.6,235.7,311,228.4,226.1,263.2]
["2019-12-01",315.5,137.6,240.2,311,226.7,224.6,276.89999999999998]
["2020-01-01",315.5,137.9,240.2,289.8,225.8,263.2,260.8]
["2020-02-01",315.5,137.9,229.5,289.8,225.8,220.9,260.8,260.8]
["2020-03-01",315.5,137.9,232.1,289.8,225.8,220.9,260.8,260.8]
["2020-04-01",311.3,137.9,232.1,274,225.8,220.9,260.8,260.8]
["2020-05-01",311.3,137.9,232.1,274,225.8,220.9,260.8,260.8]
["2020-06-01",311.3,137.9,232.1,274,214.5,214.5,260.8,260.8]
["2020-07-01",311.3,148.19999999999999,232.1,274,207.4,211.3,260.8,260.8]
["2020-08-01",311.3,148.19999999999999,221.6,274,205.9,208,260.8,260.8]
["2020-09-01",311.3,148.19999999999999,221.6,274,205.6,208,260.8,260.8]
["2020-10-01",311.3,148.19999999999999,229.6,274,204,208,260.8,260.8]
["2020-11-01",311.3,148.19999999999999,229.6,274,204,208,260.8,260.8]
{"$rows_left_out":14}
{"sheet":"نسب التأثير والسعر والكمية","index":2,"n_rows":40,"n_cols":11,"rows_kept":40,"cut":false,"hidden":false,"merged":[]}
[]
[]
["رقم البند","سعر البند","كمية البند","سولار","اسمنت بورتلاند","حديد","اسفلت","قطاعات معدنية","غلاف معدني","زوايا وكمرات","مواسير صلب"]
[1,5,120,0.1]
[2,12,15,0.2]
[3,7,156,0.3]
[4,3,125,0.4]
[5,45,15,0.5]
[6,645,51,0.6]
[7,884,4545,0.7,null,null,0.75]
[8,54,1545,0.15,null,null,0.5]
[9,254,45,0.15,null,null,0.65]
[10,748,45,0.15,null,null,0.5]
[11,545,24,0.15,null,null,0.5]
[12,8987,5,0.15,0.35]
[13,5454,545,0.15]
[14,878,2,0.1,0.25]
[15,54,45,0.1,0.25]
[16,8,45,0.1,0.2,0.35]
[17,5486,15,0.15,0.3,0.1]
[18,69,45,0.15,0.3,0.1]
[19,87,5,0.1,0.35]
[20,857,45]
[21,58,12]
[22,5,11]
[23,8,7]
[24,74,12]
[25,5,22]
[26,8,45]
[27,254,48,0.15,null,null,0.65]
[28,748,45,0.15,null,null,0.5]
[29,545,24,0.15,null,null,0.5]
[30,8987,5,0.15,0.35]
[31,5454,545,0.15]
[32,878,2,0.1,0.25]
[33,54,45,0.1,0.25]
[34,8,48,0.1,0.2,0.35]
[35,5486,15,0.15,0.3,0.1]
[36,69,45,0.15,0.3,0.1]
[37,87,5,0.1,0.35,0.1]