{"text_format":"1","workbook":"xlsx","n_sheets":3,"sheets":["Store","Rassed","بطاقه حركه صنف"],"not_rendered":{"charts":0,"images":0,"macros":0,"external_links":0,"defined_names":2,"comments":0,"pivot_tables":0},"unopened":[],"bounds":{"document_bytes":16777216,"sheet_cells":100000,"rows_first":2000,"rows_last":500,"rows_between":2000,"halvings":0,"cell_chars":16384,"cell_head_chars":4096},"cells_cut":0,"cells_raw":0,"read":"whole","date_system":"1900"}

{"sheet":"Store","index":0,"n_rows":308,"n_cols":44,"rows_kept":308,"cut":false,"hidden":false,"merged":[]}
[]
[]
[]
[]
[null,"Des. Code","Des. Name","System Code","وصف","عميل","امر رقم","رقم الامر من واقع بيانات الاصناف","التصنيف","التصنيف من واقع بيانات الاصناف","النوع","النوع من واقع بيانات الاصناف","مقاس","المقاس من واقع بيانات الاصناف","وزن / قطعه","الوزن من واقع بيانات الاصناف","GSM","Discreption of weight","Color","الدرجه","نوع الغزل","نوع الغزل من واقع بيانات الاصناف","نمره الغزل","نمره الغزل من واقع بيانات الاصناف","درجه الغزل","درجه الغزل من واقع بيانات الاصناف","free4","امين المخزن","الوزن القائم للشيكاره","العدد","الوزن اجمالى كجم","Pattern","Design Type","حركه الاضافه","اسم حركه الاضافه","تاريخ الاضافه","free1","free2","free3","حركه الصرف","اسم حركه الصرفه","تاريخ حركه الصرف","اسم العميل المصروف اليه","رقم فاتوره الصرف"]
[null,"0002 - 34","lion - Blue",9114000002,"مشكل عميل 34 اوردر 7002",34,7002,7001,"Kitchen Towel","Kitchen Towel","Flat","Flat","50 X 70","50 X 70",75,8.7999999999999995E-2,250,"Light weight","dark","Second Choice","100% cotton","100% cotton - Organic","24/2 - 16/1","24/2 - 16/1","Fresh","Fresh",null,"محمود",16,20,1.5,0,"Normal","اضافه","اضافه من المشغل","2021/08/09"]
[null,"0001 - 34","lion - Brown","9114000001","مشكل عميل 34 اوردر 7002",34,7002,7001,"Kitchen Towel","Kitchen Towel","Flat","Flat","50 X 70","50 X 70",75,8.7999999999999995E-2,250,"Light weight","dark","Second Choice","100% cotton","100% cotton - Organic","24/2 - 16/1","24/2 - 16/1","Fresh","Fresh",null,"محمود",16,20,1.5,0,"Normal","اضافه","اضافه من المشغل","2021/08/09"]
[null,"0003 - 34","tiger - yellow","9112000001","مشكل عميل 34 اوردر 7002",34,7002,7001,"Kitchen Towel","Beach Towel","Flat","Velour","50 X 70","100 x 170",75,0.71399999999999997,420,"Medium weight","dark","Second Choice","100% cotton","100% cotton - Organic","24/2 - 16/1","24/2 - 24/2 - 16/1","Fresh","Fresh",null,"محمود",16,30,2.25,0,"Normal","اضافه","اضافه من المشغل","2021/08/09"]
[null,"0004 - 34","tiger - Orange",9112000002,"مشكل عميل 34 اوردر 7002",34,7002,7001,"Kitchen Towel","Beach Towel","Flat","Velour","50 X 70","100 x 170",75,0.71399999999999997,420,"Medium weight","dark","Second Choice","100% cotton","100% cotton - Organic","24/2 - 16/1","24/2 - 24/2 - 16/1","Fresh","Fresh",null,"محمود",16,50,3.75,0,"Normal","اضافه","اضافه من المشغل","2021/08/09"]
[null,"0005 - 34","sun - red",9112000003,"مشكل عميل 34 اوردر 7002",34,7002,7002,"Kitchen Towel","Beach Towel","Flat","Velour","50 X 70","90 x 160",75,0.57599999999999996,400,"Medium weight","dark","Second Choice","100% cotton","100% cotton","24/2 - 16/1","24/2 - 24/2 - 16/1","Fresh","Fresh",null,"محمود",16,10,0.75,0,"Normal","اضافه","اضافه من المشغل","2021/08/09"]
[null,"0006 - 34","sun - orange",9112000004,"مشكل عميل 34 اوردر 7002",34,7002,7002,"Kitchen Towel","Beach Towel","Flat","Velour","50 X 70","90 x 160",75,0.57599999999999996,400,"Medium weight","dark","Second Choice","100% cotton","100% cotton","24/2 - 16/1","24/2 - 24/2 - 16/1","Fresh","Fresh",null,"محمود",16,25,1.875,"DOBBY","Normal","اضافه","اضافه من المشغل","2021/08/09"]
[null,"0007 - 34","LOO",9114000003,"مشكل عميل 34 اوردر 7002",34,7002,7003,"Kitchen Towel","Kitchen Towel","Flat","Flat","50 X 70","50 X 70",75,7.0000000000000007E-2,200,"Very Light weight","dark","Second Choice","100% cotton","100% cotton","24/2 - 16/1","24/2 - 16/1","Fresh","Fresh",null,"محمود",16,25,1.875,"Jacquard","Normal","اضافه","اضافه من المشغل","2021/08/09"]
[null,"0008 - 34","TOO",9114000004,"مشكل عميل 34 اوردر 7002",34,7002,7003,"Kitchen Towel","Kitchen Towel","Flat","Flat","50 X 70","50 X 70",75,7.0000000000000007E-2,200,"Very Light weight","dark","Second Choice","100% cotton","100% cotton","24/2 - 16/1","24/2 - 16/1","Fresh","Fresh",null,"محمود",16,10,0.75,"Jacquard","Normal","اضافه","اضافه من المشغل","2021/08/09"]
[null,"0010 - 34","BOO",9114000006,"مشكل عميل 34 اوردر 7002",34,7002,7003,"Kitchen Towel","Kitchen Towel","Flat","Flat","50 X 70","50 X 70",75,7.0000000000000007E-2,200,"Very Light weight","dark","Second Choice","100% cotton","100% cotton","24/2 - 16/1","24/2 - 16/1","Fresh","Fresh",null,"محمود",16,10,0.75,"Jacquard","Normal","اضافه","اضافه من المشغل","2021/08/09"]
[null,"0002 - 34","lion - Blue",9114000002,"مشكل عميل 34 اوردر 7002",34,7002,7001,"Kitchen Towel","Kitchen Towel","Flat","Flat","50 X 70","50 X 70",75,8.7999999999999995E-2,250,"Light weight","dark","Second Choice","100% cotton","100% cotton - Organic","24/2 - 16/1","24/2 - 16/1","Fresh","Fresh",null,"محمود",16,20,1.5,0,"Normal","اضافه","اضافه من المشغل","2021/08/09"]
[null,"0001 - 34","lion - Brown","9114000001","مشكل عميل 34 اوردر 7002",34,7002,7001,"Kitchen Towel","Kitchen Towel","Flat","Flat","50 X 70","50 X 70",75,8.7999999999999995E-2,250,"Light weight","dark","Second Choice","100% cotton","100% cotton - Organic","24/2 - 16/1","24/2 - 16/1","Fresh","Fresh",null,"محمود",16,20,1.5,0,"Normal","اضافه","اضافه من المشغل","2021/08/09"]
[null,"0003 - 34","tiger - yellow","9112000001","مشكل عميل 34 اوردر 7002",34,7002,7001,"Kitchen Towel","Beach Towel","Flat","Velour","50 X 70","100 x 170",75,0.71399999999999997,420,"Medium weight","dark","Second Choice","100% cotton","100% cotton - Organic","24/2 - 16/1","24/2 - 24/2 - 16/1","Fresh","Fresh",null,"محمود",16,30,2.25,0,"Normal","اضافه","اضافه من المشغل","2021/08/09"]
[null,"0004 - 34","tiger - Orange",9112000002,"مشكل عميل 34 اوردر 7002",34,7002,7001,"Kitchen Towel","Beach Towel","Flat","Velour","50 X 70","100 x 170",75,0.71399999999999997,420,"Medium weight","dark","Second Choice","100% cotton","100% cotton - Organic","24/2 - 16/1","24/2 - 24/2 - 16/1","Fresh","Fresh",null,"محمود",16,50,3.75,0,"Normal","اضافه","اضافه من المشغل","2021/08/09"]
[null,"0005 - 34","sun - red",9112000003,"مشكل عميل 34 اوردر 7002",34,7002,7002,"Kitchen Towel","Beach Towel","Flat","Velour","50 X 70","90 x 160",75,0.57599999999999996,400,"Medium weight","dark","Second Choice","100% cotton","100% cotton","24/2 - 16/1","24/2 - 24/2 - 16/1","Fresh","Fresh",null,"محمود",16,10,0.75,0,"Normal","اضافه","اضافه من المشغل","2021/08/09"]
[null,"0006 - 34","sun - orange",9112000004,"مشكل عميل 34 اوردر 7002",34,7002,7002,"Kitchen Towel","Beach Towel","Flat","Velour","50 X 70","90 x 160",75,0.57599999999999996,400,"Medium weight","dark","Second Choice","100% cotton","100% cotton","24/2 - 16/1","24/2 - 24/2 - 16/1","Fresh","Fresh",null,"محمود",16,25,1.875,"DOBBY","Normal","اضافه","اضافه من المشغل","2021/08/09"]
[null,"0007 - 34","LOO",9114000003,"مشكل عميل 34 اوردر 7002",34,7002,7003,"Kitchen Towel","Kitchen Towel","Flat","Flat","50 X 70","50 X 70",75,7.0000000000000007E-2,200,"Very Light weight","dark","Second Choice","100% cotton","100% cotton","24/2 - 16/1","24/2 - 16/1","Fresh","Fresh",null,"محمود",16,25,1.875,"Jacquard","Normal","اضافه","اضافه من المشغل","2021/08/09"]
[null,"0008 - 34","TOO",9114000004,"مشكل عميل 34 اوردر 7002",34,7002,7003,"Kitchen Towel","Kitchen Towel","Flat","Flat","50 X 70","50 X 70",75,7.0000000000000007E-2,200,"Very Light weight","dark","Second Choice","100% cotton","100% cotton","24/2 - 16/1","24/2 - 16/1","Fresh","Fresh",null,"محمود",16,10,0.75,"Jacquard","Normal","اضافه","اضافه من المشغل","2021/08/09"]
[null,"0010 - 34","BOO",9114000006,"مشكل عميل 34 اوردر 7002",34,7002,7003,"Kitchen Towel","Kitchen Towel","Flat","Flat","50 X 70","50 X 70",75,7.0000000000000007E-2,200,"Very Light weight","dark","Second Choice","100% cotton","100% cotton","24/2 - 16/1","24/2 - 16/1","Fresh","Fresh",null,"محمود",16,10,0.75,"Jacquard","Normal","اضافه","اضافه من المشغل","2021/08/09"]
[null,"0002 - 34","lion - Blue",9114000002,"مشكل عميل 34 اوردر 7002",34,7002,7001,"Kitchen Towel","Kitchen Towel","Flat","Flat","50 X 70","50 X 70",75,8.7999999999999995E-2,250,"Light weight","dark","Second Choice","100% cotton","100% cotton - Organic","24/2 - 16/1","24/2 - 16/1","Fresh","Fresh",null,"محمود",1.6,20,1.5,0,"Normal","اضافه","اضافه من المشغل","2021/08/09"]
[null,"0001 - 34","lion - Brown","9114000001","مشكل عميل 34 اوردر 7002",34,7002,7001,"Kitchen Towel","Kitchen Towel","Flat","Flat","50 X 70","50 X 70",75,8.7999999999999995E-2,250,"Light weight","dark","Second Choice","100% cotton","100% cotton - Organic","24/2 - 16/1","24/2 - 16/1","Fresh","Fresh",null,"محمود",1.6,20,1.5,0,"Normal","اضافه","اضافه من المشغل","2021/08/09"]
[null,"0003 - 34","tiger - yellow","9112000001","مشكل عميل 34 اوردر 7002",34,7002,7001,"Kitchen Towel","Beach Towel","Flat","Velour","50 X 70","100 x 170",75,0.71399999999999997,420,"Medium weight","dark","Second Choice","100% cotton","100% cotton - Organic","24/2 - 16/1","24/2 - 24/2 - 16/1","Fresh","Fresh",null,"محمود",2.4,30,2.25,0,"Normal","اضافه","اضافه من المشغل","2021/08/09"]
[null,"0004 - 34","tiger - Orange",9112000002,"مشكل عميل 34 اوردر 7002",34,7002,7001,"Kitchen Towel","Beach Towel","Flat","Velour","50 X 70","100 x 170",75,0.71399999999999997,420,"Medium weight","dark","Second Choice","100% cotton","100% cotton - Organic","24/2 - 16/1","24/2 - 24/2 - 16/1","Fresh","Fresh",null,"محمود",4,50,3.75,0,"Normal","اضافه","اضافه من المشغل","2021/08/09"]
[null,"0005 - 34","sun - red",9112000003,"مشكل عميل 34 اوردر 7002",34,7002,7002,"Kitchen Towel","Beach Towel","Flat","Velour","50 X 70","90 x 160",75,0.57599999999999996,400,"Medium weight","dark","Second Choice","100% cotton","100% cotton","24/2 - 16/1","24/2 - 24/2 - 16/1","Fresh","Fresh",null,"محمود",0.8,10,0.75,0,"Normal","اضافه","اضافه من المشغل","2021/08/09"]
[null,"0006 - 34","sun - orange",9112000004,"مشكل عميل 34 اوردر 7002",34,7002,7002,"Kitchen Towel","Beach Towel","Flat","Velour","50 X 70","90 x 160",75,0.57599999999999996,400,"Medium weight","dark","Second Choice","100% cotton","100% cotton","24/2 - 16/1","24/2 - 24/2 - 16/1","Fresh","Fresh",null,"محمود",2,25,1.875,"DOBBY","Normal","اضافه","اضافه من المشغل","2021/08/09"]
[null,"0007 - 34","LOO",9114000003,"مشكل عميل 34 اوردر 7002",34,7002,7003,"Kitchen Towel","Kitchen Towel","Flat","Flat","50 X 70","50 X 70",75,7.0000000000000007E-2,200,"Very Light weight","dark","Second Choice","100% cotton","100% cotton","24/2 - 16/1","24/2 - 16/1","Fresh","Fresh",null,"محمود",2,25,1.875,"Jacquard","Normal","اضافه","اضافه من المشغل","2021/08/09"]
[null,"0008 - 34","TOO",9114000004,"مشكل عميل 34 اوردر 7002",34,7002,7003,"Kitchen Towel","Kitchen Towel","Flat","Flat","50 X 70","50 X 70",75,7.0000000000000007E-2,200,"Very Light weight","dark","Second Choice","100% cotton","100% cotton","24/2 - 16/1","24/2 - 16/1","Fresh","Fresh",null,"محمود",0.8,10,0.75,"Jacquard","Normal","اضافه","اضافه من المشغل","2021/08/09"]
[null,"0010 - 34","BOO",9114000006,"مشكل عميل 34 اوردر 7002",34,7002,7003,"Kitchen Towel","Kitchen Towel","Flat","Flat","50 X 70","50 X 70",75,7.0000000000000007E-2,200,"Very Light weight","dark","Second Choice","100% cotton","100% cotton","24/2 - 16/1","24/2 - 16/1","Fresh","Fresh",null,"محمود",0.8,10,0.75,"Jacquard","Normal","اضافه","اضافه من المشغل","2021/08/09"]
[null,"0013 - 34","AAAA",9114000009,"مشكل عميل 34 اوردر 7002",34,7007,7007,"Kitchen Towel","Kitchen Towel","Flat","Flat","50 X 70","50 X 70",70,70,200,"Very Light weight","dark","Second Choice","100% cotton","100% cotton","24/2 - 16/1","24/2 - 16/1","Fresh","Fresh",null,"محمود",1.2,20,1.4,"Jacquard","Normal","اضافه","اضافه من المشغل","2021/08/09"]
[null,"0014 - 34","BBBB",9114000010,"مشكل عميل 34 اوردر 7002",34,7007,7007,"Kitchen Towel","Kitchen Towel","Flat","Flat","50 X 70","50 X 70",70,70,200,"Very Light weight","dark","Second Choice","100% cotton","100% cotton","24/2 - 16/1","24/2 - 16/1","Fresh","Fresh",null,"محمود",1.2,20,1.4,"Dobby","Normal","اضافه","اضافه من المشغل","2021/08/09"]
[null,"0015 - 34","CCCC",9114000011,"مشكل عميل 34 اوردر 7002",34,7007,7007,"Kitchen Towel","Kitchen Towel","Flat","Flat","50 X 70","50 X 70",70,70,200,"Very Light weight","dark","Second Choice","100% cotton","100% cotton","24/2 - 16/1","24/2 - 16/1","Fresh","Fresh",null,"محمود",1.8000000000000003,30,2.1,"Jacquard","Normal","اضافه","اضافه من المشغل","2021/08/09"]
[null,"0016 - 34","DDDD",9114000012,"مشكل عميل 34 اوردر 7002",34,7007,7007,"Kitchen Towel","Kitchen Towel","Flat","Flat","50 X 70","50 X 70",70,70,200,"Very Light weight","dark","Second Choice","100% cotton","100% cotton","24/2 - 16/1","24/2 - 16/1","Fresh","Fresh",null,"محمود",3,50,3.5,"Dobby","Normal","اضافه","اضافه من المشغل","2021/08/09"]
[null,"0017 - 34","EEEE",9114000013,"مشكل عميل 34 اوردر 7002",34,7007,7007,"Kitchen Towel","Kitchen Towel","Flat","Flat","50 X 70","50 X 70",70,70,200,"Very Light weight","dark","Second Choice","100% cotton","100% cotton","24/2 - 16/1","24/2 - 16/1","Fresh","Fresh",null,"محمود",0.6,10,0.7,"Dobby","Normal","اضافه","اضافه من المشغل","2021/08/09"]
[null,"0018 - 34","FFFFF",9114000014,"مشكل عميل 34 اوردر 7002",34,7007,7007,"Kitchen Towel","Kitchen Towel","Flat","Flat","50 X 70","50 X 70",70,70,200,"Very Light weight","dark","Second Choice","100% cotton","100% cotton","24/2 - 16/1","24/2 - 16/1","Fresh","Fresh",null,"محمود",1.5,25,1.75,"Jacquard","Normal","اضافه","اضافه من المشغل","2021/08/09"]
[null,"0019 - 34","GGGG",9114000015,"مشكل عميل 34 اوردر 7002",34,7007,7007,"Kitchen Towel","Kitchen Towel","Flat","Flat","50 X 70","50 X 70",70,70,200,"Very Light weight","dark","Second Choice","100% cotton","100% cotton","24/2 - 16/1","24/2 - 16/1","Fresh","Fresh",null,"محمود",1.5,25,1.75,"Dobby","Normal","اضافه","اضافه من المشغل","2021/08/09"]
[null,"0020 - 34","HHHHH",9114000016,"مشكل عميل 34 اوردر 7002",34,7007,7007,"Kitchen Towel","Kitchen Towel","Flat","Flat","50 X 70","50 X 70",70,70,200,"Very Light weight","dark","Second Choice","100% cotton","100% cotton","24/2 - 16/1","24/2 - 16/1","Fresh","Fresh",null,"محمود",0.6,10,0.7,"Dobby","Normal","اضافه","اضافه من المشغل","2021/08/09"]
[null,"0021 - 34","JJJJJJ",9114000017,"مشكل عميل 34 اوردر 7002",34,7007,7007,"Kitchen Towel","Kitchen Towel","Flat","Flat","50 X 70","50 X 70",70,70,200,"Very Light weight","dark","Second Choice","100% cotton","100% cotton","24/2 - 16/1","24/2 - 16/1","Fresh","Fresh",null,"محمود",0.6,10,0.7,"Jacquard","Normal","اضافه","اضافه من المشغل","2021/08/09"]
[null,"0013 - 34","AAAA",9114000009,"مشكل عميل 34 اوردر 7002",34,7007,7007,"Kitchen Towel","Kitchen Towel","Flat","Flat","50 X 70","50 X 70",70,70,200,"Very Light weight","dark","Second Choice","100% cotton","100% cotton","24/2 - 16/1","24/2 - 16/1","Fresh","Fresh",null,"محمود",1.8633540372670809,20,1.4,"Jacquard","Normal","اضافه","اضافه من المشغل","2021/08/09"]
[null,"0014 - 34","BBBB",9114000010,"مشكل عميل 34 اوردر 7002",34,7007,7007,"Kitchen Towel","Kitchen Towel","Flat","Flat","50 X 70","50 X 70",70,70,200,"Very Light weight","dark","Second Choice","100% cotton","100% cotton","24/2 - 16/1","24/2 - 16/1","Fresh","Fresh",null,"محمود",2.7950310559006217,30,2.1,"Dobby","Normal","اضافه","اضافه من المشغل","2021/08/09"]
[null,"0015 - 34","CCCC",9114000011,"مشكل عميل 34 اوردر 7002",34,7007,7007,"Kitchen Towel","Kitchen Towel","Flat","Flat","50 X 70","50 X 70",70,70,200,"Very Light weight","dark","Second Choice","100% cotton","100% cotton","24/2 - 16/1","24/2 - 16/1","Fresh","Fresh",null,"محمود",2.7950310559006217,30,2.1,"Jacquard","Normal","اضافه","اضافه من المشغل","2021/08/09"]
[null,"0016 - 34","DDDD",9114000012,"مشكل عميل 34 اوردر 7002",34,7007,7007,"Kitchen Towel","Kitchen Towel","Flat","Flat","50 X 70","50 X 70",70,70,200,"Very Light weight","dark","Second Choice","100% cotton","100% cotton","24/2 - 16/1","24/2 - 16/1","Fresh","Fresh",null,"محمود",1.1180124223602486,12,0.84,"Dobby","Normal","اضافه","اضافه من المشغل","2021/08/09"]
[null,"0017 - 34","EEEE",9114000013,"مشكل عميل 34 اوردر 7002",34,7007,7007,"Kitchen Towel","Kitchen Towel","Flat","Flat","50 X 70","50 X 70",70,70,200,"Very Light weight","dark","Second Choice","100% cotton","100% cotton","24/2 - 16/1","24/2 - 16/1","Fresh","Fresh",null,"محمود",0.93167701863354047,10,0.7,"Dobby","Normal","اضافه","اضافه من المشغل","2021/08/09"]
[null,"0018 - 34","FFFFF",9114000014,"مشكل عميل 34 اوردر 7002",34,7007,7007,"Kitchen Towel","Kitchen Towel","Flat","Flat","50 X 70","50 X 70",70,70,200,"Very Light weight","dark","Second Choice","100% cotton","100% cotton","24/2 - 16/1","24/2 - 16/1","Fresh","Fresh",null,"محمود",1.3043478260869568,14,0.98,"Jacquard","Normal","اضافه","اضافه من المشغل","2021/08/09"]
[null,"0019 - 34","GGGG",9114000015,"مشكل عميل 34 اوردر 7002",34,7007,7007,"Kitchen Towel","Kitchen Towel","Flat","Flat","50 X 70","50 X 70",70,70,200,"Very Light weight","dark","Second Choice","100% cotton","100% cotton","24/2 - 16/1","24/2 - 16/1","Fresh","Fresh",null,"محمود",2.329192546583851,25,1.75,"Dobby","Normal","اضافه","اضافه من المشغل","2021/08/09"]
[null,"0020 - 34","HHHHH",9114000016,"مشكل عميل 34 اوردر 7002",34,7007,7007,"Kitchen Towel","Kitchen Towel","Flat","Flat","50 X 70","50 X 70",70,70,200,"Very Light weight","dark","Second Choice","100% cotton","100% cotton","24/2 - 16/1","24/2 - 16/1","Fresh","Fresh",null,"محمود",0.93167701863354047,10,0.7,"Dobby","Normal","اضافه","اضافه من المشغل","2021/08/09"]
[null,"0021 - 34","JJJJJJ",9114000017,"مشكل عميل 34 اوردر 7002",34,7007,7007,"Kitchen Towel","Kitchen Towel","Flat","Flat","50 X 70","50 X 70",70,70,200,"Very Light weight","dark","Second Choice","100% cotton","100% cotton","24/2 - 16/1","24/2 - 16/1","Fresh","Fresh",null,"محمود",0.93167701863354047,10,0.7,"Jacquard","Normal","اضافه","اضافه من المشغل","2021/08/09"]
[null,"0013 - 34","AAAA",9114000009,"مشكل عميل 34 اوردر 7002",34,7007,7007,"Kitchen Towel","Kitchen Towel","Flat","Flat","50 X 70","50 X 70",70,70,200,"Very Light weight","dark","Second Choice","100% cotton","100% cotton","24/2 - 16/1","24/2 - 16/1","Fresh","Fresh",null,"محمود",1.2,20,1.4,"Jacquard","Normal",null,null,null,null,null,null,"صرف","بيع محلى","2021/08/09",34,1]
[null,"0014 - 34","BBBB",9114000010,"مشكل عميل 34 اوردر 7002",34,7007,7007,"Kitchen Towel","Kitchen Towel","Flat","Flat","50 X 70","50 X 70",70,70,200,"Very Light weight","dark","Second Choice","100% cotton","100% cotton","24/2 - 16/1","24/2 - 16/1","Fresh","Fresh",null,"محمود",1.2,20,1.4,"Dobby","Normal",null,null,null,null,null,null,"صرف","بيع محلى","2021/08/09",34,1]
[null,"0015 - 34","CCCC",9114000011,"مشكل عميل 34 اوردر 7002",34,7007,7007,"Kitchen Towel","Kitchen Towel","Flat","Flat","50 X 70","50 X 70",70,70,200,"Very Light weight","dark","Second Choice","100% cotton","100% cotton","24/2 - 16/1","24/2 - 16/1","Fresh","Fresh",null,"محمود",1.8000000000000003,30,2.1,"Jacquard","Normal",null,null,null,null,null,null,"صرف","بيع محلى","2021/08/09",34,1]
[null,"0016 - 34","DDDD",9114000012,"مشكل عميل 34 اوردر 7002",34,7007,7007,"Kitchen Towel","Kitchen Towel","Flat","Flat","50 X 70","50 X 70",70,70,200,"Very Light weight","dark","Second Choice","100% cotton","100% cotton","24/2 - 16/1","24/2 - 16/1","Fresh","Fresh",null,"محمود",3,50,3.5,"Dobby","Normal",null,null,null,null,null,null,"صرف","بيع محلى","2021/08/09",34,1]
[null,"0017 - 34","EEEE",9114000013,"مشكل عميل 34 اوردر 7002",34,7007,7007,"Kitchen Towel","Kitchen Towel","Flat","Flat","50 X 70","50 X 70",70,70,200,"Very Light weight","dark","Second Choice","100% cotton","100% cotton","24/2 - 16/1","24/2 - 16/1","Fresh","Fresh",null,"محمود",0.6,10,0.7,"Dobby","Normal",null,null,null,null,null,null,"صرف","بيع محلى","2021/08/09",34,1]
[null,"0018 - 34","FFFFF",9114000014,"مشكل عميل 34 اوردر 7002",34,7007,7007,"Kitchen Towel","Kitchen Towel","Flat","Flat","50 X 70","50 X 70",70,70,200,"Very Light weight","dark","Second Choice","100% cotton","100% cotton","24/2 - 16/1","24/2 - 16/1","Fresh","Fresh",null,"محمود",1.5,25,1.75,"Jacquard","Normal",null,null,null,null,null,null,"صرف","بيع محلى","2021/08/09",34,1]
[null,"0019 - 34","GGGG",9114000015,"مشكل عميل 34 اوردر 7002",34,7007,7007,"Kitchen Towel","Kitchen Towel","Flat","Flat","50 X 70","50 X 70",70,70,200,"Very Light weight","dark","Second Choice","100% cotton","100% cotton","24/2 - 16/1","24/2 - 16/1","Fresh","Fresh",null,"محمود",1.5,25,1.75,"Dobby","Normal",null,null,null,null,null,null,"صرف","بيع محلى","2021/08/09",34,1]
[null,"0020 - 34","HHHHH",9114000016,"مشكل عميل 34 اوردر 7002",34,7007,7007,"Kitchen Towel","Kitchen Towel","Flat","Flat","50 X 70","50 X 70",70,70,200,"Very Light weight","dark","Second Choice","100% cotton","100% cotton","24/2 - 16/1","24/2 - 16/1","Fresh","Fresh",null,"محمود",0.6,10,0.7,"Dobby","Normal",null,null,null,null,null,null,"صرف","بيع محلى","2021/08/09",34,1]
[null,"0021 - 34","JJJJJJ",9114000017,"مشكل عميل 34 اوردر 7002",34,7007,7007,"Kitchen Towel","Kitchen Towel","Flat","Flat","50 X 70","50 X 70",70,70,200,"Very Light weight","dark","Second Choice","100% cotton","100% cotton","24/2 - 16/1","24/2 - 16/1","Fresh","Fresh",null,"محمود",0.6,10,0.7,"Jacquard","Normal",null,null,null,null,null,null,"صرف","بيع محلى","2021/08/09",34,1]
[null,"0013 - 34","AAAA",9114000009,"مشكل عميل 34 اوردر 7002",34,7007,7007,"Kitchen Towel","Kitchen Towel","Flat","Flat","50 X 70","50 X 70",70,70,200,"Very Light weight","dark","Second Choice","100% cotton","100% cotton","24/2 - 16/1","24/2 - 16/1","Fresh","Fresh",null,"محمود",1.8633540372670809,20,1.4,"Jacquard","Normal",null,null,null,null,null,null,"صرف","بيع محلى","2021/08/09",34,1]
[null,"0014 - 34","BBBB",9114000010,"مشكل عميل 34 اوردر 7002",34,7007,7007,"Kitchen Towel","Kitchen Towel","Flat","Flat","50 X 70","50 X 70",70,70,200,"Very Light weight","dark","Second Choice","100% cotton","100% cotton","24/2 - 16/1","24/2 - 16/1","Fresh","Fresh",null,"محمود",2.7950310559006217,30,2.1,"Dobby","Normal",null,null,null,null,null,null,"صرف","بيع محلى","2021/08/09",34,1]
[null,"0015 - 34","CCCC",9114000011,"مشكل عميل 34 اوردر 7002",34,7007,7007,"Kitchen Towel","Kitchen Towel","Flat","Flat","50 X 70","50 X 70",70,70,200,"Very Light weight","dark","Second Choice","100% cotton","100% cotton","24/2 - 16/1","24/2 - 16/1","Fresh","Fresh",null,"محمود",2.7950310559006217,30,2.1,"Jacquard","Normal",null,null,null,null,null,null,"صرف","بيع محلى","2021/08/09",34,1]
[null,"0016 - 34","DDDD",9114000012,"مشكل عميل 34 اوردر 7002",34,7007,7007,"Kitchen Towel","Kitchen Towel","Flat","Flat","50 X 70","50 X 70",70,70,200,"Very Light weight","dark","Second Choice","100% cotton","100% cotton","24/2 - 16/1","24/2 - 16/1","Fresh","Fresh",null,"محمود",1.1180124223602486,12,0.84,"Dobby","Normal",null,null,null,null,null,null,"صرف","بيع محلى","2021/08/09",34,1]
[null,"0017 - 34","EEEE",9114000013,"مشكل عميل 34 اوردر 7002",34,7007,7007,"Kitchen Towel","Kitchen Towel","Flat","Flat","50 X 70","50 X 70",70,70,200,"Very Light weight","dark","Second Choice","100% cotton","100% cotton","24/2 - 16/1","24/2 - 16/1","Fresh","Fresh",null,"محمود",0.93167701863354047,10,0.7,"Dobby","Normal",null,null,null,null,null,null,"صرف","بيع محلى","2021/08/09",34,1]
[null,"0018 - 34","FFFFF",9114000014,"مشكل عميل 34 اوردر 7002",34,7007,7007,"Kitchen Towel","Kitchen Towel","Flat","Flat","50 X 70","50 X 70",70,70,200,"Very Light weight","dark","Second Choice","100% cotton","100% cotton","24/2 - 16/1","24/2 - 16/1","Fresh","Fresh",null,"محمود",1.3043478260869568,14,0.98,"Jacquard","Normal",null,null,null,null,null,null,"صرف","بيع محلى","2021/08/09",34,1]
[null,"0019 - 34","GGGG",9114000015,"مشكل عميل 34 اوردر 7002",34,7007,7007,"Kitchen Towel","Kitchen Towel","Flat","Flat","50 X 70","50 X 70",70,70,200,"Very Light weight","dark","Second Choice","100% cotton","100% cotton","24/2 - 16/1","24/2 - 16/1","Fresh","Fresh",null,"محمود",2.329192546583851,25,1.75,"Dobby","Normal",null,null,null,null,null,null,"صرف","بيع محلى","2021/08/09",34,1]
[null,"0020 - 34","HHHHH",9114000016,"مشكل عميل 34 اوردر 7002",34,7007,7007,"Kitchen Towel","Kitchen Towel","Flat","Flat","50 X 70","50 X 70",70,70,200,"Very Light weight","dark","Second Choice","100% cotton","100% cotton","24/2 - 16/1","24/2 - 16/1","Fresh","Fresh",null,"محمود",0.93167701863354047,10,0.7,"Dobby","Normal",null,null,null,null,null,null,"صرف","بيع محلى","2021/08/09",34,1]
[null,"0021 - 34","JJJJJJ",9114000017,"مشكل عميل 34 اوردر 7002",34,7007,7007,"Kitchen Towel","Kitchen Towel","Flat","Flat","50 X 70","50 X 70",70,70,200,"Very Light weight","dark","Second Choice","100% cotton","100% cotton","24/2 - 16/1","24/2 - 16/1","Fresh","Fresh",null,"محمود",0.93167701863354047,10,0.7,"Jacquard","Normal",null,null,null,null,null,null,"صرف","بيع محلى","2021/08/09",34,1]
[null,"0013 - 34","AAAA",9114000009,"مشكل عميل 34 اوردر 7002",34,7007,7007,"Kitchen Towel","Kitchen Towel","Flat","Flat","50 X 70","50 X 70",70,70,200,"Very Light weight","dark","Second Choice","100% cotton","100% cotton","24/2 - 16/1","24/2 - 16/1","Fresh","Fresh",null,"محمود",0.94736842105263164,12,0.84,"Jacquard","Normal","اضافه","اضافه من المشغل","2021/08/09"]
[null,"0014 - 34","BBBB",9114000010,"مشكل عميل 34 اوردر 7002",34,7007,7007,"Kitchen Towel","Kitchen Towel","Flat","Flat","50 X 70","50 X 70",70,70,200,"Very Light weight","dark","Second Choice","100% cotton","100% cotton","24/2 - 16/1","24/2 - 16/1","Fresh","Fresh",null,"محمود",1.8157894736842106,23,1.61,"Dobby","Normal","اضافه","اضافه من المشغل","2021/08/09"]
[null,"0015 - 34","CCCC",9114000011,"مشكل عميل 34 اوردر 7002",34,7007,7007,"Kitchen Towel","Kitchen Towel","Flat","Flat","50 X 70","50 X 70",70,70,200,"Very Light weight","dark","Second Choice","100% cotton","100% cotton","24/2 - 16/1","24/2 - 16/1","Fresh","Fresh",null,"محمود",3.5526315789473686,45,3.15,"Jacquard","Normal","اضافه","اضافه من المشغل","2021/08/09"]
[null,"0016 - 34","DDDD",9114000012,"مشكل عميل 34 اوردر 7002",34,7007,7007,"Kitchen Towel","Kitchen Towel","Flat","Flat","50 X 70","50 X 70",70,70,200,"Very Light weight","dark","Second Choice","100% cotton","100% cotton","24/2 - 16/1","24/2 - 16/1","Fresh","Fresh",null,"محمود",3.9473684210526319,50,3.5,"Dobby","Normal","اضافه","اضافه من المشغل","2021/08/09"]
[null,"0017 - 34","EEEE",9114000013,"مشكل عميل 34 اوردر 7002",34,7007,7007,"Kitchen Towel","Kitchen Towel","Flat","Flat","50 X 70","50 X 70",70,70,200,"Very Light weight","dark","Second Choice","100% cotton","100% cotton","24/2 - 16/1","24/2 - 16/1","Fresh","Fresh",null,"محمود",0.78947368421052633,10,0.7,"Dobby","Normal","اضافه","اضافه من المشغل","2021/08/09"]
[null,"0018 - 34","FFFFF",9114000014,"مشكل عميل 34 اوردر 7002",34,7007,7007,"Kitchen Towel","Kitchen Towel","Flat","Flat","50 X 70","50 X 70",70,70,200,"Very Light weight","dark","Second Choice","100% cotton","100% cotton","24/2 - 16/1","24/2 - 16/1","Fresh","Fresh",null,"محمود",0.86842105263157898,11,0.77,"Jacquard","Normal","اضافه","اضافه من المشغل","2021/08/09"]
[null,"0019 - 34","GGGG",9114000015,"مشكل عميل 34 اوردر 7002",34,7007,7007,"Kitchen Towel","Kitchen Towel","Flat","Flat","50 X 70","50 X 70",70,70,200,"Very Light weight","dark","Second Choice","100% cotton","100% cotton","24/2 - 16/1","24/2 - 16/1","Fresh","Fresh",null,"محمود",0.55263157894736847,7,0.49,"Dobby","Normal","اضافه","اضافه من المشغل","2021/08/09"]
[null,"0020 - 34","HHHHH",9114000016,"مشكل عميل 34 اوردر 7002",34,7007,7007,"Kitchen Towel","Kitchen Towel","Flat","Flat","50 X 70","50 X 70",70,70,200,"Very Light weight","dark","Second Choice","100% cotton","100% cotton","24/2 - 16/1","24/2 - 16/1","Fresh","Fresh",null,"محمود",0.94736842105263164,12,0.84,"Dobby","Normal","اضافه","اضافه من المشغل","2021/08/09"]
[null,"0021 - 34","JJJJJJ",9114000017,"مشكل عميل 34 اوردر 7002",34,7007,7007,"Kitchen Towel","Kitchen Towel","Flat","Flat","50 X 70","50 X 70",70,70,200,"Very Light weight","dark","Second Choice","100% cotton","100% cotton","24/2 - 16/1","24/2 - 16/1","Fresh","Fresh",null,"محمود",1.5789473684210527,20,1.4,"Jacquard","Normal","اضافه","اضافه من المشغل","2021/08/09"]
[null,"0013 - 34","AAAA",9114000009,"مشكل عميل 34 اوردر 7002",34,7007,7007,"Kitchen Towel","Kitchen Towel","Flat","Flat","50 X 70","50 X 70",70,70,200,"Very Light weight","dark","Second Choice","100% cotton","100% cotton","24/2 - 16/1","24/2 - 16/1","Fresh","Fresh",null,"محمود",0.94736842105263164,12,0.84,"Jacquard","Normal",null,null,null,null,null,null,"صرف","بيع محلى","2021/08/09",34,2]
[null,"0014 - 34","BBBB",9114000010,"مشكل عميل 34 اوردر 7002",34,7007,7007,"Kitchen Towel","Kitchen Towel","Flat","Flat","50 X 70","50 X 70",70,70,200,"Very Light weight","dark","Second Choice","100% cotton","100% cotton","24/2 - 16/1","24/2 - 16/1","Fresh","Fresh",null,"محمود",1.8157894736842106,23,1.61,"Dobby","Normal",null,null,null,null,null,null,"صرف","بيع محلى","2021/08/09",34,2]
[null,"0015 - 34","CCCC",9114000011,"مشكل عميل 34 اوردر 7002",34,7007,7007,"Kitchen Towel","Kitchen Towel","Flat","Flat","50 X 70","50 X 70",70,70,200,"Very Light weight","dark","Second Choice","100% cotton","100% cotton","24/2 - 16/1","24/2 - 16/1","Fresh","Fresh",null,"محمود",3.5526315789473686,45,3.15,"Jacquard","Normal",null,null,null,null,null,null,"صرف","بيع محلى","2021/08/09",34,2]
[null,"0016 - 34","DDDD",9114000012,"مشكل عميل 34 اوردر 7002",34,7007,7007,"Kitchen Towel","Kitchen Towel","Flat","Flat","50 X 70","50 X 70",70,70,200,"Very Light weight","dark","Second Choice","100% cotton","100% cotton","24/2 - 16/1","24/2 - 16/1","Fresh","Fresh",null,"محمود",3.9473684210526319,50,3.5,"Dobby","Normal",null,null,null,null,null,null,"صرف","بيع محلى","2021/08/09",34,2]
[null,"0017 - 34","EEEE",9114000013,"مشكل عميل 34 اوردر 7002",34,7007,7007,"Kitchen Towel","Kitchen Towel","Flat","Flat","50 X 70","50 X 70",70,70,200,"Very Light weight","dark","Second Choice","100% cotton","100% cotton","24/2 - 16/1","24/2 - 16/1","Fresh","Fresh",null,"محمود",0.78947368421052633,10,0.7,"Dobby","Normal",null,null,null,null,null,null,"صرف","بيع محلى","2021/08/09",34,2]
[null,"0018 - 34","FFFFF",9114000014,"مشكل عميل 34 اوردر 7002",34,7007,7007,"Kitchen Towel","Kitchen Towel","Flat","Flat","50 X 70","50 X 70",70,70,200,"Very Light weight","dark","Second Choice","100% cotton","100% cotton","24/2 - 16/1","24/2 - 16/1","Fresh","Fresh",null,"محمود",0.86842105263157898,11,0.77,"Jacquard","Normal",null,null,null,null,null,null,"صرف","بيع محلى","2021/08/09",34,2]
[null,"0019 - 34","GGGG",9114000015,"مشكل عميل 34 اوردر 7002",34,7007,7007,"Kitchen Towel","Kitchen Towel","Flat","Flat","50 X 70","50 X 70",70,70,200,"Very Light weight","dark","Second Choice","100% cotton","100% cotton","24/2 - 16/1","24/2 - 16/1","Fresh","Fresh",null,"محمود",0.55263157894736847,7,0.49,"Dobby","Normal",null,null,null,null,null,null,"صرف","بيع محلى","2021/08/09",34,2]
[null,"0020 - 34","HHHHH",9114000016,"مشكل عميل 34 اوردر 7002",34,7007,7007,"Kitchen Towel","Kitchen Towel","Flat","Flat","50 X 70","50 X 70",70,70,200,"Very Light weight","dark","Second Choice","100% cotton","100% cotton","24/2 - 16/1","24/2 - 16/1","Fresh","Fresh",null,"محمود",0.94736842105263164,12,0.84,"Dobby","Normal",null,null,null,null,null,null,"صرف","بيع محلى","2021/08/09",34,2]
[null,"0021 - 34","JJJJJJ",9114000017,"مشكل عميل 34 اوردر 7002",34,7007,7007,"Kitchen Towel","Kitchen Towel","Flat","Flat","50 X 70","50 X 70",70,70,200,"Very Light weight","dark","Second Choice","100% cotton","100% cotton","24/2 - 16/1","24/2 - 16/1","Fresh","Fresh",null,"محمود",1.5789473684210527,20,1.4,"Jacquard","Normal",null,null,null,null,null,null,"صرف","بيع محلى","2021/08/09",34,2]
[null,"0001 - 44","Elephnt",9114000018,"مشكل عميل 44 اوردر 7008",44,7008,7008,"Kitchen Towel","Kitchen Towel","Flat","Flat","50 X 70","50 X 70",70,70,200,"Very Light weight","dark","Second Choice","100% cotton","100% cotton","24/2 - 16/1","24/2 - 16/1","Fresh","Fresh",null,"محمود",7.2727272727272716,100,7,"Dobby","Normal","اضافه","اضافه من المشغل","2021/08/10"]
[null,"0002 - 44","BroB",9114000019,"مشكل عميل 44 اوردر 7008",44,7008,7008,"Kitchen Towel","Kitchen Towel","Flat","Flat","50 X 70","50 X 70",70,70,200,"Very Light weight","dark","Second Choice","100% cotton","100% cotton","24/2 - 16/1","24/2 - 16/1","Fresh","Fresh",null,"محمود",10.909090909090908,150,10.5,"Dobby","Normal","اضافه","اضافه من المشغل","2021/08/10"]
[null,"0003 - 44","hgh",9114000020,"مشكل عميل 44 اوردر 7008",44,7008,7008,"Kitchen Towel","Kitchen Towel","Flat","Flat","50 X 70","50 X 70",70,70,200,"Very Light weight","dark","Second Choice","100% cotton","100% cotton","24/2 - 16/1","24/2 - 16/2","Fresh","Fresh",null,"محمود",14.545454545454543,200,14,"Jacquard","Normal","اضافه","اضافه من المشغل","2021/08/10"]
[null,"0004 - 44","yurturhy",9114000021,"مشكل عميل 44 اوردر 7008",44,7008,7008,"Kitchen Towel","Kitchen Towel","Flat","Flat","50 X 70","50 X 70",70,70,200,"Very Light weight","dark","Second Choice","100% cotton","100% cotton","24/2 - 16/1","24/2 - 16/3","Fresh","Fresh",null,"محمود",21.818181818181817,300,21,"Jacquard","Normal","اضافه","اضافه من المشغل","2021/08/10"]
[null,"0005 - 44","dytrto",9114000022,"مشكل عميل 44 اوردر 7008",44,7008,7008,"Kitchen Towel","Kitchen Towel","Flat","Flat","50 X 70","50 X 70",70,70,200,"Very Light weight","dark","Second Choice","100% cotton","100% cotton","24/2 - 16/1","24/2 - 16/4","Fresh","Fresh",null,"محمود",29.090909090909086,400,28,"Jacquard","Normal","اضافه","اضافه من المشغل","2021/08/10"]
[null,"0006 - 44","srttLLLLl",9114000023,"مشكل عميل 44 اوردر 7008",44,7008,7008,"Kitchen Towel","Kitchen Towel","Flat","Flat","50 X 70","50 X 70",70,70,200,"Very Light weight","dark","Second Choice","100% cotton","100% cotton","24/2 - 16/1","24/2 - 16/5","Fresh","Fresh",null,"محمود",36.36363636363636,500,35,"Jacquard","Normal","اضافه","اضافه من المشغل","2021/08/10"]
[null,"0001 - 44","Elephnt",9114000018,"مشكل عميل 44 اوردر 7008",44,7008,7008,"Kitchen Towel","Kitchen Towel","Flat","Flat","50 X 70","50 X 70",70,70,200,"Very Light weight","dark","Second Choice","100% cotton","100% cotton","24/2 - 16/1","24/2 - 16/1","Fresh","Fresh",null,"محمود",7.2727272727272716,100,7,"Dobby","Normal",null,null,null,null,null,null,"صرف","بيع محلى","2021/08/10",34,3]
[null,"0002 - 44","BroB",9114000019,"مشكل عميل 44 اوردر 7008",44,7008,7008,"Kitchen Towel","Kitchen Towel","Flat","Flat","50 X 70","50 X 70",70,70,200,"Very Light weight","dark","Second Choice","100% cotton","100% cotton","24/2 - 16/1","24/2 - 16/1","Fresh","Fresh",null,"محمود",10.909090909090908,150,10.5,"Dobby","Normal",null,null,null,null,null,null,"صرف","بيع محلى","2021/08/10",34,3]
[null,"0003 - 44","hgh",9114000020,"مشكل عميل 44 اوردر 7008",44,7008,7008,"Kitchen Towel","Kitchen Towel","Flat","Flat","50 X 70","50 X 70",70,70,200,"Very Light weight","dark","Second Choice","100% cotton","100% cotton","24/2 - 16/1","24/2 - 16/2","Fresh","Fresh",null,"محمود",14.545454545454543,200,14,"Jacquard","Normal",null,null,null,null,null,null,"صرف","بيع محلى","2021/08/10",34,3]
[null,"0004 - 44","yurturhy",9114000021,"مشكل عميل 44 اوردر 7008",44,7008,7008,"Kitchen Towel","Kitchen Towel","Flat","Flat","50 X 70","50 X 70",70,70,200,"Very Light weight","dark","Second Choice","100% cotton","100% cotton","24/2 - 16/1","24/2 - 16/3","Fresh","Fresh",null,"محمود",21.818181818181817,300,21,"Jacquard","Normal",null,null,null,null,null,null,"صرف","بيع محلى","2021/08/10",34,3]
[null,"0005 - 44","dytrto",9114000022,"مشكل عميل 44 اوردر 7008",44,7008,7008,"Kitchen Towel","Kitchen Towel","Flat","Flat","50 X 70","50 X 70",70,70,200,"Very Light weight","dark","Second Choice","100% cotton","100% cotton","24/2 - 16/1","24/2 - 16/4","Fresh","Fresh",null,"محمود",29.090909090909086,400,28,"Jacquard","Normal",null,null,null,null,null,null,"صرف","بيع محلى","2021/08/10",34,3]
[null,"0006 - 44","srttLLLLl",9114000023,"مشكل عميل 44 اوردر 7008",44,7008,7008,"Kitchen Towel","Kitchen Towel","Flat","Flat","50 X 70","50 X 70",70,70,200,"Very Light weight","dark","Second Choice","100% cotton","100% cotton","24/2 - 16/1","24/2 - 16/5","Fresh","Fresh",null,"محمود",36.36363636363636,500,35,"Jacquard","Normal",null,null,null,null,null,null,"صرف","بيع محلى","2021/08/10",34,3]
[null,"0001 - 44","Elephnt",9114000018,"مشكل عميل 44 اوردر 7008",44,7008,7008,"Kitchen Towel","Kitchen Towel","Flat","Flat","50 X 70","50 X 70",70,70,200,"Very Light weight","dark","Second Choice","100% cotton","100% cotton","24/2 - 16/1","24/2 - 16/1","Fresh","Fresh",null,"محمود",17.5,250,17.5,"Dobby","Normal","اضافه","اضافه من المشغل","2021/08/10"]
[null,"0001 - 44","Elephnt",9114000018,"مشكل عميل 44 اوردر 7008",44,7008,7008,"Kitchen Towel","Kitchen Towel","Flat","Flat","50 X 70","50 X 70",70,70,200,"Very Light weight","dark","Second Choice","100% cotton","100% cotton","24/2 - 16/1","24/2 - 16/1","Fresh","Fresh",null,"محمود",28,400,28,"Dobby","Normal","اضافه","اضافه من المشغل","2021/08/10"]
[null,"0001 - 44","Elephnt",9114000018,"مشكل عميل 44 اوردر 7008",44,7008,7008,"Kitchen Towel","Kitchen Towel","Flat","Flat","50 X 70","50 X 70",70,70,200,"Very Light weight","dark","Second Choice","100% cotton","100% cotton","24/2 - 16/1","24/2 - 16/1","Fresh","Fresh",null,"محمود",56,800,56,"Dobby","Normal","اضافه","اضافه من المشغل","2021/08/10"]
[null,"0001 - 44","Elephnt",9114000018,"مشكل عميل 44 اوردر 7008",44,7008,7008,"Kitchen Towel","Kitchen Towel","Flat","Flat","50 X 70","50 X 70",70,70,200,"Very Light weight","dark","Second Choice","100% cotton","100% cotton","24/2 - 16/1","24/2 - 16/1","Fresh","Fresh",null,"محمود",28,400,28,"Dobby","Normal",null,null,null,null,null,null,"صرف","بيع محلى","2021/08/10",34,4]
[null,"0001 - 55","palm blue",9114000024,"مشكل عميل 55 اوردر 7009",55,7009,7009,"Kitchen Towel","Kitchen Towel","Flat","Flat","50 X 70","50 X 70",70,70,200,"Very Light weight","dark","Second Choice","100% cotton","100% cotton","24/2 - 16/1","24/2 - 16/1","Fresh","Fresh",null,"محمود",14,200,14,"Dobby","Normal","اضافه","اضافه من المشغل","2021/08/10"]
[null,"0002 - 55","palm nel",9114000025,"مشكل عميل 55 اوردر 7009",55,7009,7009,"Kitchen Towel","Kitchen Towel","Flat","Flat","50 X 70","50 X 70",70,70,200,"Very Light weight","dark","Second Choice","100% cotton","100% cotton","24/2 - 16/1","24/2 - 16/1","Fresh","Fresh",null,"محمود",3.5,50,3.5,"Dobby","Normal","اضافه","اضافه من المشغل","2021/08/10"]
[null,"0003 - 55","palm Turq",9114000026,"مشكل عميل 55 اوردر 7009",55,7009,7009,"Kitchen Towel","Kitchen Towel","Flat","Flat","50 X 70","50 X 70",70,70,200,"Very Light weight","dark","Second Choice","100% cotton","100% cotton","24/2 - 16/1","24/2 - 16/1","Fresh","Fresh",null,"محمود",1.75,25,1.75,"Dobby","Normal","اضافه","اضافه من المشغل","2021/08/10"]
[null,"0004 - 55","palm orange",9114000027,"مشكل عميل 55 اوردر 7009",55,7009,7009,"Kitchen Towel","Kitchen Towel","Flat","Flat","50 X 70","50 X 70",70,70,200,"Very Light weight","dark","Second Choice","100% cotton","100% cotton","24/2 - 16/1","24/2 - 16/1","Fresh","Fresh",null,"محمود",2.1,30,2.1,"Dobby","Normal","اضافه","اضافه من المشغل","2021/08/10"]
[null,"0005 - 55","palm red",9114000028,"مشكل عميل 55 اوردر 7009",55,7009,7009,"Kitchen Towel","Kitchen Towel","Flat","Flat","50 X 70","50 X 70",70,70,200,"Very Light weight","dark","Second Choice","100% cotton","100% cotton","24/2 - 16/1","24/2 - 16/1","Fresh","Fresh",null,"محمود",0.84,12,0.84,"Dobby","Normal","اضافه","اضافه من المشغل","2021/08/10"]
[null,"0006 - 55","palm Brown",9114000029,"مشكل عميل 55 اوردر 7009",55,7009,7009,"Kitchen Towel","Kitchen Towel","Flat","Flat","50 X 70","50 X 70",70,70,200,"Very Light weight","dark","Second Choice","100% cotton","100% cotton","24/2 - 16/1","24/2 - 16/1","Fresh","Fresh",null,"محمود",0.56000000000000005,8,0.56000000000000005,"Dobby","Normal","اضافه","اضافه من المشغل","2021/08/10"]
[null,"0001 - 55","palm blue",9114000024,"مشكل عميل 55 اوردر 7009",55,7009,7009,"Kitchen Towel","Kitchen Towel","Flat","Flat","50 X 70","50 X 70",70,70,200,"Very Light weight","dark","Second Choice","100% cotton","100% cotton","24/2 - 16/1","24/2 - 16/1","Fresh","Fresh",null,"محمود",27.999999999999993,400,28,"Dobby","Normal","اضافه","اضافه من المشغل","2021/08/10"]
[null,"0002 - 55","palm nel",9114000025,"مشكل عميل 55 اوردر 7009",55,7009,7009,"Kitchen Towel","Kitchen Towel","Flat","Flat","50 X 70","50 X 70",70,70,200,"Very Light weight","dark","Second Choice","100% cotton","100% cotton","24/2 - 16/1","24/2 - 16/1","Fresh","Fresh",null,"محمود",8.3999999999999986,120,8.4,"Dobby","Normal","اضافه","اضافه من المشغل","2021/08/10"]
[null,"0003 - 55","palm Turq",9114000026,"مشكل عميل 55 اوردر 7009",55,7009,7009,"Kitchen Towel","Kitchen Towel","Flat","Flat","50 X 70","50 X 70",70,70,200,"Very Light weight","dark","Second Choice","100% cotton","100% cotton","24/2 - 16/1","24/2 - 16/1","Fresh","Fresh",null,"محمود",0.55999999999999994,8,0.56000000000000005,"Dobby","Normal","اضافه","اضافه من المشغل","2021/08/10"]
[null,"0004 - 55","palm orange",9114000027,"مشكل عميل 55 اوردر 7009",55,7009,7009,"Kitchen Towel","Kitchen Towel","Flat","Flat","50 X 70","50 X 70",70,70,200,"Very Light weight","dark","Second Choice","100% cotton","100% cotton","24/2 - 16/1","24/2 - 16/1","Fresh","Fresh",null,"محمود",0.83999999999999975,12,0.84,"Dobby","Normal","اضافه","اضافه من المشغل","2021/08/10"]
[null,"0005 - 55","palm red",9114000028,"مشكل عميل 55 اوردر 7009",55,7009,7009,"Kitchen Towel","Kitchen Towel","Flat","Flat","50 X 70","50 X 70",70,70,200,"Very Light weight","dark","Second Choice","100% cotton","100% cotton","24/2 - 16/1","24/2 - 16/1","Fresh","Fresh",null,"محمود",2.0999999999999996,30,2.1,"Dobby","Normal","اضافه","اضافه من المشغل","2021/08/10"]
[null,"0006 - 55","palm Brown",9114000029,"مشكل عميل 55 اوردر 7009",55,7009,7009,"Kitchen Towel","Kitchen Towel","Flat","Flat","50 X 70","50 X 70",70,70,200,"Very Light weight","dark","Second Choice","100% cotton","100% cotton","24/2 - 16/1","24/2 - 16/1","Fresh","Fresh",null,"محمود",1.5399999999999996,22,1.54,"Dobby","Normal","اضافه","اضافه من المشغل","2021/08/10"]
[null,"0001 - 55","palm blue",9114000024,"مشكل عميل 55 اوردر 7009",55,7009,7009,"Kitchen Towel","Kitchen Towel","Flat","Flat","50 X 70","50 X 70",70,70,200,"Very Light weight","dark","Second Choice","100% cotton","100% cotton","24/2 - 16/1","24/2 - 16/1","Fresh","Fresh",null,"محمود",27.999999999999993,400,28,"Dobby","Normal",null,null,null,null,null,null,"صرف","بيع محلى","2021/08/10",34,5]
[null,"0002 - 55","palm nel",9114000025,"مشكل عميل 55 اوردر 7009",55,7009,7009,"Kitchen Towel","Kitchen Towel","Flat","Flat","50 X 70","50 X 70",70,70,200,"Very Light weight","dark","Second Choice","100% cotton","100% cotton","24/2 - 16/1","24/2 - 16/1","Fresh","Fresh",null,"محمود",8.3999999999999986,120,8.4,"Dobby","Normal",null,null,null,null,null,null,"صرف","بيع محلى","2021/08/10",34,5]
[null,"0003 - 55","palm Turq",9114000026,"مشكل عميل 55 اوردر 7009",55,7009,7009,"Kitchen Towel","Kitchen Towel","Flat","Flat","50 X 70","50 X 70",70,70,200,"Very Light weight","dark","Second Choice","100% cotton","100% cotton","24/2 - 16/1","24/2 - 16/1","Fresh","Fresh",null,"محمود",0.55999999999999994,8,0.56000000000000005,"Dobby","Normal",null,null,null,null,null,null,"صرف","بيع محلى","2021/08/10",34,5]
[null,"0004 - 55","palm orange",9114000027,"مشكل عميل 55 اوردر 7009",55,7009,7009,"Kitchen Towel","Kitchen Towel","Flat","Flat","50 X 70","50 X 70",70,70,200,"Very Light weight","dark","Second Choice","100% cotton","100% cotton","24/2 - 16/1","24/2 - 16/1","Fresh","Fresh",null,"محمود",0.83999999999999975,12,0.84,"Dobby","Normal",null,null,null,null,null,null,"صرف","بيع محلى","2021/08/10",34,5]
[null,"0005 - 55","palm red",9114000028,"مشكل عميل 55 اوردر 7009",55,7009,7009,"Kitchen Towel","Kitchen Towel","Flat","Flat","50 X 70","50 X 70",70,70,200,"Very Light weight","dark","Second Choice","100% cotton","100% cotton","24/2 - 16/1","24/2 - 16/1","Fresh","Fresh",null,"محمود",2.0999999999999996,30,2.1,"Dobby","Normal",null,null,null,null,null,null,"صرف","بيع محلى","2021/08/10",34,5]
[null,"0006 - 55","palm Brown",9114000029,"مشكل عميل 55 اوردر 7009",55,7009,7009,"Kitchen Towel","Kitchen Towel","Flat","Flat","50 X 70","50 X 70",70,70,200,"Very Light weight","dark","Second Choice","100% cotton","100% cotton","24/2 - 16/1","24/2 - 16/1","Fresh","Fresh",null,"محمود",1.5399999999999996,22,1.54,"Dobby","Normal",null,null,null,null,null,null,"صرف","بيع محلى","2021/08/10",34,5]
[null,"0007 - 55","Moon - Blue",9114000030,"مشكل عميل 55 اوردر 7010",55,7010,7010,"Kitchen Towel","Kitchen Towel","Flat","Flat","50 X 70","50 X 70",70,70,200,"Very Light weight","dark","Second Choice","100% cotton","100% cotton","24/2 - 16/1","24/2 - 16/1","Fresh","Fresh",null,"محمود",28,400,28,"Dobby","Normal","اضافه","اضافه من المشغل","2021/08/10"]
[null,"0008 - 55","Moon - Red",9114000031,"مشكل عميل 55 اوردر 7010",55,7010,7010,"Kitchen Towel","Kitchen Towel","Flat","Flat","50 X 70","50 X 70",70,70,200,"Very Light weight","dark","Second Choice","100% cotton","100% cotton","24/2 - 16/1","24/2 - 16/1","Fresh","Fresh",null,"محمود",8.4,120,8.4,"Jacquard","Normal","اضافه","اضافه من المشغل","2021/08/10"]
[null,"0007 - 55","Moon - Blue",9114000030,"مشكل عميل 55 اوردر 7010",55,7010,7010,"Kitchen Towel","Kitchen Towel","Flat","Flat","50 X 70","50 X 70",70,70,200,"Very Light weight","dark","Second Choice","100% cotton","100% cotton","24/2 - 16/1","24/2 - 16/1","Fresh","Fresh",null,"محمود",28,400,28,"Dobby","Normal",null,null,null,null,null,null,"صرف","بيع محلى","2021/08/10",34,6]
[null,"0008 - 55","Moon - Red",9114000031,"مشكل عميل 55 اوردر 7010",55,7010,7010,"Kitchen Towel","Kitchen Towel","Flat","Flat","50 X 70","50 X 70",70,70,200,"Very Light weight","dark","Second Choice","100% cotton","100% cotton","24/2 - 16/1","24/2 - 16/1","Fresh","Fresh",null,"محمود",8.4,120,8.4,"Jacquard","Normal",null,null,null,null,null,null,"صرف","بيع محلى","2021/08/10",34,6]
[null,"0007 - 55","Moon - Blue",9114000030,"مشكل عميل 55 اوردر 7010",55,7010,7010,"Kitchen Towel","Kitchen Towel","Flat","Flat","50 X 70","50 X 70",70,70,200,"Very Light weight","dark","Second Choice","100% cotton","100% cotton","24/2 - 16/1","24/2 - 16/1","Fresh","Fresh",null,"محمود",70,1000,70,"Dobby","Normal","اضافه","اضافه من المشغل","2021/08/10"]
[null,"0007 - 55","Moon - Blue",9114000030,"مشكل عميل 55 اوردر 7010",55,7010,7010,"Kitchen Towel","Kitchen Towel","Flat","Flat","50 X 70","50 X 70",70,70,200,"Very Light weight","dark","Second Choice","100% cotton","100% cotton","24/2 - 16/1","24/2 - 16/1","Fresh","Fresh",null,"محمود",70,1000,70,"Dobby","Normal",null,null,null,null,null,null,"صرف","بيع محلى","2021/08/10",34,7]
[null,"0007 - 55","Moon - Blue",9114000030,"مشكل عميل 55 اوردر 7010",55,7010,7010,"Kitchen Towel","Kitchen Towel","Flat","Flat","50 X 70","50 X 70",70,70,200,"Very Light weight","dark","Second Choice","100% cotton","100% cotton","24/2 - 16/1","24/2 - 16/1","Fresh","Fresh",null,"محمود",70,100,7,"Dobby","Normal","اضافه","اضافه من المشغل","2021/08/10"]
[null,"0007 - 55","Moon - Blue",9114000030,"مشكل عميل 55 اوردر 7010",55,7010,7010,"Kitchen Towel","Kitchen Towel","Flat","Flat","50 X 70","50 X 70",70,70,200,"Very Light weight","dark","Second Choice","100% cotton","100% cotton","24/2 - 16/1","24/2 - 16/1","Fresh","Fresh",null,"محمود",70,100,7,"Dobby","Normal","اضافه","اضافه من المشغل","2021/08/10"]
[null,"0007 - 55","Moon - Blue",9114000030,"مشكل عميل 55 اوردر 7010",55,7010,7010,"Kitchen Towel","Kitchen Towel","Flat","Flat","50 X 70","50 X 70",70,70,200,"Very Light weight","dark","Second Choice","100% cotton","100% cotton","24/2 - 16/1","24/2 - 16/1","Fresh","Fresh",null,"محمود",70,100,7,"Dobby","Normal","اضافه","اضافه من المشغل","2021/08/10"]
[null,"0007 - 55","Moon - Blue",9114000030,"مشكل عميل 55 اوردر 7010",55,7010,7010,"Kitchen Towel","Kitchen Towel","Flat","Flat","50 X 70","50 X 70",70,70,200,"Very Light weight","dark","Second Choice","100% cotton","100% cotton","24/2 - 16/1","24/2 - 16/1","Fresh","Fresh",null,"محمود",70,100,7,"Dobby","Normal","اضافه","اضافه من المشغل","2021/08/10"]
[null,"0007 - 55","Moon - Blue",9114000030,"مشكل عميل 55 اوردر 7010",55,7010,7010,"Kitchen Towel","Kitchen Towel","Flat","Flat","50 X 70","50 X 70",70,70,200,"Very Light weight","dark","Second Choice","100% cotton","100% cotton","24/2 - 16/1","24/2 - 16/1","Fresh","Fresh",null,"محمود",70,100,7,"Dobby","Normal",null,null,null,null,null,null,"صرف","بيع محلى","2021/08/10",34,8]
[null,"0001 - 60","ttoo",9114000032,"مشكل عميل 60 اوردر 7011",60,7011,7011,"Kitchen Towel","Kitchen Towel","Flat","Flat","50 X 70","50 X 70",70,70,200,"Very Light weight","dark","Second Choice","100% cotton","100% cotton","24/2 - 16/1","24/2 - 16/1","Fresh","Fresh",null,"محمود",7,100,7,"Dobby","Normal","اضافه","اضافه من المشغل","2021/08/10"]
[null,"0002 - 60","cairo",9114000033,"مشكل عميل 60 اوردر 7011",60,7011,7011,"Kitchen Towel","Kitchen Towel","Flat","Flat","50 X 70","50 X 70",70,70,200,"Very Light weight","dark","Second Choice","100% cotton","100% cotton","24/2 - 16/1","24/2 - 16/1","Fresh","Fresh",null,"محمود",8.4,120,8.4,"Jacquard","Normal","اضافه","اضافه من المشغل","2021/08/10"]
[null,"0003 - 60","mansura",9114000034,"مشكل عميل 60 اوردر 7011",60,7011,7011,"Kitchen Towel","Kitchen Towel","Flat","Flat","50 X 70","50 X 70",70,70,200,"Very Light weight","dark","Second Choice","100% cotton","100% cotton","24/2 - 16/1","24/2 - 16/1","Fresh","Fresh",null,"محمود",2.1,30,2.1,"Jacquard","Normal","اضافه","اضافه من المشغل","2021/08/10"]
[null,"0004 - 60","mahalla",9114000035,"مشكل عميل 60 اوردر 7011",60,7011,7011,"Kitchen Towel","Kitchen Towel","Flat","Flat","50 X 70","50 X 70",70,70,200,"Very Light weight","dark","Second Choice","100% cotton","100% cotton","24/2 - 16/1","24/2 - 16/1","Fresh","Fresh",null,"محمود",1.05,15,1.05,"Dobby","Normal","اضافه","اضافه من المشغل","2021/08/10"]
[null,"0005 - 60","louxur",9114000036,"مشكل عميل 60 اوردر 7011",60,7011,7011,"Kitchen Towel","Kitchen Towel","Flat","Flat","50 X 70","50 X 70",70,70,200,"Very Light weight","dark","Second Choice","100% cotton","100% cotton","24/2 - 16/1","24/2 - 16/1","Fresh","Fresh",null,"محمود",0.7,10,0.7,"Dobby","Normal","اضافه","اضافه من المشغل","2021/08/10"]
[null,"0006 - 60","aswan",9114000037,"مشكل عميل 60 اوردر 7011",60,7011,7011,"Kitchen Towel","Kitchen Towel","Flat","Flat","50 X 70","50 X 70",70,70,200,"Very Light weight","dark","Second Choice","100% cotton","100% cotton","24/2 - 16/1","24/2 - 16/1","Fresh","Fresh",null,"محمود",1.75,25,1.75,"Jacquard","Normal","اضافه","اضافه من المشغل","2021/08/10"]
[null,"0001 - 60","ttoo",9114000032,"مشكل عميل 60 اوردر 7011",60,7011,7011,"Kitchen Towel","Kitchen Towel","Flat","Flat","50 X 70","50 X 70",70,70,200,"Very Light weight","dark","Second Choice","100% cotton","100% cotton","24/2 - 16/1","24/2 - 16/1","Fresh","Fresh",null,"محمود",21,220,15.4,"Dobby","Normal","اضافه","اضافه من المشغل","2021/08/10"]
[null,"0002 - 60","cairo",9114000033,"مشكل عميل 60 اوردر 7011",60,7011,7011,"Kitchen Towel","Kitchen Towel","Flat","Flat","50 X 70","50 X 70",70,70,200,"Very Light weight","dark","Second Choice","100% cotton","100% cotton","24/2 - 16/1","24/2 - 16/1","Fresh","Fresh",null,"محمود",21,318,22.26,"Jacquard","Normal","اضافه","اضافه من المشغل","2021/08/10"]
[null,"0001 - 60","ttoo",9114000032,"مشكل عميل 60 اوردر 7011",60,7011,7011,"Kitchen Towel","Kitchen Towel","Flat","Flat","50 X 70","50 X 70",70,70,200,"Very Light weight","dark","Second Choice","100% cotton","100% cotton","24/2 - 16/1","24/2 - 16/1","Fresh","Fresh",null,"محمود",7,100,7,"Dobby","Normal",null,null,null,null,null,null,"صرف","بيع محلى","2021/08/10",34,9]
[null,"0002 - 60","cairo",9114000033,"مشكل عميل 60 اوردر 7011",60,7011,7011,"Kitchen Towel","Kitchen Towel","Flat","Flat","50 X 70","50 X 70",70,70,200,"Very Light weight","dark","Second Choice","100% cotton","100% cotton","24/2 - 16/1","24/2 - 16/1","Fresh","Fresh",null,"محمود",8.4,120,8.4,"Jacquard","Normal",null,null,null,null,null,null,"صرف","بيع محلى","2021/08/10",34,9]
[null,"0003 - 60","mansura",9114000034,"مشكل عميل 60 اوردر 7011",60,7011,7011,"Kitchen Towel","Kitchen Towel","Flat","Flat","50 X 70","50 X 70",70,70,200,"Very Light weight","dark","Second Choice","100% cotton","100% cotton","24/2 - 16/1","24/2 - 16/1","Fresh","Fresh",null,"محمود",2.1,30,2.1,"Jacquard","Normal",null,null,null,null,null,null,"صرف","بيع محلى","2021/08/10",34,9]
[null,"0004 - 60","mahalla",9114000035,"مشكل عميل 60 اوردر 7011",60,7011,7011,"Kitchen Towel","Kitchen Towel","Flat","Flat","50 X 70","50 X 70",70,70,200,"Very Light weight","dark","Second Choice","100% cotton","100% cotton","24/2 - 16/1","24/2 - 16/1","Fresh","Fresh",null,"محمود",1.05,15,1.05,"Dobby","Normal",null,null,null,null,null,null,"صرف","بيع محلى","2021/08/10",34,9]
[null,"0005 - 60","louxur",9114000036,"مشكل عميل 60 اوردر 7011",60,7011,7011,"Kitchen Towel","Kitchen Towel","Flat","Flat","50 X 70","50 X 70",70,70,200,"Very Light weight","dark","Second Choice","100% cotton","100% cotton","24/2 - 16/1","24/2 - 16/1","Fresh","Fresh",null,"محمود",0.7,10,0.7,"Dobby","Normal",null,null,null,null,null,null,"صرف","بيع محلى","2021/08/10",34,9]
[null,"0006 - 60","aswan",9114000037,"مشكل عميل 60 اوردر 7011",60,7011,7011,"Kitchen Towel","Kitchen Towel","Flat","Flat","50 X 70","50 X 70",70,70,200,"Very Light weight","dark","Second Choice","100% cotton","100% cotton","24/2 - 16/1","24/2 - 16/1","Fresh","Fresh",null,"محمود",1.75,25,1.75,"Jacquard","Normal",null,null,null,null,null,null,"صرف","بيع محلى","2021/08/10",34,9]
[null,"0013 - 34","AAAA",9114000009,"مشكل عميل 34 اوردر 7002",34,7007,7007,"Kitchen Towel","Kitchen Towel","Flat","Flat","50 X 70","50 X 70",70,70,200,"Very Light weight","dark","Second Choice","100% cotton","100% cotton","24/2 - 16/1","24/2 - 16/1","Fresh","Fresh",null,"محمود",1.2,20,1.4,"Jacquard","Normal",null,null,null,null,null,null,"صرف","بيع محلى","2021/08/11",34,10]
[null,"0014 - 34","BBBB",9114000010,"مشكل عميل 34 اوردر 7002",34,7007,7007,"Kitchen Towel","Kitchen Towel","Flat","Flat","50 X 70","50 X 70",70,70,200,"Very Light weight","dark","Second Choice","100% cotton","100% cotton","24/2 - 16/1","24/2 - 16/1","Fresh","Fresh",null,"محمود",1.2,20,1.4,"Dobby","Normal",null,null,null,null,null,null,"صرف","بيع محلى","2021/08/11",34,10]
[null,"0015 - 34","CCCC",9114000011,"مشكل عميل 34 اوردر 7002",34,7007,7007,"Kitchen Towel","Kitchen Towel","Flat","Flat","50 X 70","50 X 70",70,70,200,"Very Light weight","dark","Second Choice","100% cotton","100% cotton","24/2 - 16/1","24/2 - 16/1","Fresh","Fresh",null,"محمود",1.8000000000000003,30,2.1,"Jacquard","Normal",null,null,null,null,null,null,"صرف","بيع محلى","2021/08/11",34,10]
[null,"0016 - 34","DDDD",9114000012,"مشكل عميل 34 اوردر 7002",34,7007,7007,"Kitchen Towel","Kitchen Towel","Flat","Flat","50 X 70","50 X 70",70,70,200,"Very Light weight","dark","Second Choice","100% cotton","100% cotton","24/2 - 16/1","24/2 - 16/1","Fresh","Fresh",null,"محمود",3,50,3.5,"Dobby","Normal",null,null,null,null,null,null,"صرف","بيع محلى","2021/08/11",34,10]
[null,"0017 - 34","EEEE",9114000013,"مشكل عميل 34 اوردر 7002",34,7007,7007,"Kitchen Towel","Kitchen Towel","Flat","Flat","50 X 70","50 X 70",70,70,200,"Very Light weight","dark","Second Choice","100% cotton","100% cotton","24/2 - 16/1","24/2 - 16/1","Fresh","Fresh",null,"محمود",0.6,10,0.7,"Dobby","Normal",null,null,null,null,null,null,"صرف","بيع محلى","2021/08/11",34,10]
[null,"0018 - 34","FFFFF",9114000014,"مشكل عميل 34 اوردر 7002",34,7007,7007,"Kitchen Towel","Kitchen Towel","Flat","Flat","50 X 70","50 X 70",70,70,200,"Very Light weight","dark","Second Choice","100% cotton","100% cotton","24/2 - 16/1","24/2 - 16/1","Fresh","Fresh",null,"محمود",1.5,25,1.75,"Jacquard","Normal",null,null,null,null,null,null,"صرف","بيع محلى","2021/08/11",34,10]
[null,"0019 - 34","GGGG",9114000015,"مشكل عميل 34 اوردر 7002",34,7007,7007,"Kitchen Towel","Kitchen Towel","Flat","Flat","50 X 70","50 X 70",70,70,200,"Very Light weight","dark","Second Choice","100% cotton","100% cotton","24/2 - 16/1","24/2 - 16/1","Fresh","Fresh",null,"محمود",1.5,25,1.75,"Dobby","Normal",null,null,null,null,null,null,"صرف","بيع محلى","2021/08/11",34,10]
[null,"0020 - 34","HHHHH",9114000016,"مشكل عميل 34 اوردر 7002",34,7007,7007,"Kitchen Towel","Kitchen Towel","Flat","Flat","50 X 70","50 X 70",70,70,200,"Very Light weight","dark","Second Choice","100% cotton","100% cotton","24/2 - 16/1","24/2 - 16/1","Fresh","Fresh",null,"محمود",0.6,10,0.7,"Dobby","Normal",null,null,null,null,null,null,"صرف","بيع محلى","2021/08/11",34,10]
[null,"0021 - 34","JJJJJJ",9114000017,"مشكل عميل 34 اوردر 7002",34,7007,7007,"Kitchen Towel","Kitchen Towel","Flat","Flat","50 X 70","50 X 70",70,70,200,"Very Light weight","dark","Second Choice","100% cotton","100% cotton","24/2 - 16/1","24/2 - 16/1","Fresh","Fresh",null,"محمود",0.6,10,0.7,"Jacquard","Normal",null,null,null,null,null,null,"صرف","بيع محلى","2021/08/11",34,10]
[null,"0002 - 34","lion - Blue",9114000002,"مشكل عميل 34 اوردر 7002",34,7002,7001,"Kitchen Towel","Kitchen Towel","Flat","Flat","50 X 70","50 X 70",75,8.7999999999999995E-2,250,"Light weight","dark","Second Choice","100% cotton","100% cotton - Organic","24/2 - 16/1","24/2 - 16/1","Fresh","Fresh",null,"محمود",1.6,20,1.5,0,"Normal",null,null,null,null,null,null,"صرف","بيع محلى","2021/08/11",45,11]
[null,"0001 - 34","lion - Brown","9114000001","مشكل عميل 34 اوردر 7002",34,7002,7001,"Kitchen Towel","Kitchen Towel","Flat","Flat","50 X 70","50 X 70",75,8.7999999999999995E-2,250,"Light weight","dark","Second Choice","100% cotton","100% cotton - Organic","24/2 - 16/1","24/2 - 16/1","Fresh","Fresh",null,"محمود",1.6,20,1.5,0,"Normal",null,null,null,null,null,null,"صرف","بيع محلى","2021/08/11",45,11]
[null,"0003 - 34","tiger - yellow","9112000001","مشكل عميل 34 اوردر 7002",34,7002,7001,"Kitchen Towel","Beach Towel","Flat","Velour","50 X 70","100 x 170",75,0.71399999999999997,420,"Medium weight","dark","Second Choice","100% cotton","100% cotton - Organic","24/2 - 16/1","24/2 - 24/2 - 16/1","Fresh","Fresh",null,"محمود",2.4,30,2.25,0,"Normal",null,null,null,null,null,null,"صرف","بيع محلى","2021/08/11",45,11]
[null,"0004 - 34","tiger - Orange",9112000002,"مشكل عميل 34 اوردر 7002",34,7002,7001,"Kitchen Towel","Beach Towel","Flat","Velour","50 X 70","100 x 170",75,0.71399999999999997,420,"Medium weight","dark","Second Choice","100% cotton","100% cotton - Organic","24/2 - 16/1","24/2 - 24/2 - 16/1","Fresh","Fresh",null,"محمود",4,50,3.75,0,"Normal",null,null,null,null,null,null,"صرف","بيع محلى","2021/08/11",45,11]
[null,"0005 - 34","sun - red",9112000003,"مشكل عميل 34 اوردر 7002",34,7002,7002,"Kitchen Towel","Beach Towel","Flat","Velour","50 X 70","90 x 160",75,0.57599999999999996,400,"Medium weight","dark","Second Choice","100% cotton","100% cotton","24/2 - 16/1","24/2 - 24/2 - 16/1","Fresh","Fresh",null,"محمود",0.8,10,0.75,0,"Normal",null,null,null,null,null,null,"صرف","بيع محلى","2021/08/11",45,11]
[null,"0006 - 34","sun - orange",9112000004,"مشكل عميل 34 اوردر 7002",34,7002,7002,"Kitchen Towel","Beach Towel","Flat","Velour","50 X 70","90 x 160",75,0.57599999999999996,400,"Medium weight","dark","Second Choice","100% cotton","100% cotton","24/2 - 16/1","24/2 - 24/2 - 16/1","Fresh","Fresh",null,"محمود",2,25,1.875,"DOBBY","Normal",null,null,null,null,null,null,"صرف","بيع محلى","2021/08/11",45,11]
[null,"0007 - 34","LOO",9114000003,"مشكل عميل 34 اوردر 7002",34,7002,7003,"Kitchen Towel","Kitchen Towel","Flat","Flat","50 X 70","50 X 70",75,7.0000000000000007E-2,200,"Very Light weight","dark","Second Choice","100% cotton","100% cotton","24/2 - 16/1","24/2 - 16/1","Fresh","Fresh",null,"محمود",2,25,1.875,"Jacquard","Normal",null,null,null,null,null,null,"صرف","بيع محلى","2021/08/11",45,11]
[null,"0008 - 34","TOO",9114000004,"مشكل عميل 34 اوردر 7002",34,7002,7003,"Kitchen Towel","Kitchen Towel","Flat","Flat","50 X 70","50 X 70",75,7.0000000000000007E-2,200,"Very Light weight","dark","Second Choice","100% cotton","100% cotton","24/2 - 16/1","24/2 - 16/1","Fresh","Fresh",null,"محمود",0.8,10,0.75,"Jacquard","Normal",null,null,null,null,null,null,"صرف","بيع محلى","2021/08/11",45,11]
[null,"0010 - 34","BOO",9114000006,"مشكل عميل 34 اوردر 7002",34,7002,7003,"Kitchen Towel","Kitchen Towel","Flat","Flat","50 X 70","50 X 70",75,7.0000000000000007E-2,200,"Very Light weight","dark","Second Choice","100% cotton","100% cotton","24/2 - 16/1","24/2 - 16/1","Fresh","Fresh",null,"محمود",0.8,10,0.75,"Jacquard","Normal",null,null,null,null,null,null,"صرف","بيع محلى","2021/08/11",45,11]
[null,"0013 - 34","AAAA",9114000009,"مشكل عميل 34 اوردر 7002",34,7007,7007,"Kitchen Towel","Kitchen Towel","Flat","Flat","50 X 70","50 X 70",70,70,200,"Very Light weight","dark","Second Choice","100% cotton","100% cotton","24/2 - 16/1","24/2 - 16/1","Fresh","Fresh",null,"محمود",1.8633540372670809,20,1.4,"Jacquard","Normal",null,null,null,null,null,null,"صرف","بيع محلى","2021/08/11",33,12]
[null,"0014 - 34","BBBB",9114000010,"مشكل عميل 34 اوردر 7002",34,7007,7007,"Kitchen Towel","Kitchen Towel","Flat","Flat","50 X 70","50 X 70",70,70,200,"Very Light weight","dark","Second Choice","100% cotton","100% cotton","24/2 - 16/1","24/2 - 16/1","Fresh","Fresh",null,"محمود",2.7950310559006217,30,2.1,"Dobby","Normal",null,null,null,null,null,null,"صرف","بيع محلى","2021/08/11",33,12]
[null,"0015 - 34","CCCC",9114000011,"مشكل عميل 34 اوردر 7002",34,7007,7007,"Kitchen Towel","Kitchen Towel","Flat","Flat","50 X 70","50 X 70",70,70,200,"Very Light weight","dark","Second Choice","100% cotton","100% cotton","24/2 - 16/1","24/2 - 16/1","Fresh","Fresh",null,"محمود",2.7950310559006217,30,2.1,"Jacquard","Normal",null,null,null,null,null,null,"صرف","بيع محلى","2021/08/11",33,12]
[null,"0016 - 34","DDDD",9114000012,"مشكل عميل 34 اوردر 7002",34,7007,7007,"Kitchen Towel","Kitchen Towel","Flat","Flat","50 X 70","50 X 70",70,70,200,"Very Light weight","dark","Second Choice","100% cotton","100% cotton","24/2 - 16/1","24/2 - 16/1","Fresh","Fresh",null,"محمود",1.1180124223602486,12,0.84,"Dobby","Normal",null,null,null,null,null,null,"صرف","بيع محلى","2021/08/11",33,12]
[null,"0017 - 34","EEEE",9114000013,"مشكل عميل 34 اوردر 7002",34,7007,7007,"Kitchen Towel","Kitchen Towel","Flat","Flat","50 X 70","50 X 70",70,70,200,"Very Light weight","dark","Second Choice","100% cotton","100% cotton","24/2 - 16/1","24/2 - 16/1","Fresh","Fresh",null,"محمود",0.93167701863354047,10,0.7,"Dobby","Normal",null,null,null,null,null,null,"صرف","بيع محلى","2021/08/11",33,12]
[null,"0018 - 34","FFFFF",9114000014,"مشكل عميل 34 اوردر 7002",34,7007,7007,"Kitchen Towel","Kitchen Towel","Flat","Flat","50 X 70","50 X 70",70,70,200,"Very Light weight","dark","Second Choice","100% cotton","100% cotton","24/2 - 16/1","24/2 - 16/1","Fresh","Fresh",null,"محمود",1.3043478260869568,14,0.98,"Jacquard","Normal",null,null,null,null,null,null,"صرف","بيع محلى","2021/08/11",33,12]
[null,"0019 - 34","GGGG",9114000015,"مشكل عميل 34 اوردر 7002",34,7007,7007,"Kitchen Towel","Kitchen Towel","Flat","Flat","50 X 70","50 X 70",70,70,200,"Very Light weight","dark","Second Choice","100% cotton","100% cotton","24/2 - 16/1","24/2 - 16/1","Fresh","Fresh",null,"محمود",2.329192546583851,25,1.75,"Dobby","Normal",null,null,null,null,null,null,"صرف","بيع محلى","2021/08/11",33,12]
[null,"0020 - 34","HHHHH",9114000016,"مشكل عميل 34 اوردر 7002",34,7007,7007,"Kitchen Towel","Kitchen Towel","Flat","Flat","50 X 70","50 X 70",70,70,200,"Very Light weight","dark","Second Choice","100% cotton","100% cotton","24/2 - 16/1","24/2 - 16/1","Fresh","Fresh",null,"محمود",0.93167701863354047,10,0.7,"Dobby","Normal",null,null,null,null,null,null,"صرف","بيع محلى","2021/08/11",33,12]
[null,"0021 - 34","JJJJJJ",9114000017,"مشكل عميل 34 اوردر 7002",34,7007,7007,"Kitchen Towel","Kitchen Towel","Flat","Flat","50 X 70","50 X 70",70,70,200,"Very Light weight","dark","Second Choice","100% cotton","100% cotton","24/2 - 16/1","24/2 - 16/1","Fresh","Fresh",null,"محمود",0.93167701863354047,10,0.7,"Jacquard","Normal",null,null,null,null,null,null,"صرف","بيع محلى","2021/08/11",33,12]
[null,"0001 - 75","frgg",9114000001,"yhy",75,7015,7015,"Kitchen Towel","Kitchen Towel","Flat","Flat","50 X 70","50 X 70",60.9,70,200,"Very Light weight","dark","Second Choice","100% cotton","100% cotton","24/2 - 16/1","24/2 - 16/1","Fresh","Fresh",null,"محمود",14.022988505747128,200,14,"Dobby","Normal","اضافه","اضافه من المشغل","2021/08/11"]
[null,"0002 - 75","dfgdfg",9114000002,"yhy",75,7015,7015,"Kitchen Towel","Kitchen Towel","Flat","Flat","40 x 60","40 x 60",60.9,48,200,"Very Light weight","dark","Second Choice","100% cotton","100% cotton","24/2 - 16/1","24/2 - 16/1","Fresh","Fresh",null,"محمود",14.423645320197046,300,14.4,"Jacquard","Normal","اضافه","اضافه من المشغل","2021/08/11"]
[null,"0003 - 75","dfgdfg",9114000003,"yhy",75,7015,7015,"Kitchen Towel","Kitchen Towel","Flat","Flat","50 x 65","50 x 65",60.9,65,200,"Very Light weight","dark","Second Choice","100% cotton","100% cotton","24/2 - 16/1","24/2 - 16/1","Fresh","Fresh",null,"محمود",32.553366174055832,500,32.5,"Jacquard","Normal","اضافه","اضافه من المشغل","2021/08/11"]
[null,"0001 - 75","frgg",9114000001,"yhy",75,7015,7015,"Kitchen Towel","Kitchen Towel","Flat","Flat","50 X 70","50 X 70",60.9,70,200,"Very Light weight","dark","Second Choice","100% cotton","100% cotton","24/2 - 16/1","24/2 - 16/1","Fresh","Fresh",null,"محمود",14.022988505747128,200,14,"Dobby","Normal",null,null,null,null,null,null,"صرف","بيع محلى","2021/08/11",34,13]
[null,"0002 - 75","dfgdfg",9114000002,"yhy",75,7015,7015,"Kitchen Towel","Kitchen Towel","Flat","Flat","40 x 60","40 x 60",60.9,48,200,"Very Light weight","dark","Second Choice","100% cotton","100% cotton","24/2 - 16/1","24/2 - 16/1","Fresh","Fresh",null,"محمود",14.423645320197046,300,14.4,"Jacquard","Normal",null,null,null,null,null,null,"صرف","بيع محلى","2021/08/11",34,13]
[null,"0003 - 75","dfgdfg",9114000003,"yhy",75,7015,7015,"Kitchen Towel","Kitchen Towel","Flat","Flat","50 x 65","50 x 65",60.9,65,200,"Very Light weight","dark","Second Choice","100% cotton","100% cotton","24/2 - 16/1","24/2 - 16/1","Fresh","Fresh",null,"محمود",32.553366174055832,500,32.5,"Jacquard","Normal",null,null,null,null,null,null,"صرف","بيع محلى","2021/08/11",34,13]
[null,"0002 - 34","lion - Blue",9114000002,"مشكل عميل 34 اوردر 7002",34,7002,7001,"Kitchen Towel","Kitchen Towel","Flat","Flat","50 X 70","50 X 70",75,8.7999999999999995E-2,250,"Light weight","dark","Second Choice","100% cotton","100% cotton - Organic","24/2 - 16/1","24/2 - 16/1","Fresh","Fresh",null,"محمود",16,20,1.5,0,"Normal",null,null,null,null,null,null,"صرف","تصدير","2021/08/11",53,14]
[null,"0001 - 34","lion - Brown","9114000001","مشكل عميل 34 اوردر 7002",34,7002,7001,"Kitchen Towel","Kitchen Towel","Flat","Flat","50 X 70","50 X 70",75,8.7999999999999995E-2,250,"Light weight","dark","Second Choice","100% cotton","100% cotton - Organic","24/2 - 16/1","24/2 - 16/1","Fresh","Fresh",null,"محمود",16,20,1.5,0,"Normal",null,null,null,null,null,null,"صرف","تصدير","2021/08/11",53,14]
[null,"0003 - 34","tiger - yellow","9112000001","مشكل عميل 34 اوردر 7002",34,7002,7001,"Kitchen Towel","Beach Towel","Flat","Velour","50 X 70","100 x 170",75,0.71399999999999997,420,"Medium weight","dark","Second Choice","100% cotton","100% cotton - Organic","24/2 - 16/1","24/2 - 24/2 - 16/1","Fresh","Fresh",null,"محمود",16,30,2.25,0,"Normal",null,null,null,null,null,null,"صرف","تصدير","2021/08/11",53,14]
[null,"0004 - 34","tiger - Orange",9112000002,"مشكل عميل 34 اوردر 7002",34,7002,7001,"Kitchen Towel","Beach Towel","Flat","Velour","50 X 70","100 x 170",75,0.71399999999999997,420,"Medium weight","dark","Second Choice","100% cotton","100% cotton - Organic","24/2 - 16/1","24/2 - 24/2 - 16/1","Fresh","Fresh",null,"محمود",16,50,3.75,0,"Normal",null,null,null,null,null,null,"صرف","تصدير","2021/08/11",53,14]
[null,"0005 - 34","sun - red",9112000003,"مشكل عميل 34 اوردر 7002",34,7002,7002,"Kitchen Towel","Beach Towel","Flat","Velour","50 X 70","90 x 160",75,0.57599999999999996,400,"Medium weight","dark","Second Choice","100% cotton","100% cotton","24/2 - 16/1","24/2 - 24/2 - 16/1","Fresh","Fresh",null,"محمود",16,10,0.75,0,"Normal",null,null,null,null,null,null,"صرف","تصدير","2021/08/11",53,14]
[null,"0006 - 34","sun - orange",9112000004,"مشكل عميل 34 اوردر 7002",34,7002,7002,"Kitchen Towel","Beach Towel","Flat","Velour","50 X 70","90 x 160",75,0.57599999999999996,400,"Medium weight","dark","Second Choice","100% cotton","100% cotton","24/2 - 16/1","24/2 - 24/2 - 16/1","Fresh","Fresh",null,"محمود",16,25,1.875,"DOBBY","Normal",null,null,null,null,null,null,"صرف","تصدير","2021/08/11",53,14]
[null,"0007 - 34","LOO",9114000003,"مشكل عميل 34 اوردر 7002",34,7002,7003,"Kitchen Towel","Kitchen Towel","Flat","Flat","50 X 70","50 X 70",75,7.0000000000000007E-2,200,"Very Light weight","dark","Second Choice","100% cotton","100% cotton","24/2 - 16/1","24/2 - 16/1","Fresh","Fresh",null,"محمود",16,25,1.875,"Jacquard","Normal",null,null,null,null,null,null,"صرف","تصدير","2021/08/11",53,14]
[null,"0008 - 34","TOO",9114000004,"مشكل عميل 34 اوردر 7002",34,7002,7003,"Kitchen Towel","Kitchen Towel","Flat","Flat","50 X 70","50 X 70",75,7.0000000000000007E-2,200,"Very Light weight","dark","Second Choice","100% cotton","100% cotton","24/2 - 16/1","24/2 - 16/1","Fresh","Fresh",null,"محمود",16,10,0.75,"Jacquard","Normal",null,null,null,null,null,null,"صرف","تصدير","2021/08/11",53,14]
[null,"0010 - 34","BOO",9114000006,"مشكل عميل 34 اوردر 7002",34,7002,7003,"Kitchen Towel","Kitchen Towel","Flat","Flat","50 X 70","50 X 70",75,7.0000000000000007E-2,200,"Very Light weight","dark","Second Choice","100% cotton","100% cotton","24/2 - 16/1","24/2 - 16/1","Fresh","Fresh",null,"محمود",16,10,0.75,"Jacquard","Normal",null,null,null,null,null,null,"صرف","تصدير","2021/08/11",53,14]
[null,"0009 - 75","dfgdfg",9114000009,"بيبل",75,7015,7015,"Kitchen Towel","Kitchen Towel","Flat","Flat","50 x 65","50 x 65",65.000000000000014,65,200,"Very Light weight","dark","Second Choice","100% cotton","100% cotton","24/2 - 16/1","24/2 - 16/1","Fresh","Fresh",null,"بل",1.3793103448275861,20,1.3,"Jacquard","Normal","اضافه","اضافه من المشغل","2021/08/12"]
[null,"0003 - 75","dfgdfg",9114000003,"بيبل",75,7015,7015,"Kitchen Towel","Kitchen Towel","Flat","Flat","50 x 65","50 x 65",65.000000000000014,65,200,"Very Light weight","dark","Second Choice","100% cotton","100% cotton","24/2 - 16/1","24/2 - 16/1","Fresh","Fresh",null,"بل",2.7586206896551722,40,2.6,"Jacquard","Normal","اضافه","اضافه من المشغل","2021/08/12"]
[null,"0005 - 75","dfgdfg",9114000005,"بيبل",75,7015,7015,"Kitchen Towel","Kitchen Towel","Flat","Flat","50 x 65","50 x 65",65.000000000000014,65,200,"Very Light weight","dark","Second Choice","100% cotton","100% cotton","24/2 - 16/1","24/2 - 16/1","Fresh","Fresh",null,"بل",0.82758620689655171,12,0.78,"Jacquard","Normal","اضافه","اضافه من المشغل","2021/08/12"]
[null,"0008 - 75","dfgdfg",9114000008,"بيبل",75,7015,7015,"Kitchen Towel","Kitchen Towel","Flat","Flat","50 x 65","50 x 65",65.000000000000014,65,200,"Very Light weight","dark","Second Choice","100% cotton","100% cotton","24/2 - 16/1","24/2 - 16/1","Fresh","Fresh",null,"بل",0.55172413793103448,8,0.52,"Jacquard","Normal","اضافه","اضافه من المشغل","2021/08/12"]
[null,"0006 - 75","dfgdfg",9114000006,"بيبل",75,7015,7015,"Kitchen Towel","Kitchen Towel","Flat","Flat","50 x 65","50 x 65",65.000000000000014,65,200,"Very Light weight","dark","Second Choice","100% cotton","100% cotton","24/2 - 16/1","24/2 - 16/1","Fresh","Fresh",null,"بل",0.48275862068965514,7,0.45500000000000002,"Jacquard","Normal","اضافه","اضافه من المشغل","2021/08/12"]
[null,"0002 - 75","dfgdfg",9114000002,"يبليل",75,7015,7015,"Kitchen Towel","Kitchen Towel","Flat","Flat","40 x 60","40 x 60",62.243243243243242,48,200,"Very Light weight","dark","Second Choice","100% cotton","100% cotton","24/2 - 16/1","24/2 - 16/1","Fresh","Fresh",null,"سيسب",0.62527138514980463,12,0.57599999999999996,"Jacquard","Normal","اضافه","اضافه من المشغل","2021/08/12"]
[null,"0003 - 75","dfgdfg",9114000003,"يبليل",75,7015,7015,"Kitchen Towel","Kitchen Towel","Flat","Flat","50 x 65","50 x 65",62.243243243243242,65,200,"Very Light weight","dark","Second Choice","100% cotton","100% cotton","24/2 - 16/1","24/2 - 16/1","Fresh","Fresh",null,"سيسب",1.0584020842379505,15,0.97499999999999998,"Jacquard","Normal","اضافه","اضافه من المشغل","2021/08/12"]
[null,"0005 - 75","dfgdfg",9114000005,"يبليل",75,7015,7015,"Kitchen Towel","Kitchen Towel","Flat","Flat","50 x 65","50 x 65",62.243243243243242,65,200,"Very Light weight","dark","Second Choice","100% cotton","100% cotton","24/2 - 16/1","24/2 - 16/1","Fresh","Fresh",null,"سيسب",1.199522362136344,17,1.105,"Jacquard","Normal","اضافه","اضافه من المشغل","2021/08/12"]
[null,"0009 - 75","dfgdfg",9114000009,"يبليل",75,7015,7015,"Kitchen Towel","Kitchen Towel","Flat","Flat","50 x 65","50 x 65",62.243243243243242,65,200,"Very Light weight","dark","Second Choice","100% cotton","100% cotton","24/2 - 16/1","24/2 - 16/1","Fresh","Fresh",null,"سيسب",2.1168041684759009,30,1.95,"Jacquard","Normal","اضافه","اضافه من المشغل","2021/08/12"]
[null,"0002 - 75","dfgdfg",9114000002,"يبليل",75,7015,7015,"Kitchen Towel","Kitchen Towel","Flat","Flat","40 x 60","40 x 60",62.243243243243242,48,200,"Very Light weight","dark","Second Choice","100% cotton","100% cotton","24/2 - 16/1","24/2 - 16/1","Fresh","Fresh",null,"سيسب",0.62527138514980463,12,0.57599999999999996,"Jacquard","Normal",null,null,null,null,null,null,"صرف","بيع محلى","2021/08/12",34,15]
[null,"0003 - 75","dfgdfg",9114000003,"يبليل",75,7015,7015,"Kitchen Towel","Kitchen Towel","Flat","Flat","50 x 65","50 x 65",62.243243243243242,65,200,"Very Light weight","dark","Second Choice","100% cotton","100% cotton","24/2 - 16/1","24/2 - 16/1","Fresh","Fresh",null,"سيسب",1.0584020842379505,15,0.97499999999999998,"Jacquard","Normal",null,null,null,null,null,null,"صرف","بيع محلى","2021/08/12",34,15]
[null,"0005 - 75","dfgdfg",9114000005,"يبليل",75,7015,7015,"Kitchen Towel","Kitchen Towel","Flat","Flat","50 x 65","50 x 65",62.243243243243242,65,200,"Very Light weight","dark","Second Choice","100% cotton","100% cotton","24/2 - 16/1","24/2 - 16/1","Fresh","Fresh",null,"سيسب",1.199522362136344,17,1.105,"Jacquard","Normal",null,null,null,null,null,null,"صرف","بيع محلى","2021/08/12",34,15]
[null,"0009 - 75","dfgdfg",9114000009,"يبليل",75,7015,7015,"Kitchen Towel","Kitchen Towel","Flat","Flat","50 x 65","50 x 65",62.243243243243242,65,200,"Very Light weight","dark","Second Choice","100% cotton","100% cotton","24/2 - 16/1","24/2 - 16/1","Fresh","Fresh",null,"سيسب",2.1168041684759009,30,1.95,"Jacquard","Normal",null,null,null,null,null,null,"صرف","بيع محلى","2021/08/12",34,15]
[null,"0001 - 75","frgg",9114000001,"dfd",75,7015,7015,"Kitchen Towel","Kitchen Towel","Flat","Flat","50 X 70","50 X 70",70,70,200,"Very Light weight","dark","Second Choice","100% cotton","100% cotton","24/2 - 16/1","24/2 - 16/1","Fresh","Fresh",null,"jgj",35,500,35,"Dobby","Normal","اضافه","اضافه من المشغل","2021/08/12"]
[null,"0002 - 34","lion - Blue",9114000002,"مشكل عميل 34 اوردر 7002",34,7002,7001,"Kitchen Towel","Kitchen Towel","Flat","Flat","50 X 70","50 X 70",75,8.7999999999999995E-2,250,"Light weight","dark","Second Choice","100% cotton","100% cotton - Organic","24/2 - 16/1","24/2 - 16/1","Fresh","Fresh",null,"محمود",16,20,1.5,0,"Normal",null,null,null,null,null,null,"صرف","بيع محلى","2021/08/12",55,16]
[null,"0001 - 34","lion - Brown","9114000001","مشكل عميل 34 اوردر 7002",34,7002,7001,"Kitchen Towel","Kitchen Towel","Flat","Flat","50 X 70","50 X 70",75,8.7999999999999995E-2,250,"Light weight","dark","Second Choice","100% cotton","100% cotton - Organic","24/2 - 16/1","24/2 - 16/1","Fresh","Fresh",null,"محمود",16,20,1.5,0,"Normal",null,null,null,null,null,null,"صرف","بيع محلى","2021/08/12",55,16]
[null,"0003 - 34","tiger - yellow","9112000001","مشكل عميل 34 اوردر 7002",34,7002,7001,"Kitchen Towel","Beach Towel","Flat","Velour","50 X 70","100 x 170",75,0.71399999999999997,420,"Medium weight","dark","Second Choice","100% cotton","100% cotton - Organic","24/2 - 16/1","24/2 - 24/2 - 16/1","Fresh","Fresh",null,"محمود",16,30,2.25,0,"Normal",null,null,null,null,null,null,"صرف","بيع محلى","2021/08/12",55,16]
[null,"0004 - 34","tiger - Orange",9112000002,"مشكل عميل 34 اوردر 7002",34,7002,7001,"Kitchen Towel","Beach Towel","Flat","Velour","50 X 70","100 x 170",75,0.71399999999999997,420,"Medium weight","dark","Second Choice","100% cotton","100% cotton - Organic","24/2 - 16/1","24/2 - 24/2 - 16/1","Fresh","Fresh",null,"محمود",16,50,3.75,0,"Normal",null,null,null,null,null,null,"صرف","بيع محلى","2021/08/12",55,16]
[null,"0005 - 34","sun - red",9112000003,"مشكل عميل 34 اوردر 7002",34,7002,7002,"Kitchen Towel","Beach Towel","Flat","Velour","50 X 70","90 x 160",75,0.57599999999999996,400,"Medium weight","dark","Second Choice","100% cotton","100% cotton","24/2 - 16/1","24/2 - 24/2 - 16/1","Fresh","Fresh",null,"محمود",16,10,0.75,0,"Normal",null,null,null,null,null,null,"صرف","بيع محلى","2021/08/12",55,16]
[null,"0006 - 34","sun - orange",9112000004,"مشكل عميل 34 اوردر 7002",34,7002,7002,"Kitchen Towel","Beach Towel","Flat","Velour","50 X 70","90 x 160",75,0.57599999999999996,400,"Medium weight","dark","Second Choice","100% cotton","100% cotton","24/2 - 16/1","24/2 - 24/2 - 16/1","Fresh","Fresh",null,"محمود",16,25,1.875,"DOBBY","Normal",null,null,null,null,null,null,"صرف","بيع محلى","2021/08/12",55,16]
[null,"0007 - 34","LOO",9114000003,"مشكل عميل 34 اوردر 7002",34,7002,7003,"Kitchen Towel","Kitchen Towel","Flat","Flat","50 X 70","50 X 70",75,7.0000000000000007E-2,200,"Very Light weight","dark","Second Choice","100% cotton","100% cotton","24/2 - 16/1","24/2 - 16/1","Fresh","Fresh",null,"محمود",16,25,1.875,"Jacquard","Normal",null,null,null,null,null,null,"صرف","بيع محلى","2021/08/12",55,16]
[null,"0008 - 34","TOO",9114000004,"مشكل عميل 34 اوردر 7002",34,7002,7003,"Kitchen Towel","Kitchen Towel","Flat","Flat","50 X 70","50 X 70",75,7.0000000000000007E-2,200,"Very Light weight","dark","Second Choice","100% cotton","100% cotton","24/2 - 16/1","24/2 - 16/1","Fresh","Fresh",null,"محمود",16,10,0.75,"Jacquard","Normal",null,null,null,null,null,null,"صرف","بيع محلى","2021/08/12",55,16]
[null,"0010 - 34","BOO",9114000006,"مشكل عميل 34 اوردر 7002",34,7002,7003,"Kitchen Towel","Kitchen Towel","Flat","Flat","50 X 70","50 X 70",75,7.0000000000000007E-2,200,"Very Light weight","dark","Second Choice","100% cotton","100% cotton","24/2 - 16/1","24/2 - 16/1","Fresh","Fresh",null,"محمود",16,10,0.75,"Jacquard","Normal",null,null,null,null,null,null,"صرف","بيع محلى","2021/08/12",55,16]
[null,"0013 - 34","AAAA",9114000009,"مشكل عميل 34 اوردر 7002",34,7007,7007,"Kitchen Towel","Kitchen Towel","Flat","Flat","50 X 70","50 X 70",70,70,200,"Very Light weight","dark","Second Choice","100% cotton","100% cotton","24/2 - 16/1","24/2 - 16/1","Fresh","Fresh",null,"محمود",1.2,20,1.4,"Jacquard","Normal",null,null,null,null,null,null,"صرف","بيع محلى","2021/08/12",55,16]
[null,"0014 - 34","BBBB",9114000010,"مشكل عميل 34 اوردر 7002",34,7007,7007,"Kitchen Towel","Kitchen Towel","Flat","Flat","50 X 70","50 X 70",70,70,200,"Very Light weight","dark","Second Choice","100% cotton","100% cotton","24/2 - 16/1","24/2 - 16/1","Fresh","Fresh",null,"محمود",1.2,20,1.4,"Dobby","Normal",null,null,null,null,null,null,"صرف","بيع محلى","2021/08/12",55,16]
[null,"0015 - 34","CCCC",9114000011,"مشكل عميل 34 اوردر 7002",34,7007,7007,"Kitchen Towel","Kitchen Towel","Flat","Flat","50 X 70","50 X 70",70,70,200,"Very Light weight","dark","Second Choice","100% cotton","100% cotton","24/2 - 16/1","24/2 - 16/1","Fresh","Fresh",null,"محمود",1.8000000000000003,30,2.1,"Jacquard","Normal",null,null,null,null,null,null,"صرف","بيع محلى","2021/08/12",55,16]
[null,"0016 - 34","DDDD",9114000012,"مشكل عميل 34 اوردر 7002",34,7007,7007,"Kitchen Towel","Kitchen Towel","Flat","Flat","50 X 70","50 X 70",70,70,200,"Very Light weight","dark","Second Choice","100% cotton","100% cotton","24/2 - 16/1","24/2 - 16/1","Fresh","Fresh",null,"محمود",3,50,3.5,"Dobby","Normal",null,null,null,null,null,null,"صرف","بيع محلى","2021/08/12",55,16]
[null,"0017 - 34","EEEE",9114000013,"مشكل عميل 34 اوردر 7002",34,7007,7007,"Kitchen Towel","Kitchen Towel","Flat","Flat","50 X 70","50 X 70",70,70,200,"Very Light weight","dark","Second Choice","100% cotton","100% cotton","24/2 - 16/1","24/2 - 16/1","Fresh","Fresh",null,"محمود",0.6,10,0.7,"Dobby","Normal",null,null,null,null,null,null,"صرف","بيع محلى","2021/08/12",55,16]
[null,"0018 - 34","FFFFF",9114000014,"مشكل عميل 34 اوردر 7002",34,7007,7007,"Kitchen Towel","Kitchen Towel","Flat","Flat","50 X 70","50 X 70",70,70,200,"Very Light weight","dark","Second Choice","100% cotton","100% cotton","24/2 - 16/1","24/2 - 16/1","Fresh","Fresh",null,"محمود",1.5,25,1.75,"Jacquard","Normal",null,null,null,null,null,null,"صرف","بيع محلى","2021/08/12",55,16]
[null,"0019 - 34","GGGG",9114000015,"مشكل عميل 34 اوردر 7002",34,7007,7007,"Kitchen Towel","Kitchen Towel","Flat","Flat","50 X 70","50 X 70",70,70,200,"Very Light weight","dark","Second Choice","100% cotton","100% cotton","24/2 - 16/1","24/2 - 16/1","Fresh","Fresh",null,"محمود",1.5,25,1.75,"Dobby","Normal",null,null,null,null,null,null,"صرف","بيع محلى","2021/08/12",55,16]
[null,"0020 - 34","HHHHH",9114000016,"مشكل عميل 34 اوردر 7002",34,7007,7007,"Kitchen Towel","Kitchen Towel","Flat","Flat","50 X 70","50 X 70",70,70,200,"Very Light weight","dark","Second Choice","100% cotton","100% cotton","24/2 - 16/1","24/2 - 16/1","Fresh","Fresh",null,"محمود",0.6,10,0.7,"Dobby","Normal",null,null,null,null,null,null,"صرف","بيع محلى","2021/08/12",55,16]
[null,"0021 - 34","JJJJJJ",9114000017,"مشكل عميل 34 اوردر 7002",34,7007,7007,"Kitchen Towel","Kitchen Towel","Flat","Flat","50 X 70","50 X 70",70,70,200,"Very Light weight","dark","Second Choice","100% cotton","100% cotton","24/2 - 16/1","24/2 - 16/1","Fresh","Fresh",null,"محمود",0.6,10,0.7,"Jacquard","Normal",null,null,null,null,null,null,"صرف","بيع محلى","2021/08/12",55,16]
[null,"0001 - 75","frgg",9114000001,"dssse",75,7015,7015,"Kitchen Towel","Kitchen Towel","Flat","Flat","50 X 70","50 X 70",69.999999999999986,70,200,"Very Light weight","dark","Second Choice","100% cotton","100% cotton","24/2 - 16/1","24/2 - 16/1","Fresh","Fresh",null,"dgd",9,122,8.5399999999999991,"Dobby","Normal","اضافه","اضافه من المشغل","2021/08/12"]
[null,"0001 - 75","frgg",9114000001,"sd",75,7015,7015,"Kitchen Towel","Kitchen Towel","Flat","Flat","50 X 70","50 X 70",69.999999999999986,70,200,"Very Light weight","dark","Second Choice","100% cotton","100% cotton","24/2 - 16/1","24/2 - 16/1","Fresh","Fresh",null,"sdf",5.5,78,5.46,"Dobby","Normal","اضافه","اضافه من المشغل","2021/08/12"]
[null,"0001 - 44","Elephnt",9114000018,"مشكل عميل 44 اوردر 7008",44,7008,7008,"Kitchen Towel","Kitchen Towel","Flat","Flat","50 X 70","50 X 70",70,70,200,"Very Light weight","dark","Second Choice","100% cotton","100% cotton","24/2 - 16/1","24/2 - 16/1","Fresh","Fresh",null,"محمود",7.2727272727272716,100,7,"Dobby","Normal",null,null,null,null,null,null,"صرف","بيع محلى","2021/08/12",33,17]
[null,"0002 - 44","BroB",9114000019,"مشكل عميل 44 اوردر 7008",44,7008,7008,"Kitchen Towel","Kitchen Towel","Flat","Flat","50 X 70","50 X 70",70,70,200,"Very Light weight","dark","Second Choice","100% cotton","100% cotton","24/2 - 16/1","24/2 - 16/1","Fresh","Fresh",null,"محمود",10.909090909090908,150,10.5,"Dobby","Normal",null,null,null,null,null,null,"صرف","بيع محلى","2021/08/12",33,17]
[null,"0003 - 44","hgh",9114000020,"مشكل عميل 44 اوردر 7008",44,7008,7008,"Kitchen Towel","Kitchen Towel","Flat","Flat","50 X 70","50 X 70",70,70,200,"Very Light weight","dark","Second Choice","100% cotton","100% cotton","24/2 - 16/1","24/2 - 16/2","Fresh","Fresh",null,"محمود",14.545454545454543,200,14,"Jacquard","Normal",null,null,null,null,null,null,"صرف","بيع محلى","2021/08/12",33,17]
[null,"0004 - 44","yurturhy",9114000021,"مشكل عميل 44 اوردر 7008",44,7008,7008,"Kitchen Towel","Kitchen Towel","Flat","Flat","50 X 70","50 X 70",70,70,200,"Very Light weight","dark","Second Choice","100% cotton","100% cotton","24/2 - 16/1","24/2 - 16/3","Fresh","Fresh",null,"محمود",21.818181818181817,300,21,"Jacquard","Normal",null,null,null,null,null,null,"صرف","بيع محلى","2021/08/12",33,17]
[null,"0005 - 44","dytrto",9114000022,"مشكل عميل 44 اوردر 7008",44,7008,7008,"Kitchen Towel","Kitchen Towel","Flat","Flat","50 X 70","50 X 70",70,70,200,"Very Light weight","dark","Second Choice","100% cotton","100% cotton","24/2 - 16/1","24/2 - 16/4","Fresh","Fresh",null,"محمود",29.090909090909086,400,28,"Jacquard","Normal",null,null,null,null,null,null,"صرف","بيع محلى","2021/08/12",33,17]
[null,"0006 - 44","srttLLLLl",9114000023,"مشكل عميل 44 اوردر 7008",44,7008,7008,"Kitchen Towel","Kitchen Towel","Flat","Flat","50 X 70","50 X 70",70,70,200,"Very Light weight","dark","Second Choice","100% cotton","100% cotton","24/2 - 16/1","24/2 - 16/5","Fresh","Fresh",null,"محمود",36.36363636363636,500,35,"Jacquard","Normal",null,null,null,null,null,null,"صرف","بيع محلى","2021/08/12",33,17]
[null,"0001 - 44","Elephnt",9114000018,"مشكل عميل 44 اوردر 7008",44,7008,7008,"Kitchen Towel","Kitchen Towel","Flat","Flat","50 X 70","50 X 70",70,70,200,"Very Light weight","dark","Second Choice","100% cotton","100% cotton","24/2 - 16/1","24/2 - 16/1","Fresh","Fresh",null,"محمود",17.5,250,17.5,"Dobby","Normal",null,null,null,null,null,null,"صرف","بيع محلى","2021/08/12",33,17]
[null,"0001 - 44","Elephnt",9114000018,"مشكل عميل 44 اوردر 7008",44,7008,7008,"Kitchen Towel","Kitchen Towel","Flat","Flat","50 X 70","50 X 70",70,70,200,"Very Light weight","dark","Second Choice","100% cotton","100% cotton","24/2 - 16/1","24/2 - 16/1","Fresh","Fresh",null,"محمود",28,400,28,"Dobby","Normal",null,null,null,null,null,null,"صرف","بيع محلى","2021/08/12",33,17]
[null,"0001 - 44","Elephnt",9114000018,"مشكل عميل 44 اوردر 7008",44,7008,7008,"Kitchen Towel","Kitchen Towel","Flat","Flat","50 X 70","50 X 70",70,70,200,"Very Light weight","dark","Second Choice","100% cotton","100% cotton","24/2 - 16/1","24/2 - 16/1","Fresh","Fresh",null,"محمود",56,800,56,"Dobby","Normal",null,null,null,null,null,null,"صرف","تصدير","2021/08/12",33,18]
[null,"0001 - 75","frgg",9114000001,"sd",75,7015,7015,"Kitchen Towel","Kitchen Towel","Flat","Flat","50 X 70","50 X 70",69.999999999999986,70,200,"Very Light weight","dark","Second Choice","100% cotton","100% cotton","24/2 - 16/1","24/2 - 16/1","Fresh","Fresh",null,"sdf",5.5,78,5.46,"Dobby","Normal",null,null,null,null,null,null,"صرف","تصدير","2021/08/12",33,18]
[null,"0001 - 60","ttoo",9114000032,"مشكل عميل 60 اوردر 7011",60,7011,7011,"Kitchen Towel","Kitchen Towel","Flat","Flat","50 X 70","50 X 70",70,70,200,"Very Light weight","dark","Second Choice","100% cotton","100% cotton","24/2 - 16/1","24/2 - 16/1","Fresh","Fresh",null,"محمود",7,100,7,"Dobby","Normal",null,null,null,null,null,null,"صرف","بيع محلى","2021/08/12",45,19]
[null,"0002 - 60","cairo",9114000033,"مشكل عميل 60 اوردر 7011",60,7011,7011,"Kitchen Towel","Kitchen Towel","Flat","Flat","50 X 70","50 X 70",70,70,200,"Very Light weight","dark","Second Choice","100% cotton","100% cotton","24/2 - 16/1","24/2 - 16/1","Fresh","Fresh",null,"محمود",8.4,120,8.4,"Jacquard","Normal",null,null,null,null,null,null,"صرف","بيع محلى","2021/08/12",45,19]
[null,"0003 - 60","mansura",9114000034,"مشكل عميل 60 اوردر 7011",60,7011,7011,"Kitchen Towel","Kitchen Towel","Flat","Flat","50 X 70","50 X 70",70,70,200,"Very Light weight","dark","Second Choice","100% cotton","100% cotton","24/2 - 16/1","24/2 - 16/1","Fresh","Fresh",null,"محمود",2.1,30,2.1,"Jacquard","Normal",null,null,null,null,null,null,"صرف","بيع محلى","2021/08/12",45,19]
[null,"0004 - 60","mahalla",9114000035,"مشكل عميل 60 اوردر 7011",60,7011,7011,"Kitchen Towel","Kitchen Towel","Flat","Flat","50 X 70","50 X 70",70,70,200,"Very Light weight","dark","Second Choice","100% cotton","100% cotton","24/2 - 16/1","24/2 - 16/1","Fresh","Fresh",null,"محمود",1.05,15,1.05,"Dobby","Normal",null,null,null,null,null,null,"صرف","بيع محلى","2021/08/12",45,19]
[null,"0005 - 60","louxur",9114000036,"مشكل عميل 60 اوردر 7011",60,7011,7011,"Kitchen Towel","Kitchen Towel","Flat","Flat","50 X 70","50 X 70",70,70,200,"Very Light weight","dark","Second Choice","100% cotton","100% cotton","24/2 - 16/1","24/2 - 16/1","Fresh","Fresh",null,"محمود",0.7,10,0.7,"Dobby","Normal",null,null,null,null,null,null,"صرف","بيع محلى","2021/08/12",45,19]
[null,"0006 - 60","aswan",9114000037,"مشكل عميل 60 اوردر 7011",60,7011,7011,"Kitchen Towel","Kitchen Towel","Flat","Flat","50 X 70","50 X 70",70,70,200,"Very Light weight","dark","Second Choice","100% cotton","100% cotton","24/2 - 16/1","24/2 - 16/1","Fresh","Fresh",null,"محمود",1.75,25,1.75,"Jacquard","Normal",null,null,null,null,null,null,"صرف","بيع محلى","2021/08/12",45,19]
[null,"0002 - 60","cairo",9114000033,"مشكل عميل 60 اوردر 7011",60,7011,7011,"Kitchen Towel","Kitchen Towel","Flat","Flat","50 X 70","50 X 70",70,70,200,"Very Light weight","dark","Second Choice","100% cotton","100% cotton","24/2 - 16/1","24/2 - 16/1","Fresh","Fresh",null,"محمود",21,318,22.26,"Jacquard","Normal",null,null,null,null,null,null,"صرف","بيع محلى","2021/08/12",45,19]
[null,"0001 - 55","palm blue",9114000024,"مشكل عميل 55 اوردر 7009",55,7009,7009,"Kitchen Towel","Kitchen Towel","Flat","Flat","50 X 70","50 X 70",70,70,200,"Very Light weight","dark","Second Choice","100% cotton","100% cotton","24/2 - 16/1","24/2 - 16/1","Fresh","Fresh",null,"محمود",14,200,14,"Dobby","Normal",null,null,null,null,null,null,"صرف","تصدير","2021/08/12",33,20]
[null,"0002 - 55","palm nel",9114000025,"مشكل عميل 55 اوردر 7009",55,7009,7009,"Kitchen Towel","Kitchen Towel","Flat","Flat","50 X 70","50 X 70",70,70,200,"Very Light weight","dark","Second Choice","100% cotton","100% cotton","24/2 - 16/1","24/2 - 16/1","Fresh","Fresh",null,"محمود",3.5,50,3.5,"Dobby","Normal",null,null,null,null,null,null,"صرف","تصدير","2021/08/12",33,20]
[null,"0003 - 55","palm Turq",9114000026,"مشكل عميل 55 اوردر 7009",55,7009,7009,"Kitchen Towel","Kitchen Towel","Flat","Flat","50 X 70","50 X 70",70,70,200,"Very Light weight","dark","Second Choice","100% cotton","100% cotton","24/2 - 16/1","24/2 - 16/1","Fresh","Fresh",null,"محمود",1.75,25,1.75,"Dobby","Normal",null,null,null,null,null,null,"صرف","تصدير","2021/08/12",33,20]
[null,"0004 - 55","palm orange",9114000027,"مشكل عميل 55 اوردر 7009",55,7009,7009,"Kitchen Towel","Kitchen Towel","Flat","Flat","50 X 70","50 X 70",70,70,200,"Very Light weight","dark","Second Choice","100% cotton","100% cotton","24/2 - 16/1","24/2 - 16/1","Fresh","Fresh",null,"محمود",2.1,30,2.1,"Dobby","Normal",null,null,null,null,null,null,"صرف","تصدير","2021/08/12",33,20]
[null,"0005 - 55","palm red",9114000028,"مشكل عميل 55 اوردر 7009",55,7009,7009,"Kitchen Towel","Kitchen Towel","Flat","Flat","50 X 70","50 X 70",70,70,200,"Very Light weight","dark","Second Choice","100% cotton","100% cotton","24/2 - 16/1","24/2 - 16/1","Fresh","Fresh",null,"محمود",0.84,12,0.84,"Dobby","Normal",null,null,null,null,null,null,"صرف","تصدير","2021/08/12",33,20]
[null,"0006 - 55","palm Brown",9114000029,"مشكل عميل 55 اوردر 7009",55,7009,7009,"Kitchen Towel","Kitchen Towel","Flat","Flat","50 X 70","50 X 70",70,70,200,"Very Light weight","dark","Second Choice","100% cotton","100% cotton","24/2 - 16/1","24/2 - 16/1","Fresh","Fresh",null,"محمود",0.56000000000000005,8,0.56000000000000005,"Dobby","Normal",null,null,null,null,null,null,"صرف","تصدير","2021/08/12",33,20]
[null,"0001 - 55","palm blue",9114000024,"مشكل عميل 55 اوردر 7009",55,7009,7009,"Kitchen Towel","Kitchen Towel","Flat","Flat","50 X 70","50 X 70",70,70,200,"Very Light weight","dark","Second Choice","100% cotton","100% cotton","24/2 - 16/1","24/2 - 16/1","Fresh","Fresh",null,"محمود",27.999999999999993,400,28,"Dobby","Normal",null,null,null,null,null,null,"صرف","تصدير","2021/08/12",33,20]
[null,"0002 - 55","palm nel",9114000025,"مشكل عميل 55 اوردر 7009",55,7009,7009,"Kitchen Towel","Kitchen Towel","Flat","Flat","50 X 70","50 X 70",70,70,200,"Very Light weight","dark","Second Choice","100% cotton","100% cotton","24/2 - 16/1","24/2 - 16/1","Fresh","Fresh",null,"محمود",8.3999999999999986,120,8.4,"Dobby","Normal",null,null,null,null,null,null,"صرف","تصدير","2021/08/12",33,20]
[null,"0003 - 55","palm Turq",9114000026,"مشكل عميل 55 اوردر 7009",55,7009,7009,"Kitchen Towel","Kitchen Towel","Flat","Flat","50 X 70","50 X 70",70,70,200,"Very Light weight","dark","Second Choice","100% cotton","100% cotton","24/2 - 16/1","24/2 - 16/1","Fresh","Fresh",null,"محمود",0.55999999999999994,8,0.56000000000000005,"Dobby","Normal",null,null,null,null,null,null,"صرف","تصدير","2021/08/12",33,20]
[null,"0004 - 55","palm orange",9114000027,"مشكل عميل 55 اوردر 7009",55,7009,7009,"Kitchen Towel","Kitchen Towel","Flat","Flat","50 X 70","50 X 70",70,70,200,"Very Light weight","dark","Second Choice","100% cotton","100% cotton","24/2 - 16/1","24/2 - 16/1","Fresh","Fresh",null,"محمود",0.83999999999999975,12,0.84,"Dobby","Normal",null,null,null,null,null,null,"صرف","تصدير","2021/08/12",33,20]
[null,"0005 - 55","palm red",9114000028,"مشكل عميل 55 اوردر 7009",55,7009,7009,"Kitchen Towel","Kitchen Towel","Flat","Flat","50 X 70","50 X 70",70,70,200,"Very Light weight","dark","Second Choice","100% cotton","100% cotton","24/2 - 16/1","24/2 - 16/1","Fresh","Fresh",null,"محمود",2.0999999999999996,30,2.1,"Dobby","Normal",null,null,null,null,null,null,"صرف","تصدير","2021/08/12",33,20]
[null,"0006 - 55","palm Brown",9114000029,"مشكل عميل 55 اوردر 7009",55,7009,7009,"Kitchen Towel","Kitchen Towel","Flat","Flat","50 X 70","50 X 70",70,70,200,"Very Light weight","dark","Second Choice","100% cotton","100% cotton","24/2 - 16/1","24/2 - 16/1","Fresh","Fresh",null,"محمود",1.5399999999999996,22,1.54,"Dobby","Normal",null,null,null,null,null,null,"صرف","تصدير","2021/08/12",33,20]
[null,"0007 - 55","Moon - Blue",9114000030,"مشكل عميل 55 اوردر 7010",55,7010,7010,"Kitchen Towel","Kitchen Towel","Flat","Flat","50 X 70","50 X 70",70,70,200,"Very Light weight","dark","Second Choice","100% cotton","100% cotton","24/2 - 16/1","24/2 - 16/1","Fresh","Fresh",null,"محمود",28,400,28,"Dobby","Normal",null,null,null,null,null,null,"صرف","تصدير","2021/08/12",33,20]
[null,"0008 - 55","Moon - Red",9114000031,"مشكل عميل 55 اوردر 7010",55,7010,7010,"Kitchen Towel","Kitchen Towel","Flat","Flat","50 X 70","50 X 70",70,70,200,"Very Light weight","dark","Second Choice","100% cotton","100% cotton","24/2 - 16/1","24/2 - 16/1","Fresh","Fresh",null,"محمود",8.4,120,8.4,"Jacquard","Normal",null,null,null,null,null,null,"صرف","تصدير","2021/08/12",33,20]
[null,"0007 - 55","Moon - Blue",9114000030,"مشكل عميل 55 اوردر 7010",55,7010,7010,"Kitchen Towel","Kitchen Towel","Flat","Flat","50 X 70","50 X 70",70,70,200,"Very Light weight","dark","Second Choice","100% cotton","100% cotton","24/2 - 16/1","24/2 - 16/1","Fresh","Fresh",null,"محمود",70,1000,70,"Dobby","Normal",null,null,null,null,null,null,"صرف","تصدير","2021/08/12",33,20]
[null,"0001 - 75","frgg",9114000001,"dfd",75,7015,7015,"Kitchen Towel","Kitchen Towel","Flat","Flat","50 X 70","50 X 70",70,70,200,"Very Light weight","dark","Second Choice","100% cotton","100% cotton","24/2 - 16/1","24/2 - 16/1","Fresh","Fresh",null,"jgj",35,500,35,"Dobby","Normal",null,null,null,null,null,null,"صرف","تصدير","2021/08/12",33,21]
[null,"0001 - 75","frgg",9114000001,"dssse",75,7015,7015,"Kitchen Towel","Kitchen Towel","Flat","Flat","50 X 70","50 X 70",69.999999999999986,70,200,"Very Light weight","dark","Second Choice","100% cotton","100% cotton","24/2 - 16/1","24/2 - 16/1","Fresh","Fresh",null,"dgd",9,122,8.5399999999999991,"Dobby","Normal",null,null,null,null,null,null,"صرف","مرتجع للمشغل","2021/08/12",33,22]
[null,"0009 - 75","dfgdfg",9114000009,"بيبل",75,7015,7015,"Kitchen Towel","Kitchen Towel","Flat","Flat","50 x 65","50 x 65",65.000000000000014,65,200,"Very Light weight","dark","Second Choice","100% cotton","100% cotton","24/2 - 16/1","24/2 - 16/1","Fresh","Fresh",null,"بل",1.3793103448275861,20,1.3,"Jacquard","Normal",null,null,null,null,null,null,"صرف","بيع محلى","2021/08/12",34,23]
[null,"0003 - 75","dfgdfg",9114000003,"بيبل",75,7015,7015,"Kitchen Towel","Kitchen Towel","Flat","Flat","50 x 65","50 x 65",65.000000000000014,65,200,"Very Light weight","dark","Second Choice","100% cotton","100% cotton","24/2 - 16/1","24/2 - 16/1","Fresh","Fresh",null,"بل",2.7586206896551722,40,2.6,"Jacquard","Normal",null,null,null,null,null,null,"صرف","بيع محلى","2021/08/12",34,23]
[null,"0005 - 75","dfgdfg",9114000005,"بيبل",75,7015,7015,"Kitchen Towel","Kitchen Towel","Flat","Flat","50 x 65","50 x 65",65.000000000000014,65,200,"Very Light weight","dark","Second Choice","100% cotton","100% cotton","24/2 - 16/1","24/2 - 16/1","Fresh","Fresh",null,"بل",0.82758620689655171,12,0.78,"Jacquard","Normal",null,null,null,null,null,null,"صرف","بيع محلى","2021/08/12",34,23]
[null,"0008 - 75","dfgdfg",9114000008,"بيبل",75,7015,7015,"Kitchen Towel","Kitchen Towel","Flat","Flat","50 x 65","50 x 65",65.000000000000014,65,200,"Very Light weight","dark","Second Choice","100% cotton","100% cotton","24/2 - 16/1","24/2 - 16/1","Fresh","Fresh",null,"بل",0.55172413793103448,8,0.52,"Jacquard","Normal",null,null,null,null,null,null,"صرف","بيع محلى","2021/08/12",34,23]
[null,"0006 - 75","dfgdfg",9114000006,"بيبل",75,7015,7015,"Kitchen Towel","Kitchen Towel","Flat","Flat","50 x 65","50 x 65",65.000000000000014,65,200,"Very Light weight","dark","Second Choice","100% cotton","100% cotton","24/2 - 16/1","24/2 - 16/1","Fresh","Fresh",null,"بل",0.48275862068965514,7,0.45500000000000002,"Jacquard","Normal",null,null,null,null,null,null,"صرف","بيع محلى","2021/08/12",34,23]
[null,"0003 - 40","dfsg",9111000001,"jfghj",40,7017,7017,"Bath towel","Bath towel","Terry","Terry","90 x 160","90 x 160",720.00000000000011,720,500,"Heavy","dark","Second Choice","100% cotton","100% cotton","24/2 - 24/2 - 16/1","24/2 - 24/2 - 16/1","Fresh","Fresh",null,"yt",1.4999999999999998,2,1.44,"Jacquard","Promotional","اضافه","اضافه من المشغل","2021/08/12"]
[null,"0004 - 40","cvsde",9111000002,"jfghj",40,7017,7017,"Bath towel","Bath towel","Terry","Terry","90 x 160","90 x 160",720.00000000000011,720,500,"Heavy","dark","Second Choice","100% cotton","100% cotton","24/2 - 24/2 - 16/1","24/2 - 24/2 - 16/1","Fresh","Fresh",null,"yt",3.7499999999999996,5,3.6,"Jacquard","Promotional","اضافه","اضافه من المشغل","2021/08/12"]
[null,"0005 - 40","setv",9111000003,"jfghj",40,7017,7017,"Bath towel","Bath towel","Terry","Terry","90 x 160","90 x 160",720.00000000000011,720,500,"Heavy","dark","Second Choice","100% cotton","100% cotton","24/2 - 24/2 - 16/1","24/2 - 24/2 - 16/1","Fresh","Fresh",null,"yt",1.4999999999999998,2,1.44,"Jacquard","Promotional","اضافه","اضافه من المشغل","2021/08/12"]
[null,"0006 - 40","fbdg5yf",9111000004,"jfghj",40,7017,7017,"Bath towel","Bath towel","Terry","Terry","90 x 160","90 x 160",720.00000000000011,720,500,"Heavy","dark","Second Choice","100% cotton","100% cotton","24/2 - 24/2 - 16/1","24/2 - 24/2 - 16/1","Fresh","Fresh",null,"yt",5.9999999999999991,8,5.76,"Jacquard","Promotional","اضافه","اضافه من المشغل","2021/08/12"]
[null,"0007 - 40","ewtwt ef34",9111000005,"jfghj",40,7017,7017,"Bath towel","Bath towel","Terry","Terry","90 x 160","90 x 160",720.00000000000011,720,500,"Heavy","dark","Second Choice","100% cotton","100% cotton","24/2 - 24/2 - 16/1","24/2 - 24/2 - 16/1","Fresh","Fresh",null,"yt",0.74999999999999989,1,0.72,"Jacquard","Promotional","اضافه","اضافه من المشغل","2021/08/12"]
[null,"0008 - 40","gh54t ",9111000006,"jfghj",40,7017,7017,"Bath towel","Bath towel","Terry","Terry","90 x 160","90 x 160",720.00000000000011,720,500,"Heavy","dark","Second Choice","100% cotton","100% cotton","24/2 - 24/2 - 16/1","24/2 - 24/2 - 16/1","Fresh","Fresh",null,"yt",4.5,6,4.32,"Jacquard","Promotional","اضافه","اضافه من المشغل","2021/08/12"]
[null,"0004 - 40","cvsde",9111000002,"ddg",40,7017,7017,"Bath towel","Bath towel","Terry","Terry","90 x 160","90 x 160",720.00000000000011,720,500,"Heavy","dark","Second Choice","100% cotton","100% cotton","24/2 - 24/2 - 16/1","24/2 - 24/2 - 16/1","Fresh","Fresh",null,"bg",18,24,17.28,"Jacquard","Promotional","اضافه","اضافه من المشغل","2021/08/12"]
[null,"0004 - 40","cvsde",9111000002,"ddg",40,7017,7017,"Bath towel","Bath towel","Terry","Terry","90 x 160","90 x 160",720.00000000000011,720,500,"Heavy","dark","Second Choice","100% cotton","100% cotton","24/2 - 24/2 - 16/1","24/2 - 24/2 - 16/1","Fresh","Fresh",null,"bg",18,24,17.28,"Jacquard","Promotional",null,null,null,null,null,null,"صرف","تصدير","2021/08/12",40,24]
[null,"0004 - 40","cvsde",9111000002,"tr",40,7017,7017,"Bath towel","Bath towel","Terry","Terry","90 x 160","90 x 160",720.00000000000011,720,500,"Heavy","dark","Second Choice","100% cotton","100% cotton","24/2 - 24/2 - 16/1","24/2 - 24/2 - 16/1","Fresh","Fresh",null,"fft",18,24,17.28,"Jacquard","Promotional","اضافه","اضافه من المشغل","2021/08/12"]
[null,"0004 - 40","cvsde",9111000002,"f",40,7017,7017,"Bath towel","Bath towel","Terry","Terry","90 x 160","90 x 160",720.00000000000011,720,500,"Heavy","dark","Second Choice","100% cotton","100% cotton","24/2 - 24/2 - 16/1","24/2 - 24/2 - 16/1","Fresh","Fresh",null,"j",14.999999999999998,20,14.4,"Jacquard","Promotional","اضافه","اضافه من المشغل","2021/08/12"]
[null,"0008 - 40","gh54t ",9111000006,"f",40,7017,7017,"Bath towel","Bath towel","Terry","Terry","90 x 160","90 x 160",720.00000000000011,720,500,"Heavy","dark","Second Choice","100% cotton","100% cotton","24/2 - 24/2 - 16/1","24/2 - 24/2 - 16/1","Fresh","Fresh",null,"j",2.9999999999999996,4,2.88,"Jacquard","Promotional","اضافه","اضافه من المشغل","2021/08/12"]
[null,"0007 - 55","Moon - Blue",9114000030,"مشكل عميل 55 اوردر 7010",55,7010,7010,"Kitchen Towel","Kitchen Towel","Flat","Flat","50 X 70","50 X 70",70,70,200,"Very Light weight","dark","Second Choice","100% cotton","100% cotton","24/2 - 16/1","24/2 - 16/1","Fresh","Fresh",null,"محمود",70,100,7,"Dobby","Normal",null,null,null,null,null,null,"صرف","بيع محلى","2021/08/12",34,25]
[null,"0001 - 60","ttoo",9114000032,"مشكل عميل 60 اوردر 7011",60,7011,7011,"Kitchen Towel","Kitchen Towel","Flat","Flat","50 X 70","50 X 70",70,70,200,"Very Light weight","dark","Second Choice","100% cotton","100% cotton","24/2 - 16/1","24/2 - 16/1","Fresh","Fresh",null,"محمود",21,220,15.4,"Dobby","Normal",null,null,null,null,null,null,"صرف","مرتجع لتوحيد الاصناف","2021/08/12",34,26]
[null,"0007 - 55","Moon - Blue",9114000030,"مشكل عميل 55 اوردر 7010",55,7010,7010,"Kitchen Towel","Kitchen Towel","Flat","Flat","50 X 70","50 X 70",70,70,200,"Very Light weight","dark","Second Choice","100% cotton","100% cotton","24/2 - 16/1","24/2 - 16/1","Fresh","Fresh",null,"محمود",70,100,7,"Dobby","Normal",null,null,null,null,null,null,"صرف","مرتجع للمشغل","2021/08/12",45,27]
[null,"0007 - 55","Moon - Blue",9114000030,"مشكل عميل 55 اوردر 7010",55,7010,7010,"Kitchen Towel","Kitchen Towel","Flat","Flat","50 X 70","50 X 70",70,70,200,"Very Light weight","dark","Second Choice","100% cotton","100% cotton","24/2 - 16/1","24/2 - 16/1","Fresh","Fresh",null,"محمود",70,100,7,"Dobby","Normal",null,null,null,null,null,null,"صرف","مرتجع للمشغل","2021/08/12",45,27]
[null,"0007 - 55","Moon - Blue",9114000030,"مشكل عميل 55 اوردر 7010",55,7010,7010,"Kitchen Towel","Kitchen Towel","Flat","Flat","50 X 70","50 X 70",70,70,200,"Very Light weight","dark","Second Choice","100% cotton","100% cotton","24/2 - 16/1","24/2 - 16/1","Fresh","Fresh",null,"محمود",70,100,7,"Dobby","Normal",null,null,null,null,null,null,"صرف","مرتجع للمشغل","2021/08/12",45,27]
[null,"0003 - 40","dfsg",9111000001,"jfghj",40,7017,7017,"Bath towel","Bath towel","Terry","Terry","90 x 160","90 x 160",720.00000000000011,720,500,"Heavy","dark","Second Choice","100% cotton","100% cotton","24/2 - 24/2 - 16/1","24/2 - 24/2 - 16/1","Fresh","Fresh",null,"yt",1.4999999999999998,2,1.44,"Jacquard","Promotional",null,null,null,null,null,null,"صرف","تصدير","2021/08/12",75,28]
[null,"0004 - 40","cvsde",9111000002,"jfghj",40,7017,7017,"Bath towel","Bath towel","Terry","Terry","90 x 160","90 x 160",720.00000000000011,720,500,"Heavy","dark","Second Choice","100% cotton","100% cotton","24/2 - 24/2 - 16/1","24/2 - 24/2 - 16/1","Fresh","Fresh",null,"yt",3.7499999999999996,5,3.6,"Jacquard","Promotional",null,null,null,null,null,null,"صرف","تصدير","2021/08/12",75,28]
[null,"0005 - 40","setv",9111000003,"jfghj",40,7017,7017,"Bath towel","Bath towel","Terry","Terry","90 x 160","90 x 160",720.00000000000011,720,500,"Heavy","dark","Second Choice","100% cotton","100% cotton","24/2 - 24/2 - 16/1","24/2 - 24/2 - 16/1","Fresh","Fresh",null,"yt",1.4999999999999998,2,1.44,"Jacquard","Promotional",null,null,null,null,null,null,"صرف","تصدير","2021/08/12",75,28]
[null,"0006 - 40","fbdg5yf",9111000004,"jfghj",40,7017,7017,"Bath towel","Bath towel","Terry","Terry","90 x 160","90 x 160",720.00000000000011,720,500,"Heavy","dark","Second Choice","100% cotton","100% cotton","24/2 - 24/2 - 16/1","24/2 - 24/2 - 16/1","Fresh","Fresh",null,"yt",5.9999999999999991,8,5.76,"Jacquard","Promotional",null,null,null,null,null,null,"صرف","تصدير","2021/08/12",75,28]
[null,"0007 - 40","ewtwt ef34",9111000005,"jfghj",40,7017,7017,"Bath towel","Bath towel","Terry","Terry","90 x 160","90 x 160",720.00000000000011,720,500,"Heavy","dark","Second Choice","100% cotton","100% cotton","24/2 - 24/2 - 16/1","24/2 - 24/2 - 16/1","Fresh","Fresh",null,"yt",0.74999999999999989,1,0.72,"Jacquard","Promotional",null,null,null,null,null,null,"صرف","تصدير","2021/08/12",75,28]
[null,"0008 - 40","gh54t ",9111000006,"jfghj",40,7017,7017,"Bath towel","Bath towel","Terry","Terry","90 x 160","90 x 160",720.00000000000011,720,500,"Heavy","dark","Second Choice","100% cotton","100% cotton","24/2 - 24/2 - 16/1","24/2 - 24/2 - 16/1","Fresh","Fresh",null,"yt",4.5,6,4.32,"Jacquard","Promotional",null,null,null,null,null,null,"صرف","تصدير","2021/08/12",75,28]
[null,"0004 - 40","cvsde",9111000002,"tr",40,7017,7017,"Bath towel","Bath towel","Terry","Terry","90 x 160","90 x 160",720.00000000000011,720,500,"Heavy","dark","Second Choice","100% cotton","100% cotton","24/2 - 24/2 - 16/1","24/2 - 24/2 - 16/1","Fresh","Fresh",null,"fft",18,24,17.28,"Jacquard","Promotional",null,null,null,null,null,null,"صرف","تصدير","2021/08/12",75,28]
[null,"0004 - 40","cvsde",9111000002,"f",40,7017,7017,"Bath towel","Bath towel","Terry","Terry","90 x 160","90 x 160",720.00000000000011,720,500,"Heavy","dark","Second Choice","100% cotton","100% cotton","24/2 - 24/2 - 16/1","24/2 - 24/2 - 16/1","Fresh","Fresh",null,"j",14.999999999999998,20,14.4,"Jacquard","Promotional",null,null,null,null,null,null,"صرف","مرتجع للمشغل","2021/08/12",34,29]
[null,"0008 - 40","gh54t ",9111000006,"f",40,7017,7017,"Bath towel","Bath towel","Terry","Terry","90 x 160","90 x 160",720.00000000000011,720,500,"Heavy","dark","Second Choice","100% cotton","100% cotton","24/2 - 24/2 - 16/1","24/2 - 24/2 - 16/1","Fresh","Fresh",null,"j",2.9999999999999996,4,2.88,"Jacquard","Promotional",null,null,null,null,null,null,"صرف","مرتجع للمشغل","2021/08/12",34,29]
[null,"0008 - 40","gh54t ",9111000006,"g",40,7017,7017,"Bath towel","Bath towel","Terry","Terry","90 x 160","90 x 160",720.00000000000011,720,500,"Heavy","dark","Second Choice","100% cotton","100% cotton","24/2 - 24/2 - 16/1","24/2 - 24/2 - 16/1","Fresh","Fresh",null,"g",14.999999999999998,20,14.4,"Jacquard","Promotional","اضافه","اضافه من المشغل","2021/08/12"]
[null,"0009 - 40","r4yftgwt4",9111000007,"g",40,7017,7017,"Bath towel","Bath towel","Terry","Terry","90 x 160","90 x 160",720.00000000000011,720,500,"Heavy","dark","Second Choice","100% cotton","100% cotton","24/2 - 24/2 - 16/1","24/2 - 24/2 - 16/1","Fresh","Fresh",null,"g",1.4999999999999998,2,1.44,"Jacquard","Promotional","اضافه","اضافه من المشغل","2021/08/12"]
[null,"0010 - 40","dsty5r",9111000008,"g",40,7017,7017,"Bath towel","Bath towel","Terry","Terry","90 x 160","90 x 160",720.00000000000011,720,500,"Heavy","dark","Second Choice","100% cotton","100% cotton","24/2 - 24/2 - 16/1","24/2 - 24/2 - 16/1","Fresh","Fresh",null,"g",1.4999999999999998,2,1.44,"Jacquard","Promotional","اضافه","اضافه من المشغل","2021/08/12"]
[null,"0008 - 40","gh54t ",9111000006,"y",40,7017,7017,"Bath towel","Bath towel","Terry","Terry","90 x 160","90 x 160",720.00000000000011,720,500,"Heavy","dark","Second Choice","100% cotton","100% cotton","24/2 - 24/2 - 16/1","24/2 - 24/2 - 16/1","Fresh","Fresh",null,"y",18,24,17.28,"Jacquard","Promotional","اضافه","اضافه من المشغل","2021/08/12"]
[null,"0008 - 40","gh54t ",9111000006,"frr",40,7017,7017,"Bath towel","Bath towel","Terry","Terry","90 x 160","90 x 160",720.00000000000011,720,500,"Heavy","dark","Second Choice","100% cotton","100% cotton","24/2 - 24/2 - 16/1","24/2 - 24/2 - 16/1","Fresh","Fresh",null,"y",5.0000000000000009,6,4.32,"Jacquard","Promotional","اضافه","اضافه من المشغل","2021/08/12"]
[null,"0008 - 40","gh54t ",9111000006,"y",40,7017,7017,"Bath towel","Bath towel","Terry","Terry","90 x 160","90 x 160",720.00000000000011,720,500,"Heavy","dark","Second Choice","100% cotton","100% cotton","24/2 - 24/2 - 16/1","24/2 - 24/2 - 16/1","Fresh","Fresh",null,"y",18,24,17.28,"Jacquard","Promotional",null,null,null,null,null,null,"صرف","مرتجع للمشغل","2021/08/12",34,30]
[null,"0008 - 40","gh54t ",9111000006,"frr",40,7017,7017,"Bath towel","Bath towel","Terry","Terry","90 x 160","90 x 160",720.00000000000011,720,500,"Heavy","dark","Second Choice","100% cotton","100% cotton","24/2 - 24/2 - 16/1","24/2 - 24/2 - 16/1","Fresh","Fresh",null,"y",5.0000000000000009,6,4.32,"Jacquard","Promotional",null,null,null,null,null,null,"صرف","مرتجع للمشغل","2021/08/12",34,30]
[null,"0008 - 40","gh54t ",9111000006,"g",40,7017,7017,"Bath towel","Bath towel","Terry","Terry","90 x 160","90 x 160",720.00000000000011,720,500,"Heavy","dark","Second Choice","100% cotton","100% cotton","24/2 - 24/2 - 16/1","24/2 - 24/2 - 16/1","Fresh","Fresh",null,"g",14.999999999999998,20,14.4,"Jacquard","Promotional",null,null,null,null,null,null,"صرف","تصدير","2021/08/12",33,31]
[null,"0009 - 40","r4yftgwt4",9111000007,"g",40,7017,7017,"Bath towel","Bath towel","Terry","Terry","90 x 160","90 x 160",720.00000000000011,720,500,"Heavy","dark","Second Choice","100% cotton","100% cotton","24/2 - 24/2 - 16/1","24/2 - 24/2 - 16/1","Fresh","Fresh",null,"g",1.4999999999999998,2,1.44,"Jacquard","Promotional",null,null,null,null,null,null,"صرف","تصدير","2021/08/12",33,31]
[null,"0010 - 40","dsty5r",9111000008,"g",40,7017,7017,"Bath towel","Bath towel","Terry","Terry","90 x 160","90 x 160",720.00000000000011,720,500,"Heavy","dark","Second Choice","100% cotton","100% cotton","24/2 - 24/2 - 16/1","24/2 - 24/2 - 16/1","Fresh","Fresh",null,"g",1.4999999999999998,2,1.44,"Jacquard","Promotional",null,null,null,null,null,null,"صرف","تصدير","2021/08/12",33,31]
[null,"0001 - 80","fgfdbg",9114000011,"ءبل",80,7018,7018,"Kitchen Towel","Kitchen Towel","Flat","Flat","50 X 70","50 X 70",70,70,200,"Very Light weight","dark","Second Choice","100% cotton","100% cotton","24/2 - 16/1","24/2 - 16/1","Fresh","Fresh",null,"بلييب",2.0999999999999996,30,2.1,"Dobby","Normal","اضافه","اضافه من المشغل","2021/08/14"]
[null,"0002 - 80","sag",9114000012,"ءبل",80,7018,7018,"Kitchen Towel","Kitchen Towel","Flat","Flat","50 X 70","50 X 70",70,70,200,"Very Light weight","dark","Second Choice","100% cotton","100% cotton","24/2 - 16/1","24/2 - 16/1","Fresh","Fresh",null,"بلييب",2.7999999999999994,40,2.8,"Jacquard","Promotional","اضافه","اضافه من المشغل","2021/08/14"]
[null,"0003 - 80","sdfsdfs",9114000013,"ءبل",80,7018,7018,"Kitchen Towel","Kitchen Towel","Flat","Flat","50 X 70","50 X 70",70,70,200,"Very Light weight","dark","Second Choice","100% cotton","100% cotton","24/2 - 16/1","24/2 - 16/1","Fresh","Fresh",null,"بلييب",3.4999999999999996,50,3.5,"Jacquard","Normal","اضافه","اضافه من المشغل","2021/08/14"]
[null,"0004 - 80","sdfgsd",9114000014,"ءبل",80,7018,7018,"Kitchen Towel","Kitchen Towel","Flat","Flat","50 X 70","50 X 70",70,70,200,"Very Light weight","dark","Second Choice","100% cotton","100% cotton","24/2 - 16/1","24/2 - 16/1","Fresh","Fresh",null,"بلييب",1.3999999999999997,20,1.4,"Jacquard","Normal","اضافه","اضافه من المشغل","2021/08/14"]
[null,"0005 - 80","sdfsf",9114000015,"ءبل",80,7018,7018,"Kitchen Towel","Kitchen Towel","Flat","Flat","50 X 70","50 X 70",70,70,200,"Very Light weight","dark","Second Choice","100% cotton","100% cotton","24/2 - 16/1","24/2 - 16/1","Fresh","Fresh",null,"بلييب",2.7999999999999994,40,2.8,"Jacquard","Normal","اضافه","اضافه من المشغل","2021/08/14"]
[null,"0006 - 80","sdfdsfew",9114000016,"ءبل",80,7018,7018,"Kitchen Towel","Kitchen Towel","Flat","Flat","50 X 70","50 X 70",70,70,200,"Very Light weight","dark","Second Choice","100% cotton","100% cotton","24/2 - 16/1","24/2 - 16/1","Fresh","Fresh",null,"بلييب",1.3999999999999997,20,1.4,"Jacquard","Normal","اضافه","اضافه من المشغل","2021/08/14"]
[null,"0001 - 80","fgfdbg",9114000011,"سي",80,7018,7018,"Kitchen Towel","Kitchen Towel","Flat","Flat","50 X 70","50 X 70",70,70,200,"Very Light weight","dark","Second Choice","100% cotton","100% cotton","24/2 - 16/1","24/2 - 16/1","Fresh","Fresh",null,"يب",28,400,28,"Dobby","Normal","اضافه","اضافه من المشغل","2021/08/14"]
[null,"0001 - 80","fgfdbg",9114000011,"ءبل",80,7018,7018,"Kitchen Towel","Kitchen Towel","Flat","Flat","50 X 70","50 X 70",70,70,200,"Very Light weight","dark","Second Choice","100% cotton","100% cotton","24/2 - 16/1","24/2 - 16/1","Fresh","Fresh",null,"بلييب",2.0999999999999996,30,2.1,"Dobby","Normal",null,null,null,null,null,null,"صرف","بيع محلى","2021/08/14",45,32]
[null,"0002 - 80","sag",9114000012,"ءبل",80,7018,7018,"Kitchen Towel","Kitchen Towel","Flat","Flat","50 X 70","50 X 70",70,70,200,"Very Light weight","dark","Second Choice","100% cotton","100% cotton","24/2 - 16/1","24/2 - 16/1","Fresh","Fresh",null,"بلييب",2.7999999999999994,40,2.8,"Jacquard","Promotional",null,null,null,null,null,null,"صرف","بيع محلى","2021/08/14",45,32]
[null,"0003 - 80","sdfsdfs",9114000013,"ءبل",80,7018,7018,"Kitchen Towel","Kitchen Towel","Flat","Flat","50 X 70","50 X 70",70,70,200,"Very Light weight","dark","Second Choice","100% cotton","100% cotton","24/2 - 16/1","24/2 - 16/1","Fresh","Fresh",null,"بلييب",3.4999999999999996,50,3.5,"Jacquard","Normal",null,null,null,null,null,null,"صرف","بيع محلى","2021/08/14",45,32]
[null,"0004 - 80","sdfgsd",9114000014,"ءبل",80,7018,7018,"Kitchen Towel","Kitchen Towel","Flat","Flat","50 X 70","50 X 70",70,70,200,"Very Light weight","dark","Second Choice","100% cotton","100% cotton","24/2 - 16/1","24/2 - 16/1","Fresh","Fresh",null,"بلييب",1.3999999999999997,20,1.4,"Jacquard","Normal",null,null,null,null,null,null,"صرف","بيع محلى","2021/08/14",45,32]
[null,"0005 - 80","sdfsf",9114000015,"ءبل",80,7018,7018,"Kitchen Towel","Kitchen Towel","Flat","Flat","50 X 70","50 X 70",70,70,200,"Very Light weight","dark","Second Choice","100% cotton","100% cotton","24/2 - 16/1","24/2 - 16/1","Fresh","Fresh",null,"بلييب",2.7999999999999994,40,2.8,"Jacquard","Normal",null,null,null,null,null,null,"صرف","بيع محلى","2021/08/14",45,32]
[null,"0006 - 80","sdfdsfew",9114000016,"ءبل",80,7018,7018,"Kitchen Towel","Kitchen Towel","Flat","Flat","50 X 70","50 X 70",70,70,200,"Very Light weight","dark","Second Choice","100% cotton","100% cotton","24/2 - 16/1","24/2 - 16/1","Fresh","Fresh",null,"بلييب",1.3999999999999997,20,1.4,"Jacquard","Normal",null,null,null,null,null,null,"صرف","بيع محلى","2021/08/14",45,32]

{"sheet":"Rassed","index":1,"n_rows":98,"n_cols":38,"rows_kept":98,"cut":false,"hidden":false,"merged":[]}
[]
[]
[]
[null,null,"last one"]
[]
[]
[null,"Des. Code","Des. Name","System Code","وصف","عميل","امر رقم","رقم الامر من واقع بيانات الاصناف","التصنيف","التصنيف من واقع بيانات الاصناف","النوع","النوع من واقع بيانات الاصناف","مقاس","المقاس من واقع بيانات الاصناف","وزن / قطعه","الوزن من واقع بيانات الاصناف","GSM","Discreption of weight","Color","الدرجه","نوع الغزل","نوع الغزل من واقع بيانات الاصناف","نمره الغزل","نمره الغزل من واقع بيانات الاصناف","درجه الغزل","درجه الغزل من واقع بيانات الاصناف","free4","امين المخزن","الوزن القائم للشيكاره","العدد","الوزن اجمالى كجم","Pattern","Design Type",null,null,"اضافه","صرف","الرصيد"]
[null,"0002 - 34",{"$f":"VLOOKUP($B8,Store!$B$6:$AG$308,COLUMN()-1,0)","v":"lion - Blue"},{"$f":"VLOOKUP($B8,Store!$B$6:$AG$308,COLUMN()-1,0)","v":9114000002},{"$f":"VLOOKUP($B8,Store!$B$6:$AG$308,COLUMN()-1,0)","v":"مشكل عميل 34 اوردر 7002"},{"$f":"VLOOKUP($B8,Store!$B$6:$AG$308,COLUMN()-1,0)","v":34},{"$f":"VLOOKUP($B8,Store!$B$6:$AG$308,COLUMN()-1,0)","v":7002},{"$f":"VLOOKUP($B8,Store!$B$6:$AG$308,COLUMN()-1,0)","v":7001},{"$f":"VLOOKUP($B8,Store!$B$6:$AG$308,COLUMN()-1,0)","v":"Kitchen Towel"},{"$f":"VLOOKUP($B8,Store!$B$6:$AG$308,COLUMN()-1,0)","v":"Kitchen Towel"},{"$f":"VLOOKUP($B8,Store!$B$6:$AG$308,COLUMN()-1,0)","v":"Flat"},{"$f":"VLOOKUP($B8,Store!$B$6:$AG$308,COLUMN()-1,0)","v":"Flat"},{"$f":"VLOOKUP($B8,Store!$B$6:$AG$308,COLUMN()-1,0)","v":"50 X 70"},{"$f":"VLOOKUP($B8,Store!$B$6:$AG$308,COLUMN()-1,0)","v":"50 X 70"},{"$f":"VLOOKUP($B8,Store!$B$6:$AG$308,COLUMN()-1,0)","v":75},{"$f":"VLOOKUP($B8,Store!$B$6:$AG$308,COLUMN()-1,0)","v":8.7999999999999995E-2},{"$f":"VLOOKUP($B8,Store!$B$6:$AG$308,COLUMN()-1,0)","v":250},{"$f":"VLOOKUP($B8,Store!$B$6:$AG$308,COLUMN()-1,0)","v":"Light weight"},{"$f":"VLOOKUP($B8,Store!$B$6:$AG$308,COLUMN()-1,0)","v":"dark"},{"$f":"VLOOKUP($B8,Store!$B$6:$AG$308,COLUMN()-1,0)","v":"Second Choice"},{"$f":"VLOOKUP($B8,Store!$B$6:$AG$308,COLUMN()-1,0)","v":"100% cotton"},{"$f":"VLOOKUP($B8,Store!$B$6:$AG$308,COLUMN()-1,0)","v":"100% cotton - Organic"},{"$f":"VLOOKUP($B8,Store!$B$6:$AG$308,COLUMN()-1,0)","v":"24/2 - 16/1"},{"$f":"VLOOKUP($B8,Store!$B$6:$AG$308,COLUMN()-1,0)","v":"24/2 - 16/1"},{"$f":"VLOOKUP($B8,Store!$B$6:$AG$308,COLUMN()-1,0)","v":"Fresh"},{"$f":"VLOOKUP($B8,Store!$B$6:$AG$308,COLUMN()-1,0)","v":"Fresh"},{"$f":"VLOOKUP($B8,Store!$B$6:$AG$308,COLUMN()-1,0)","v":0},{"$f":"VLOOKUP($B8,Store!$B$6:$AG$308,COLUMN()-1,0)","v":"محمود"},{"$f":"VLOOKUP($B8,Store!$B$6:$AG$308,COLUMN()-1,0)","v":16},{"$f":"VLOOKUP($B8,Store!$B$6:$AG$308,COLUMN()-1,0)","v":20},{"$f":"VLOOKUP($B8,Store!$B$6:$AG$308,COLUMN()-1,0)","v":1.5},{"$f":"VLOOKUP($B8,Store!$B$6:$AG$308,COLUMN()-1,0)","v":0},{"$f":"VLOOKUP($B8,Store!$B$6:$AG$308,COLUMN()-1,0)","v":"Normal"},null,null,{"$f":"SUMIFS(Store!$AD$6:$AD$308,Store!$B$6:$B$308,Rassed!B8,Store!$AH$6:$AH$308,\"اضافه\")","v":60},{"$f":"SUMIFS(Store!$AD$6:$AD$308,Store!$B$6:$B$308,Rassed!B8,Store!$AN$6:$AN$308,\"صرف\")","v":60},{"$f":"AJ8-AK8","v":0}]
[null,"0001 - 34",{"$f":"VLOOKUP($B9,Store!$B$6:$AG$308,COLUMN()-1,0)","v":"lion - Brown"},{"$f":"VLOOKUP($B9,Store!$B$6:$AG$308,COLUMN()-1,0)","v":"9114000001"},{"$f":"VLOOKUP($B9,Store!$B$6:$AG$308,COLUMN()-1,0)","v":"مشكل عميل 34 اوردر 7002"},{"$f":"VLOOKUP($B9,Store!$B$6:$AG$308,COLUMN()-1,0)","v":34},{"$f":"VLOOKUP($B9,Store!$B$6:$AG$308,COLUMN()-1,0)","v":7002},{"$f":"VLOOKUP($B9,Store!$B$6:$AG$308,COLUMN()-1,0)","v":7001},{"$f":"VLOOKUP($B9,Store!$B$6:$AG$308,COLUMN()-1,0)","v":"Kitchen Towel"},{"$f":"VLOOKUP($B9,Store!$B$6:$AG$308,COLUMN()-1,0)","v":"Kitchen Towel"},{"$f":"VLOOKUP($B9,Store!$B$6:$AG$308,COLUMN()-1,0)","v":"Flat"},{"$f":"VLOOKUP($B9,Store!$B$6:$AG$308,COLUMN()-1,0)","v":"Flat"},{"$f":"VLOOKUP($B9,Store!$B$6:$AG$308,COLUMN()-1,0)","v":"50 X 70"},{"$f":"VLOOKUP($B9,Store!$B$6:$AG$308,COLUMN()-1,0)","v":"50 X 70"},{"$f":"VLOOKUP($B9,Store!$B$6:$AG$308,COLUMN()-1,0)","v":75},{"$f":"VLOOKUP($B9,Store!$B$6:$AG$308,COLUMN()-1,0)","v":8.7999999999999995E-2},{"$f":"VLOOKUP($B9,Store!$B$6:$AG$308,COLUMN()-1,0)","v":250},{"$f":"VLOOKUP($B9,Store!$B$6:$AG$308,COLUMN()-1,0)","v":"Light weight"},{"$f":"VLOOKUP($B9,Store!$B$6:$AG$308,COLUMN()-1,0)","v":"dark"},{"$f":"VLOOKUP($B9,Store!$B$6:$AG$308,COLUMN()-1,0)","v":"Second Choice"},{"$f":"VLOOKUP($B9,Store!$B$6:$AG$308,COLUMN()-1,0)","v":"100% cotton"},{"$f":"VLOOKUP($B9,Store!$B$6:$AG$308,COLUMN()-1,0)","v":"100% cotton - Organic"},{"$f":"VLOOKUP($B9,Store!$B$6:$AG$308,COLUMN()-1,0)","v":"24/2 - 16/1"},{"$f":"VLOOKUP($B9,Store!$B$6:$AG$308,COLUMN()-1,0)","v":"24/2 - 16/1"},{"$f":"VLOOKUP($B9,Store!$B$6:$AG$308,COLUMN()-1,0)","v":"Fresh"},{"$f":"VLOOKUP($B9,Store!$B$6:$AG$308,COLUMN()-1,0)","v":"Fresh"},{"$f":"VLOOKUP($B9,Store!$B$6:$AG$308,COLUMN()-1,0)","v":0},{"$f":"VLOOKUP($B9,Store!$B$6:$AG$308,COLUMN()-1,0)","v":"محمود"},{"$f":"VLOOKUP($B9,Store!$B$6:$AG$308,COLUMN()-1,0)","v":16},{"$f":"VLOOKUP($B9,Store!$B$6:$AG$308,COLUMN()-1,0)","v":20},{"$f":"VLOOKUP($B9,Store!$B$6:$AG$308,COLUMN()-1,0)","v":1.5},{"$f":"VLOOKUP($B9,Store!$B$6:$AG$308,COLUMN()-1,0)","v":0},{"$f":"VLOOKUP($B9,Store!$B$6:$AG$308,COLUMN()-1,0)","v":"Normal"},null,null,{"$f":"SUMIFS(Store!$AD$6:$AD$308,Store!$B$6:$B$308,Rassed!B9,Store!$AH$6:$AH$308,\"اضافه\")","v":60},{"$f":"SUMIFS(Store!$AD$6:$AD$308,Store!$B$6:$B$308,Rassed!B9,Store!$AN$6:$AN$308,\"صرف\")","v":60},{"$f":"AJ9-AK9","v":0}]
[null,"0003 - 34",{"$f":"VLOOKUP($B10,Store!$B$6:$AG$308,COLUMN()-1,0)","v":"tiger - yellow"},{"$f":"VLOOKUP($B10,Store!$B$6:$AG$308,COLUMN()-1,0)","v":"9112000001"},{"$f":"VLOOKUP($B10,Store!$B$6:$AG$308,COLUMN()-1,0)","v":"مشكل عميل 34 اوردر 7002"},{"$f":"VLOOKUP($B10,Store!$B$6:$AG$308,COLUMN()-1,0)","v":34},{"$f":"VLOOKUP($B10,Store!$B$6:$AG$308,COLUMN()-1,0)","v":7002},{"$f":"VLOOKUP($B10,Store!$B$6:$AG$308,COLUMN()-1,0)","v":7001},{"$f":"VLOOKUP($B10,Store!$B$6:$AG$308,COLUMN()-1,0)","v":"Kitchen Towel"},{"$f":"VLOOKUP($B10,Store!$B$6:$AG$308,COLUMN()-1,0)","v":"Beach Towel"},{"$f":"VLOOKUP($B10,Store!$B$6:$AG$308,COLUMN()-1,0)","v":"Flat"},{"$f":"VLOOKUP($B10,Store!$B$6:$AG$308,COLUMN()-1,0)","v":"Velour"},{"$f":"VLOOKUP($B10,Store!$B$6:$AG$308,COLUMN()-1,0)","v":"50 X 70"},{"$f":"VLOOKUP($B10,Store!$B$6:$AG$308,COLUMN()-1,0)","v":"100 x 170"},{"$f":"VLOOKUP($B10,Store!$B$6:$AG$308,COLUMN()-1,0)","v":75},{"$f":"VLOOKUP($B10,Store!$B$6:$AG$308,COLUMN()-1,0)","v":0.71399999999999997},{"$f":"VLOOKUP($B10,Store!$B$6:$AG$308,COLUMN()-1,0)","v":420},{"$f":"VLOOKUP($B10,Store!$B$6:$AG$308,COLUMN()-1,0)","v":"Medium weight"},{"$f":"VLOOKUP($B10,Store!$B$6:$AG$308,COLUMN()-1,0)","v":"dark"},{"$f":"VLOOKUP($B10,Store!$B$6:$AG$308,COLUMN()-1,0)","v":"Second Choice"},{"$f":"VLOOKUP($B10,Store!$B$6:$AG$308,COLUMN()-1,0)","v":"100% cotton"},{"$f":"VLOOKUP($B10,Store!$B$6:$AG$308,COLUMN()-1,0)","v":"100% cotton - Organic"},{"$f":"VLOOKUP($B10,Store!$B$6:$AG$308,COLUMN()-1,0)","v":"24/2 - 16/1"},{"$f":"VLOOKUP($B10,Store!$B$6:$AG$308,COLUMN()-1,0)","v":"24/2 - 24/2 - 16/1"},{"$f":"VLOOKUP($B10,Store!$B$6:$AG$308,COLUMN()-1,0)","v":"Fresh"},{"$f":"VLOOKUP($B10,Store!$B$6:$AG$308,COLUMN()-1,0)","v":"Fresh"},{"$f":"VLOOKUP($B10,Store!$B$6:$AG$308,COLUMN()-1,0)","v":0},{"$f":"VLOOKUP($B10,Store!$B$6:$AG$308,COLUMN()-1,0)","v":"محمود"},{"$f":"VLOOKUP($B10,Store!$B$6:$AG$308,COLUMN()-1,0)","v":16},{"$f":"VLOOKUP($B10,Store!$B$6:$AG$308,COLUMN()-1,0)","v":30},{"$f":"VLOOKUP($B10,Store!$B$6:$AG$308,COLUMN()-1,0)","v":2.25},{"$f":"VLOOKUP($B10,Store!$B$6:$AG$308,COLUMN()-1,0)","v":0},{"$f":"VLOOKUP($B10,Store!$B$6:$AG$308,COLUMN()-1,0)","v":"Normal"},null,null,{"$f":"SUMIFS(Store!$AD$6:$AD$308,Store!$B$6:$B$308,Rassed!B10,Store!$AH$6:$AH$308,\"اضافه\")","v":90},{"$f":"SUMIFS(Store!$AD$6:$AD$308,Store!$B$6:$B$308,Rassed!B10,Store!$AN$6:$AN$308,\"صرف\")","v":90},0]
[null,"0004 - 34",{"$f":"VLOOKUP($B11,Store!$B$6:$AG$308,COLUMN()-1,0)","v":"tiger - Orange"},{"$f":"VLOOKUP($B11,Store!$B$6:$AG$308,COLUMN()-1,0)","v":9112000002},{"$f":"VLOOKUP($B11,Store!$B$6:$AG$308,COLUMN()-1,0)","v":"مشكل عميل 34 اوردر 7002"},{"$f":"VLOOKUP($B11,Store!$B$6:$AG$308,COLUMN()-1,0)","v":34},{"$f":"VLOOKUP($B11,Store!$B$6:$AG$308,COLUMN()-1,0)","v":7002},{"$f":"VLOOKUP($B11,Store!$B$6:$AG$308,COLUMN()-1,0)","v":7001},{"$f":"VLOOKUP($B11,Store!$B$6:$AG$308,COLUMN()-1,0)","v":"Kitchen Towel"},{"$f":"VLOOKUP($B11,Store!$B$6:$AG$308,COLUMN()-1,0)","v":"Beach Towel"},{"$f":"VLOOKUP($B11,Store!$B$6:$AG$308,COLUMN()-1,0)","v":"Flat"},{"$f":"VLOOKUP($B11,Store!$B$6:$AG$308,COLUMN()-1,0)","v":"Velour"},{"$f":"VLOOKUP($B11,Store!$B$6:$AG$308,COLUMN()-1,0)","v":"50 X 70"},{"$f":"VLOOKUP($B11,Store!$B$6:$AG$308,COLUMN()-1,0)","v":"100 x 170"},{"$f":"VLOOKUP($B11,Store!$B$6:$AG$308,COLUMN()-1,0)","v":75},{"$f":"VLOOKUP($B11,Store!$B$6:$AG$308,COLUMN()-1,0)","v":0.71399999999999997},{"$f":"VLOOKUP($B11,Store!$B$6:$AG$308,COLUMN()-1,0)","v":420},{"$f":"VLOOKUP($B11,Store!$B$6:$AG$308,COLUMN()-1,0)","v":"Medium weight"},{"$f":"VLOOKUP($B11,Store!$B$6:$AG$308,COLUMN()-1,0)","v":"dark"},{"$f":"VLOOKUP($B11,Store!$B$6:$AG$308,COLUMN()-1,0)","v":"Second Choice"},{"$f":"VLOOKUP($B11,Store!$B$6:$AG$308,COLUMN()-1,0)","v":"100% cotton"},{"$f":"VLOOKUP($B11,Store!$B$6:$AG$308,COLUMN()-1,0)","v":"100% cotton - Organic"},{"$f":"VLOOKUP($B11,Store!$B$6:$AG$308,COLUMN()-1,0)","v":"24/2 - 16/1"},{"$f":"VLOOKUP($B11,Store!$B$6:$AG$308,COLUMN()-1,0)","v":"24/2 - 24/2 - 16/1"},{"$f":"VLOOKUP($B11,Store!$B$6:$AG$308,COLUMN()-1,0)","v":"Fresh"},{"$f":"VLOOKUP($B11,Store!$B$6:$AG$308,COLUMN()-1,0)","v":"Fresh"},{"$f":"VLOOKUP($B11,Store!$B$6:$AG$308,COLUMN()-1,0)","v":0},{"$f":"VLOOKUP($B11,Store!$B$6:$AG$308,COLUMN()-1,0)","v":"محمود"},{"$f":"VLOOKUP($B11,Store!$B$6:$AG$308,COLUMN()-1,0)","v":16},{"$f":"VLOOKUP($B11,Store!$B$6:$AG$308,COLUMN()-1,0)","v":50},{"$f":"VLOOKUP($B11,Store!$B$6:$AG$308,COLUMN()-1,0)","v":3.75},{"$f":"VLOOKUP($B11,Store!$B$6:$AG$308,COLUMN()-1,0)","v":0},{"$f":"VLOOKUP($B11,Store!$B$6:$AG$308,COLUMN()-1,0)","v":"Normal"},null,null,{"$f":"SUMIFS(Store!$AD$6:$AD$308,Store!$B$6:$B$308,Rassed!B11,Store!$AH$6:$AH$308,\"اضافه\")","v":150},{"$f":"SUMIFS(Store!$AD$6:$AD$308,Store!$B$6:$B$308,Rassed!B11,Store!$AN$6:$AN$308,\"صرف\")","v":150},0]
[null,"0005 - 34",{"$f":"VLOOKUP($B12,Store!$B$6:$AG$308,COLUMN()-1,0)","v":"sun - red"},{"$f":"VLOOKUP($B12,Store!$B$6:$AG$308,COLUMN()-1,0)","v":9112000003},{"$f":"VLOOKUP($B12,Store!$B$6:$AG$308,COLUMN()-1,0)","v":"مشكل عميل 34 اوردر 7002"},{"$f":"VLOOKUP($B12,Store!$B$6:$AG$308,COLUMN()-1,0)","v":34},{"$f":"VLOOKUP($B12,Store!$B$6:$AG$308,COLUMN()-1,0)","v":7002},{"$f":"VLOOKUP($B12,Store!$B$6:$AG$308,COLUMN()-1,0)","v":7002},{"$f":"VLOOKUP($B12,Store!$B$6:$AG$308,COLUMN()-1,0)","v":"Kitchen Towel"},{"$f":"VLOOKUP($B12,Store!$B$6:$AG$308,COLUMN()-1,0)","v":"Beach Towel"},{"$f":"VLOOKUP($B12,Store!$B$6:$AG$308,COLUMN()-1,0)","v":"Flat"},{"$f":"VLOOKUP($B12,Store!$B$6:$AG$308,COLUMN()-1,0)","v":"Velour"},{"$f":"VLOOKUP($B12,Store!$B$6:$AG$308,COLUMN()-1,0)","v":"50 X 70"},{"$f":"VLOOKUP($B12,Store!$B$6:$AG$308,COLUMN()-1,0)","v":"90 x 160"},{"$f":"VLOOKUP($B12,Store!$B$6:$AG$308,COLUMN()-1,0)","v":75},{"$f":"VLOOKUP($B12,Store!$B$6:$AG$308,COLUMN()-1,0)","v":0.57599999999999996},{"$f":"VLOOKUP($B12,Store!$B$6:$AG$308,COLUMN()-1,0)","v":400},{"$f":"VLOOKUP($B12,Store!$B$6:$AG$308,COLUMN()-1,0)","v":"Medium weight"},{"$f":"VLOOKUP($B12,Store!$B$6:$AG$308,COLUMN()-1,0)","v":"dark"},{"$f":"VLOOKUP($B12,Store!$B$6:$AG$308,COLUMN()-1,0)","v":"Second Choice"},{"$f":"VLOOKUP($B12,Store!$B$6:$AG$308,COLUMN()-1,0)","v":"100% cotton"},{"$f":"VLOOKUP($B12,Store!$B$6:$AG$308,COLUMN()-1,0)","v":"100% cotton"},{"$f":"VLOOKUP($B12,Store!$B$6:$AG$308,COLUMN()-1,0)","v":"24/2 - 16/1"},{"$f":"VLOOKUP($B12,Store!$B$6:$AG$308,COLUMN()-1,0)","v":"24/2 - 24/2 - 16/1"},{"$f":"VLOOKUP($B12,Store!$B$6:$AG$308,COLUMN()-1,0)","v":"Fresh"},{"$f":"VLOOKUP($B12,Store!$B$6:$AG$308,COLUMN()-1,0)","v":"Fresh"},{"$f":"VLOOKUP($B12,Store!$B$6:$AG$308,COLUMN()-1,0)","v":0},{"$f":"VLOOKUP($B12,Store!$B$6:$AG$308,COLUMN()-1,0)","v":"محمود"},{"$f":"VLOOKUP($B12,Store!$B$6:$AG$308,COLUMN()-1,0)","v":16},{"$f":"VLOOKUP($B12,Store!$B$6:$AG$308,COLUMN()-1,0)","v":10},{"$f":"VLOOKUP($B12,Store!$B$6:$AG$308,COLUMN()-1,0)","v":0.75},{"$f":"VLOOKUP($B12,Store!$B$6:$AG$308,COLUMN()-1,0)","v":0},{"$f":"VLOOKUP($B12,Store!$B$6:$AG$308,COLUMN()-1,0)","v":"Normal"},null,null,{"$f":"SUMIFS(Store!$AD$6:$AD$308,Store!$B$6:$B$308,Rassed!B12,Store!$AH$6:$AH$308,\"اضافه\")","v":30},{"$f":"SUMIFS(Store!$AD$6:$AD$308,Store!$B$6:$B$308,Rassed!B12,Store!$AN$6:$AN$308,\"صرف\")","v":30},0]
[null,"0006 - 34",{"$f":"VLOOKUP($B13,Store!$B$6:$AG$308,COLUMN()-1,0)","v":"sun - orange"},{"$f":"VLOOKUP($B13,Store!$B$6:$AG$308,COLUMN()-1,0)","v":9112000004},{"$f":"VLOOKUP($B13,Store!$B$6:$AG$308,COLUMN()-1,0)","v":"مشكل عميل 34 اوردر 7002"},{"$f":"VLOOKUP($B13,Store!$B$6:$AG$308,COLUMN()-1,0)","v":34},{"$f":"VLOOKUP($B13,Store!$B$6:$AG$308,COLUMN()-1,0)","v":7002},{"$f":"VLOOKUP($B13,Store!$B$6:$AG$308,COLUMN()-1,0)","v":7002},{"$f":"VLOOKUP($B13,Store!$B$6:$AG$308,COLUMN()-1,0)","v":"Kitchen Towel"},{"$f":"VLOOKUP($B13,Store!$B$6:$AG$308,COLUMN()-1,0)","v":"Beach Towel"},{"$f":"VLOOKUP($B13,Store!$B$6:$AG$308,COLUMN()-1,0)","v":"Flat"},{"$f":"VLOOKUP($B13,Store!$B$6:$AG$308,COLUMN()-1,0)","v":"Velour"},{"$f":"VLOOKUP($B13,Store!$B$6:$AG$308,COLUMN()-1,0)","v":"50 X 70"},{"$f":"VLOOKUP($B13,Store!$B$6:$AG$308,COLUMN()-1,0)","v":"90 x 160"},{"$f":"VLOOKUP($B13,Store!$B$6:$AG$308,COLUMN()-1,0)","v":75},{"$f":"VLOOKUP($B13,Store!$B$6:$AG$308,COLUMN()-1,0)","v":0.57599999999999996},{"$f":"VLOOKUP($B13,Store!$B$6:$AG$308,COLUMN()-1,0)","v":400},{"$f":"VLOOKUP($B13,Store!$B$6:$AG$308,COLUMN()-1,0)","v":"Medium weight"},{"$f":"VLOOKUP($B13,Store!$B$6:$AG$308,COLUMN()-1,0)","v":"dark"},{"$f":"VLOOKUP($B13,Store!$B$6:$AG$308,COLUMN()-1,0)","v":"Second Choice"},{"$f":"VLOOKUP($B13,Store!$B$6:$AG$308,COLUMN()-1,0)","v":"100% cotton"},{"$f":"VLOOKUP($B13,Store!$B$6:$AG$308,COLUMN()-1,0)","v":"100% cotton"},{"$f":"VLOOKUP($B13,Store!$B$6:$AG$308,COLUMN()-1,0)","v":"24/2 - 16/1"},{"$f":"VLOOKUP($B13,Store!$B$6:$AG$308,COLUMN()-1,0)","v":"24/2 - 24/2 - 16/1"},{"$f":"VLOOKUP($B13,Store!$B$6:$AG$308,COLUMN()-1,0)","v":"Fresh"},{"$f":"VLOOKUP($B13,Store!$B$6:$AG$308,COLUMN()-1,0)","v":"Fresh"},{"$f":"VLOOKUP($B13,Store!$B$6:$AG$308,COLUMN()-1,0)","v":0},{"$f":"VLOOKUP($B13,Store!$B$6:$AG$308,COLUMN()-1,0)","v":"محمود"},{"$f":"VLOOKUP($B13,Store!$B$6:$AG$308,COLUMN()-1,0)","v":16},{"$f":"VLOOKUP($B13,Store!$B$6:$AG$308,COLUMN()-1,0)","v":25},{"$f":"VLOOKUP($B13,Store!$B$6:$AG$308,COLUMN()-1,0)","v":1.875},{"$f":"VLOOKUP($B13,Store!$B$6:$AG$308,COLUMN()-1,0)","v":"DOBBY"},{"$f":"VLOOKUP($B13,Store!$B$6:$AG$308,COLUMN()-1,0)","v":"Normal"},null,null,{"$f":"SUMIFS(Store!$AD$6:$AD$308,Store!$B$6:$B$308,Rassed!B13,Store!$AH$6:$AH$308,\"اضافه\")","v":75},{"$f":"SUMIFS(Store!$AD$6:$AD$308,Store!$B$6:$B$308,Rassed!B13,Store!$AN$6:$AN$308,\"صرف\")","v":75},0]
[null,"0007 - 34",{"$f":"VLOOKUP($B14,Store!$B$6:$AG$308,COLUMN()-1,0)","v":"LOO"},{"$f":"VLOOKUP($B14,Store!$B$6:$AG$308,COLUMN()-1,0)","v":9114000003},{"$f":"VLOOKUP($B14,Store!$B$6:$AG$308,COLUMN()-1,0)","v":"مشكل عميل 34 اوردر 7002"},{"$f":"VLOOKUP($B14,Store!$B$6:$AG$308,COLUMN()-1,0)","v":34},{"$f":"VLOOKUP($B14,Store!$B$6:$AG$308,COLUMN()-1,0)","v":7002},{"$f":"VLOOKUP($B14,Store!$B$6:$AG$308,COLUMN()-1,0)","v":7003},{"$f":"VLOOKUP($B14,Store!$B$6:$AG$308,COLUMN()-1,0)","v":"Kitchen Towel"},{"$f":"VLOOKUP($B14,Store!$B$6:$AG$308,COLUMN()-1,0)","v":"Kitchen Towel"},{"$f":"VLOOKUP($B14,Store!$B$6:$AG$308,COLUMN()-1,0)","v":"Flat"},{"$f":"VLOOKUP($B14,Store!$B$6:$AG$308,COLUMN()-1,0)","v":"Flat"},{"$f":"VLOOKUP($B14,Store!$B$6:$AG$308,COLUMN()-1,0)","v":"50 X 70"},{"$f":"VLOOKUP($B14,Store!$B$6:$AG$308,COLUMN()-1,0)","v":"50 X 70"},{"$f":"VLOOKUP($B14,Store!$B$6:$AG$308,COLUMN()-1,0)","v":75},{"$f":"VLOOKUP($B14,Store!$B$6:$AG$308,COLUMN()-1,0)","v":7.0000000000000007E-2},{"$f":"VLOOKUP($B14,Store!$B$6:$AG$308,COLUMN()-1,0)","v":200},{"$f":"VLOOKUP($B14,Store!$B$6:$AG$308,COLUMN()-1,0)","v":"Very Light weight"},{"$f":"VLOOKUP($B14,Store!$B$6:$AG$308,COLUMN()-1,0)","v":"dark"},{"$f":"VLOOKUP($B14,Store!$B$6:$AG$308,COLUMN()-1,0)","v":"Second Choice"},{"$f":"VLOOKUP($B14,Store!$B$6:$AG$308,COLUMN()-1,0)","v":"100% cotton"},{"$f":"VLOOKUP($B14,Store!$B$6:$AG$308,COLUMN()-1,0)","v":"100% cotton"},{"$f":"VLOOKUP($B14,Store!$B$6:$AG$308,COLUMN()-1,0)","v":"24/2 - 16/1"},{"$f":"VLOOKUP($B14,Store!$B$6:$AG$308,COLUMN()-1,0)","v":"24/2 - 16/1"},{"$f":"VLOOKUP($B14,Store!$B$6:$AG$308,COLUMN()-1,0)","v":"Fresh"},{"$f":"VLOOKUP($B14,Store!$B$6:$AG$308,COLUMN()-1,0)","v":"Fresh"},{"$f":"VLOOKUP($B14,Store!$B$6:$AG$308,COLUMN()-1,0)","v":0},{"$f":"VLOOKUP($B14,Store!$B$6:$AG$308,COLUMN()-1,0)","v":"محمود"},{"$f":"VLOOKUP($B14,Store!$B$6:$AG$308,COLUMN()-1,0)","v":16},{"$f":"VLOOKUP($B14,Store!$B$6:$AG$308,COLUMN()-1,0)","v":25},{"$f":"VLOOKUP($B14,Store!$B$6:$AG$308,COLUMN()-1,0)","v":1.875},{"$f":"VLOOKUP($B14,Store!$B$6:$AG$308,COLUMN()-1,0)","v":"Jacquard"},{"$f":"VLOOKUP($B14,Store!$B$6:$AG$308,COLUMN()-1,0)","v":"Normal"},null,null,{"$f":"SUMIFS(Store!$AD$6:$AD$308,Store!$B$6:$B$308,Rassed!B14,Store!$AH$6:$AH$308,\"اضافه\")","v":75},{"$f":"SUMIFS(Store!$AD$6:$AD$308,Store!$B$6:$B$308,Rassed!B14,Store!$AN$6:$AN$308,\"صرف\")","v":75},0]
[null,"0008 - 34",{"$f":"VLOOKUP($B15,Store!$B$6:$AG$308,COLUMN()-1,0)","v":"TOO"},{"$f":"VLOOKUP($B15,Store!$B$6:$AG$308,COLUMN()-1,0)","v":9114000004},{"$f":"VLOOKUP($B15,Store!$B$6:$AG$308,COLUMN()-1,0)","v":"مشكل عميل 34 اوردر 7002"},{"$f":"VLOOKUP($B15,Store!$B$6:$AG$308,COLUMN()-1,0)","v":34},{"$f":"VLOOKUP($B15,Store!$B$6:$AG$308,COLUMN()-1,0)","v":7002},{"$f":"VLOOKUP($B15,Store!$B$6:$AG$308,COLUMN()-1,0)","v":7003},{"$f":"VLOOKUP($B15,Store!$B$6:$AG$308,COLUMN()-1,0)","v":"Kitchen Towel"},{"$f":"VLOOKUP($B15,Store!$B$6:$AG$308,COLUMN()-1,0)","v":"Kitchen Towel"},{"$f":"VLOOKUP($B15,Store!$B$6:$AG$308,COLUMN()-1,0)","v":"Flat"},{"$f":"VLOOKUP($B15,Store!$B$6:$AG$308,COLUMN()-1,0)","v":"Flat"},{"$f":"VLOOKUP($B15,Store!$B$6:$AG$308,COLUMN()-1,0)","v":"50 X 70"},{"$f":"VLOOKUP($B15,Store!$B$6:$AG$308,COLUMN()-1,0)","v":"50 X 70"},{"$f":"VLOOKUP($B15,Store!$B$6:$AG$308,COLUMN()-1,0)","v":75},{"$f":"VLOOKUP($B15,Store!$B$6:$AG$308,COLUMN()-1,0)","v":7.0000000000000007E-2},{"$f":"VLOOKUP($B15,Store!$B$6:$AG$308,COLUMN()-1,0)","v":200},{"$f":"VLOOKUP($B15,Store!$B$6:$AG$308,COLUMN()-1,0)","v":"Very Light weight"},{"$f":"VLOOKUP($B15,Store!$B$6:$AG$308,COLUMN()-1,0)","v":"dark"},{"$f":"VLOOKUP($B15,Store!$B$6:$AG$308,COLUMN()-1,0)","v":"Second Choice"},{"$f":"VLOOKUP($B15,Store!$B$6:$AG$308,COLUMN()-1,0)","v":"100% cotton"},{"$f":"VLOOKUP($B15,Store!$B$6:$AG$308,COLUMN()-1,0)","v":"100% cotton"},{"$f":"VLOOKUP($B15,Store!$B$6:$AG$308,COLUMN()-1,0)","v":"24/2 - 16/1"},{"$f":"VLOOKUP($B15,Store!$B$6:$AG$308,COLUMN()-1,0)","v":"24/2 - 16/1"},{"$f":"VLOOKUP($B15,Store!$B$6:$AG$308,COLUMN()-1,0)","v":"Fresh"},{"$f":"VLOOKUP($B15,Store!$B$6:$AG$308,COLUMN()-1,0)","v":"Fresh"},{"$f":"VLOOKUP($B15,Store!$B$6:$AG$308,COLUMN()-1,0)","v":0},{"$f":"VLOOKUP($B15,Store!$B$6:$AG$308,COLUMN()-1,0)","v":"محمود"},{"$f":"VLOOKUP($B15,Store!$B$6:$AG$308,COLUMN()-1,0)","v":16},{"$f":"VLOOKUP($B15,Store!$B$6:$AG$308,COLUMN()-1,0)","v":10},{"$f":"VLOOKUP($B15,Store!$B$6:$AG$308,COLUMN()-1,0)","v":0.75},{"$f":"VLOOKUP($B15,Store!$B$6:$AG$308,COLUMN()-1,0)","v":"Jacquard"},{"$f":"VLOOKUP($B15,Store!$B$6:$AG$308,COLUMN()-1,0)","v":"Normal"},null,null,{"$f":"SUMIFS(Store!$AD$6:$AD$308,Store!$B$6:$B$308,Rassed!B15,Store!$AH$6:$AH$308,\"اضافه\")","v":30},{"$f":"SUMIFS(Store!$AD$6:$AD$308,Store!$B$6:$B$308,Rassed!B15,Store!$AN$6:$AN$308,\"صرف\")","v":30},0]
[null,"0010 - 34",{"$f":"VLOOKUP($B16,Store!$B$6:$AG$308,COLUMN()-1,0)","v":"BOO"},{"$f":"VLOOKUP($B16,Store!$B$6:$AG$308,COLUMN()-1,0)","v":9114000006},{"$f":"VLOOKUP($B16,Store!$B$6:$AG$308,COLUMN()-1,0)","v":"مشكل عميل 34 اوردر 7002"},{"$f":"VLOOKUP($B16,Store!$B$6:$AG$308,COLUMN()-1,0)","v":34},{"$f":"VLOOKUP($B16,Store!$B$6:$AG$308,COLUMN()-1,0)","v":7002},{"$f":"VLOOKUP($B16,Store!$B$6:$AG$308,COLUMN()-1,0)","v":7003},{"$f":"VLOOKUP($B16,Store!$B$6:$AG$308,COLUMN()-1,0)","v":"Kitchen Towel"},{"$f":"VLOOKUP($B16,Store!$B$6:$AG$308,COLUMN()-1,0)","v":"Kitchen Towel"},{"$f":"VLOOKUP($B16,Store!$B$6:$AG$308,COLUMN()-1,0)","v":"Flat"},{"$f":"VLOOKUP($B16,Store!$B$6:$AG$308,COLUMN()-1,0)","v":"Flat"},{"$f":"VLOOKUP($B16,Store!$B$6:$AG$308,COLUMN()-1,0)","v":"50 X 70"},{"$f":"VLOOKUP($B16,Store!$B$6:$AG$308,COLUMN()-1,0)","v":"50 X 70"},{"$f":"VLOOKUP($B16,Store!$B$6:$AG$308,COLUMN()-1,0)","v":75},{"$f":"VLOOKUP($B16,Store!$B$6:$AG$308,COLUMN()-1,0)","v":7.0000000000000007E-2},{"$f":"VLOOKUP($B16,Store!$B$6:$AG$308,COLUMN()-1,0)","v":200},{"$f":"VLOOKUP($B16,Store!$B$6:$AG$308,COLUMN()-1,0)","v":"Very Light weight"},{"$f":"VLOOKUP($B16,Store!$B$6:$AG$308,COLUMN()-1,0)","v":"dark"},{"$f":"VLOOKUP($B16,Store!$B$6:$AG$308,COLUMN()-1,0)","v":"Second Choice"},{"$f":"VLOOKUP($B16,Store!$B$6:$AG$308,COLUMN()-1,0)","v":"100% cotton"},{"$f":"VLOOKUP($B16,Store!$B$6:$AG$308,COLUMN()-1,0)","v":"100% cotton"},{"$f":"VLOOKUP($B16,Store!$B$6:$AG$308,COLUMN()-1,0)","v":"24/2 - 16/1"},{"$f":"VLOOKUP($B16,Store!$B$6:$AG$308,COLUMN()-1,0)","v":"24/2 - 16/1"},{"$f":"VLOOKUP($B16,Store!$B$6:$AG$308,COLUMN()-1,0)","v":"Fresh"},{"$f":"VLOOKUP($B16,Store!$B$6:$AG$308,COLUMN()-1,0)","v":"Fresh"},{"$f":"VLOOKUP($B16,Store!$B$6:$AG$308,COLUMN()-1,0)","v":0},{"$f":"VLOOKUP($B16,Store!$B$6:$AG$308,COLUMN()-1,0)","v":"محمود"},{"$f":"VLOOKUP($B16,Store!$B$6:$AG$308,COLUMN()-1,0)","v":16},{"$f":"VLOOKUP($B16,Store!$B$6:$AG$308,COLUMN()-1,0)","v":10},{"$f":"VLOOKUP($B16,Store!$B$6:$AG$308,COLUMN()-1,0)","v":0.75},{"$f":"VLOOKUP($B16,Store!$B$6:$AG$308,COLUMN()-1,0)","v":"Jacquard"},{"$f":"VLOOKUP($B16,Store!$B$6:$AG$308,COLUMN()-1,0)","v":"Normal"},null,null,{"$f":"SUMIFS(Store!$AD$6:$AD$308,Store!$B$6:$B$308,Rassed!B16,Store!$AH$6:$AH$308,\"اضافه\")","v":30},{"$f":"SUMIFS(Store!$AD$6:$AD$308,Store!$B$6:$B$308,Rassed!B16,Store!$AN$6:$AN$308,\"صرف\")","v":30},0]
[null,"0013 - 34",{"$f":"VLOOKUP($B17,Store!$B$6:$AG$308,COLUMN()-1,0)","v":"AAAA"},{"$f":"VLOOKUP($B17,Store!$B$6:$AG$308,COLUMN()-1,0)","v":9114000009},{"$f":"VLOOKUP($B17,Store!$B$6:$AG$308,COLUMN()-1,0)","v":"مشكل عميل 34 اوردر 7002"},{"$f":"VLOOKUP($B17,Store!$B$6:$AG$308,COLUMN()-1,0)","v":34},{"$f":"VLOOKUP($B17,Store!$B$6:$AG$308,COLUMN()-1,0)","v":7007},{"$f":"VLOOKUP($B17,Store!$B$6:$AG$308,COLUMN()-1,0)","v":7007},{"$f":"VLOOKUP($B17,Store!$B$6:$AG$308,COLUMN()-1,0)","v":"Kitchen Towel"},{"$f":"VLOOKUP($B17,Store!$B$6:$AG$308,COLUMN()-1,0)","v":"Kitchen Towel"},{"$f":"VLOOKUP($B17,Store!$B$6:$AG$308,COLUMN()-1,0)","v":"Flat"},{"$f":"VLOOKUP($B17,Store!$B$6:$AG$308,COLUMN()-1,0)","v":"Flat"},{"$f":"VLOOKUP($B17,Store!$B$6:$AG$308,COLUMN()-1,0)","v":"50 X 70"},{"$f":"VLOOKUP($B17,Store!$B$6:$AG$308,COLUMN()-1,0)","v":"50 X 70"},{"$f":"VLOOKUP($B17,Store!$B$6:$AG$308,COLUMN()-1,0)","v":70},{"$f":"VLOOKUP($B17,Store!$B$6:$AG$308,COLUMN()-1,0)","v":70},{"$f":"VLOOKUP($B17,Store!$B$6:$AG$308,COLUMN()-1,0)","v":200},{"$f":"VLOOKUP($B17,Store!$B$6:$AG$308,COLUMN()-1,0)","v":"Very Light weight"},{"$f":"VLOOKUP($B17,Store!$B$6:$AG$308,COLUMN()-1,0)","v":"dark"},{"$f":"VLOOKUP($B17,Store!$B$6:$AG$308,COLUMN()-1,0)","v":"Second Choice"},{"$f":"VLOOKUP($B17,Store!$B$6:$AG$308,COLUMN()-1,0)","v":"100% cotton"},{"$f":"VLOOKUP($B17,Store!$B$6:$AG$308,COLUMN()-1,0)","v":"100% cotton"},{"$f":"VLOOKUP($B17,Store!$B$6:$AG$308,COLUMN()-1,0)","v":"24/2 - 16/1"},{"$f":"VLOOKUP($B17,Store!$B$6:$AG$308,COLUMN()-1,0)","v":"24/2 - 16/1"},{"$f":"VLOOKUP($B17,Store!$B$6:$AG$308,COLUMN()-1,0)","v":"Fresh"},{"$f":"VLOOKUP($B17,Store!$B$6:$AG$308,COLUMN()-1,0)","v":"Fresh"},{"$f":"VLOOKUP($B17,Store!$B$6:$AG$308,COLUMN()-1,0)","v":0},{"$f":"VLOOKUP($B17,Store!$B$6:$AG$308,COLUMN()-1,0)","v":"محمود"},{"$f":"VLOOKUP($B17,Store!$B$6:$AG$308,COLUMN()-1,0)","v":1.2},{"$f":"VLOOKUP($B17,Store!$B$6:$AG$308,COLUMN()-1,0)","v":20},{"$f":"VLOOKUP($B17,Store!$B$6:$AG$308,COLUMN()-1,0)","v":1.4},{"$f":"VLOOKUP($B17,Store!$B$6:$AG$308,COLUMN()-1,0)","v":"Jacquard"},{"$f":"VLOOKUP($B17,Store!$B$6:$AG$308,COLUMN()-1,0)","v":"Normal"},null,null,{"$f":"SUMIFS(Store!$AD$6:$AD$308,Store!$B$6:$B$308,Rassed!B17,Store!$AH$6:$AH$308,\"اضافه\")","v":52},{"$f":"SUMIFS(Store!$AD$6:$AD$308,Store!$B$6:$B$308,Rassed!B17,Store!$AN$6:$AN$308,\"صرف\")","v":112},-60]
[null,"0014 - 34",{"$f":"VLOOKUP($B18,Store!$B$6:$AG$308,COLUMN()-1,0)","v":"BBBB"},{"$f":"VLOOKUP($B18,Store!$B$6:$AG$308,COLUMN()-1,0)","v":9114000010},{"$f":"VLOOKUP($B18,Store!$B$6:$AG$308,COLUMN()-1,0)","v":"مشكل عميل 34 اوردر 7002"},{"$f":"VLOOKUP($B18,Store!$B$6:$AG$308,COLUMN()-1,0)","v":34},{"$f":"VLOOKUP($B18,Store!$B$6:$AG$308,COLUMN()-1,0)","v":7007},{"$f":"VLOOKUP($B18,Store!$B$6:$AG$308,COLUMN()-1,0)","v":7007},{"$f":"VLOOKUP($B18,Store!$B$6:$AG$308,COLUMN()-1,0)","v":"Kitchen Towel"},{"$f":"VLOOKUP($B18,Store!$B$6:$AG$308,COLUMN()-1,0)","v":"Kitchen Towel"},{"$f":"VLOOKUP($B18,Store!$B$6:$AG$308,COLUMN()-1,0)","v":"Flat"},{"$f":"VLOOKUP($B18,Store!$B$6:$AG$308,COLUMN()-1,0)","v":"Flat"},{"$f":"VLOOKUP($B18,Store!$B$6:$AG$308,COLUMN()-1,0)","v":"50 X 70"},{"$f":"VLOOKUP($B18,Store!$B$6:$AG$308,COLUMN()-1,0)","v":"50 X 70"},{"$f":"VLOOKUP($B18,Store!$B$6:$AG$308,COLUMN()-1,0)","v":70},{"$f":"VLOOKUP($B18,Store!$B$6:$AG$308,COLUMN()-1,0)","v":70},{"$f":"VLOOKUP($B18,Store!$B$6:$AG$308,COLUMN()-1,0)","v":200},{"$f":"VLOOKUP($B18,Store!$B$6:$AG$308,COLUMN()-1,0)","v":"Very Light weight"},{"$f":"VLOOKUP($B18,Store!$B$6:$AG$308,COLUMN()-1,0)","v":"dark"},{"$f":"VLOOKUP($B18,Store!$B$6:$AG$308,COLUMN()-1,0)","v":"Second Choice"},{"$f":"VLOOKUP($B18,Store!$B$6:$AG$308,COLUMN()-1,0)","v":"100% cotton"},{"$f":"VLOOKUP($B18,Store!$B$6:$AG$308,COLUMN()-1,0)","v":"100% cotton"},{"$f":"VLOOKUP($B18,Store!$B$6:$AG$308,COLUMN()-1,0)","v":"24/2 - 16/1"},{"$f":"VLOOKUP($B18,Store!$B$6:$AG$308,COLUMN()-1,0)","v":"24/2 - 16/1"},{"$f":"VLOOKUP($B18,Store!$B$6:$AG$308,COLUMN()-1,0)","v":"Fresh"},{"$f":"VLOOKUP($B18,Store!$B$6:$AG$308,COLUMN()-1,0)","v":"Fresh"},{"$f":"VLOOKUP($B18,Store!$B$6:$AG$308,COLUMN()-1,0)","v":0},{"$f":"VLOOKUP($B18,Store!$B$6:$AG$308,COLUMN()-1,0)","v":"محمود"},{"$f":"VLOOKUP($B18,Store!$B$6:$AG$308,COLUMN()-1,0)","v":1.2},{"$f":"VLOOKUP($B18,Store!$B$6:$AG$308,COLUMN()-1,0)","v":20},{"$f":"VLOOKUP($B18,Store!$B$6:$AG$308,COLUMN()-1,0)","v":1.4},{"$f":"VLOOKUP($B18,Store!$B$6:$AG$308,COLUMN()-1,0)","v":"Dobby"},{"$f":"VLOOKUP($B18,Store!$B$6:$AG$308,COLUMN()-1,0)","v":"Normal"},null,null,{"$f":"SUMIFS(Store!$AD$6:$AD$308,Store!$B$6:$B$308,Rassed!B18,Store!$AH$6:$AH$308,\"اضافه\")","v":73},{"$f":"SUMIFS(Store!$AD$6:$AD$308,Store!$B$6:$B$308,Rassed!B18,Store!$AN$6:$AN$308,\"صرف\")","v":143},-70]
[null,"0015 - 34",{"$f":"VLOOKUP($B19,Store!$B$6:$AG$308,COLUMN()-1,0)","v":"CCCC"},{"$f":"VLOOKUP($B19,Store!$B$6:$AG$308,COLUMN()-1,0)","v":9114000011},{"$f":"VLOOKUP($B19,Store!$B$6:$AG$308,COLUMN()-1,0)","v":"مشكل عميل 34 اوردر 7002"},{"$f":"VLOOKUP($B19,Store!$B$6:$AG$308,COLUMN()-1,0)","v":34},{"$f":"VLOOKUP($B19,Store!$B$6:$AG$308,COLUMN()-1,0)","v":7007},{"$f":"VLOOKUP($B19,Store!$B$6:$AG$308,COLUMN()-1,0)","v":7007},{"$f":"VLOOKUP($B19,Store!$B$6:$AG$308,COLUMN()-1,0)","v":"Kitchen Towel"},{"$f":"VLOOKUP($B19,Store!$B$6:$AG$308,COLUMN()-1,0)","v":"Kitchen Towel"},{"$f":"VLOOKUP($B19,Store!$B$6:$AG$308,COLUMN()-1,0)","v":"Flat"},{"$f":"VLOOKUP($B19,Store!$B$6:$AG$308,COLUMN()-1,0)","v":"Flat"},{"$f":"VLOOKUP($B19,Store!$B$6:$AG$308,COLUMN()-1,0)","v":"50 X 70"},{"$f":"VLOOKUP($B19,Store!$B$6:$AG$308,COLUMN()-1,0)","v":"50 X 70"},{"$f":"VLOOKUP($B19,Store!$B$6:$AG$308,COLUMN()-1,0)","v":70},{"$f":"VLOOKUP($B19,Store!$B$6:$AG$308,COLUMN()-1,0)","v":70},{"$f":"VLOOKUP($B19,Store!$B$6:$AG$308,COLUMN()-1,0)","v":200},{"$f":"VLOOKUP($B19,Store!$B$6:$AG$308,COLUMN()-1,0)","v":"Very Light weight"},{"$f":"VLOOKUP($B19,Store!$B$6:$AG$308,COLUMN()-1,0)","v":"dark"},{"$f":"VLOOKUP($B19,Store!$B$6:$AG$308,COLUMN()-1,0)","v":"Second Choice"},{"$f":"VLOOKUP($B19,Store!$B$6:$AG$308,COLUMN()-1,0)","v":"100% cotton"},{"$f":"VLOOKUP($B19,Store!$B$6:$AG$308,COLUMN()-1,0)","v":"100% cotton"},{"$f":"VLOOKUP($B19,Store!$B$6:$AG$308,COLUMN()-1,0)","v":"24/2 - 16/1"},{"$f":"VLOOKUP($B19,Store!$B$6:$AG$308,COLUMN()-1,0)","v":"24/2 - 16/1"},{"$f":"VLOOKUP($B19,Store!$B$6:$AG$308,COLUMN()-1,0)","v":"Fresh"},{"$f":"VLOOKUP($B19,Store!$B$6:$AG$308,COLUMN()-1,0)","v":"Fresh"},{"$f":"VLOOKUP($B19,Store!$B$6:$AG$308,COLUMN()-1,0)","v":0},{"$f":"VLOOKUP($B19,Store!$B$6:$AG$308,COLUMN()-1,0)","v":"محمود"},{"$f":"VLOOKUP($B19,Store!$B$6:$AG$308,COLUMN()-1,0)","v":1.8000000000000003},{"$f":"VLOOKUP($B19,Store!$B$6:$AG$308,COLUMN()-1,0)","v":30},{"$f":"VLOOKUP($B19,Store!$B$6:$AG$308,COLUMN()-1,0)","v":2.1},{"$f":"VLOOKUP($B19,Store!$B$6:$AG$308,COLUMN()-1,0)","v":"Jacquard"},{"$f":"VLOOKUP($B19,Store!$B$6:$AG$308,COLUMN()-1,0)","v":"Normal"},null,null,{"$f":"SUMIFS(Store!$AD$6:$AD$308,Store!$B$6:$B$308,Rassed!B19,Store!$AH$6:$AH$308,\"اضافه\")","v":105},{"$f":"SUMIFS(Store!$AD$6:$AD$308,Store!$B$6:$B$308,Rassed!B19,Store!$AN$6:$AN$308,\"صرف\")","v":195},-90]
[null,"0016 - 34",{"$f":"VLOOKUP($B20,Store!$B$6:$AG$308,COLUMN()-1,0)","v":"DDDD"},{"$f":"VLOOKUP($B20,Store!$B$6:$AG$308,COLUMN()-1,0)","v":9114000012},{"$f":"VLOOKUP($B20,Store!$B$6:$AG$308,COLUMN()-1,0)","v":"مشكل عميل 34 اوردر 7002"},{"$f":"VLOOKUP($B20,Store!$B$6:$AG$308,COLUMN()-1,0)","v":34},{"$f":"VLOOKUP($B20,Store!$B$6:$AG$308,COLUMN()-1,0)","v":7007},{"$f":"VLOOKUP($B20,Store!$B$6:$AG$308,COLUMN()-1,0)","v":7007},{"$f":"VLOOKUP($B20,Store!$B$6:$AG$308,COLUMN()-1,0)","v":"Kitchen Towel"},{"$f":"VLOOKUP($B20,Store!$B$6:$AG$308,COLUMN()-1,0)","v":"Kitchen Towel"},{"$f":"VLOOKUP($B20,Store!$B$6:$AG$308,COLUMN()-1,0)","v":"Flat"},{"$f":"VLOOKUP($B20,Store!$B$6:$AG$308,COLUMN()-1,0)","v":"Flat"},{"$f":"VLOOKUP($B20,Store!$B$6:$AG$308,COLUMN()-1,0)","v":"50 X 70"},{"$f":"VLOOKUP($B20,Store!$B$6:$AG$308,COLUMN()-1,0)","v":"50 X 70"},{"$f":"VLOOKUP($B20,Store!$B$6:$AG$308,COLUMN()-1,0)","v":70},{"$f":"VLOOKUP($B20,Store!$B$6:$AG$308,COLUMN()-1,0)","v":70},{"$f":"VLOOKUP($B20,Store!$B$6:$AG$308,COLUMN()-1,0)","v":200},{"$f":"VLOOKUP($B20,Store!$B$6:$AG$308,COLUMN()-1,0)","v":"Very Light weight"},{"$f":"VLOOKUP($B20,Store!$B$6:$AG$308,COLUMN()-1,0)","v":"dark"},{"$f":"VLOOKUP($B20,Store!$B$6:$AG$308,COLUMN()-1,0)","v":"Second Choice"},{"$f":"VLOOKUP($B20,Store!$B$6:$AG$308,COLUMN()-1,0)","v":"100% cotton"},{"$f":"VLOOKUP($B20,Store!$B$6:$AG$308,COLUMN()-1,0)","v":"100% cotton"},{"$f":"VLOOKUP($B20,Store!$B$6:$AG$308,COLUMN()-1,0)","v":"24/2 - 16/1"},{"$f":"VLOOKUP($B20,Store!$B$6:$AG$308,COLUMN()-1,0)","v":"24/2 - 16/1"},{"$f":"VLOOKUP($B20,Store!$B$6:$AG$308,COLUMN()-1,0)","v":"Fresh"},{"$f":"VLOOKUP($B20,Store!$B$6:$AG$308,COLUMN()-1,0)","v":"Fresh"},{"$f":"VLOOKUP($B20,Store!$B$6:$AG$308,COLUMN()-1,0)","v":0},{"$f":"VLOOKUP($B20,Store!$B$6:$AG$308,COLUMN()-1,0)","v":"محمود"},{"$f":"VLOOKUP($B20,Store!$B$6:$AG$308,COLUMN()-1,0)","v":3},{"$f":"VLOOKUP($B20,Store!$B$6:$AG$308,COLUMN()-1,0)","v":50},{"$f":"VLOOKUP($B20,Store!$B$6:$AG$308,COLUMN()-1,0)","v":3.5},{"$f":"VLOOKUP($B20,Store!$B$6:$AG$308,COLUMN()-1,0)","v":"Dobby"},{"$f":"VLOOKUP($B20,Store!$B$6:$AG$308,COLUMN()-1,0)","v":"Normal"},null,null,{"$f":"SUMIFS(Store!$AD$6:$AD$308,Store!$B$6:$B$308,Rassed!B20,Store!$AH$6:$AH$308,\"اضافه\")","v":112},{"$f":"SUMIFS(Store!$AD$6:$AD$308,Store!$B$6:$B$308,Rassed!B20,Store!$AN$6:$AN$308,\"صرف\")","v":224},-112]
[null,"0017 - 34",{"$f":"VLOOKUP($B21,Store!$B$6:$AG$308,COLUMN()-1,0)","v":"EEEE"},{"$f":"VLOOKUP($B21,Store!$B$6:$AG$308,COLUMN()-1,0)","v":9114000013},{"$f":"VLOOKUP($B21,Store!$B$6:$AG$308,COLUMN()-1,0)","v":"مشكل عميل 34 اوردر 7002"},{"$f":"VLOOKUP($B21,Store!$B$6:$AG$308,COLUMN()-1,0)","v":34},{"$f":"VLOOKUP($B21,Store!$B$6:$AG$308,COLUMN()-1,0)","v":7007},{"$f":"VLOOKUP($B21,Store!$B$6:$AG$308,COLUMN()-1,0)","v":7007},{"$f":"VLOOKUP($B21,Store!$B$6:$AG$308,COLUMN()-1,0)","v":"Kitchen Towel"},{"$f":"VLOOKUP($B21,Store!$B$6:$AG$308,COLUMN()-1,0)","v":"Kitchen Towel"},{"$f":"VLOOKUP($B21,Store!$B$6:$AG$308,COLUMN()-1,0)","v":"Flat"},{"$f":"VLOOKUP($B21,Store!$B$6:$AG$308,COLUMN()-1,0)","v":"Flat"},{"$f":"VLOOKUP($B21,Store!$B$6:$AG$308,COLUMN()-1,0)","v":"50 X 70"},{"$f":"VLOOKUP($B21,Store!$B$6:$AG$308,COLUMN()-1,0)","v":"50 X 70"},{"$f":"VLOOKUP($B21,Store!$B$6:$AG$308,COLUMN()-1,0)","v":70},{"$f":"VLOOKUP($B21,Store!$B$6:$AG$308,COLUMN()-1,0)","v":70},{"$f":"VLOOKUP($B21,Store!$B$6:$AG$308,COLUMN()-1,0)","v":200},{"$f":"VLOOKUP($B21,Store!$B$6:$AG$308,COLUMN()-1,0)","v":"Very Light weight"},{"$f":"VLOOKUP($B21,Store!$B$6:$AG$308,COLUMN()-1,0)","v":"dark"},{"$f":"VLOOKUP($B21,Store!$B$6:$AG$308,COLUMN()-1,0)","v":"Second Choice"},{"$f":"VLOOKUP($B21,Store!$B$6:$AG$308,COLUMN()-1,0)","v":"100% cotton"},{"$f":"VLOOKUP($B21,Store!$B$6:$AG$308,COLUMN()-1,0)","v":"100% cotton"},{"$f":"VLOOKUP($B21,Store!$B$6:$AG$308,COLUMN()-1,0)","v":"24/2 - 16/1"},{"$f":"VLOOKUP($B21,Store!$B$6:$AG$308,COLUMN()-1,0)","v":"24/2 - 16/1"},{"$f":"VLOOKUP($B21,Store!$B$6:$AG$308,COLUMN()-1,0)","v":"Fresh"},{"$f":"VLOOKUP($B21,Store!$B$6:$AG$308,COLUMN()-1,0)","v":"Fresh"},{"$f":"VLOOKUP($B21,Store!$B$6:$AG$308,COLUMN()-1,0)","v":0},{"$f":"VLOOKUP($B21,Store!$B$6:$AG$308,COLUMN()-1,0)","v":"محمود"},{"$f":"VLOOKUP($B21,Store!$B$6:$AG$308,COLUMN()-1,0)","v":0.6},{"$f":"VLOOKUP($B21,Store!$B$6:$AG$308,COLUMN()-1,0)","v":10},{"$f":"VLOOKUP($B21,Store!$B$6:$AG$308,COLUMN()-1,0)","v":0.7},{"$f":"VLOOKUP($B21,Store!$B$6:$AG$308,COLUMN()-1,0)","v":"Dobby"},{"$f":"VLOOKUP($B21,Store!$B$6:$AG$308,COLUMN()-1,0)","v":"Normal"},null,null,{"$f":"SUMIFS(Store!$AD$6:$AD$308,Store!$B$6:$B$308,Rassed!B21,Store!$AH$6:$AH$308,\"اضافه\")","v":30},{"$f":"SUMIFS(Store!$AD$6:$AD$308,Store!$B$6:$B$308,Rassed!B21,Store!$AN$6:$AN$308,\"صرف\")","v":60},-30]
[null,"0018 - 34",{"$f":"VLOOKUP($B22,Store!$B$6:$AG$308,COLUMN()-1,0)","v":"FFFFF"},{"$f":"VLOOKUP($B22,Store!$B$6:$AG$308,COLUMN()-1,0)","v":9114000014},{"$f":"VLOOKUP($B22,Store!$B$6:$AG$308,COLUMN()-1,0)","v":"مشكل عميل 34 اوردر 7002"},{"$f":"VLOOKUP($B22,Store!$B$6:$AG$308,COLUMN()-1,0)","v":34},{"$f":"VLOOKUP($B22,Store!$B$6:$AG$308,COLUMN()-1,0)","v":7007},{"$f":"VLOOKUP($B22,Store!$B$6:$AG$308,COLUMN()-1,0)","v":7007},{"$f":"VLOOKUP($B22,Store!$B$6:$AG$308,COLUMN()-1,0)","v":"Kitchen Towel"},{"$f":"VLOOKUP($B22,Store!$B$6:$AG$308,COLUMN()-1,0)","v":"Kitchen Towel"},{"$f":"VLOOKUP($B22,Store!$B$6:$AG$308,COLUMN()-1,0)","v":"Flat"},{"$f":"VLOOKUP($B22,Store!$B$6:$AG$308,COLUMN()-1,0)","v":"Flat"},{"$f":"VLOOKUP($B22,Store!$B$6:$AG$308,COLUMN()-1,0)","v":"50 X 70"},{"$f":"VLOOKUP($B22,Store!$B$6:$AG$308,COLUMN()-1,0)","v":"50 X 70"},{"$f":"VLOOKUP($B22,Store!$B$6:$AG$308,COLUMN()-1,0)","v":70},{"$f":"VLOOKUP($B22,Store!$B$6:$AG$308,COLUMN()-1,0)","v":70},{"$f":"VLOOKUP($B22,Store!$B$6:$AG$308,COLUMN()-1,0)","v":200},{"$f":"VLOOKUP($B22,Store!$B$6:$AG$308,COLUMN()-1,0)","v":"Very Light weight"},{"$f":"VLOOKUP($B22,Store!$B$6:$AG$308,COLUMN()-1,0)","v":"dark"},{"$f":"VLOOKUP($B22,Store!$B$6:$AG$308,COLUMN()-1,0)","v":"Second Choice"},{"$f":"VLOOKUP($B22,Store!$B$6:$AG$308,COLUMN()-1,0)","v":"100% cotton"},{"$f":"VLOOKUP($B22,Store!$B$6:$AG$308,COLUMN()-1,0)","v":"100% cotton"},{"$f":"VLOOKUP($B22,Store!$B$6:$AG$308,COLUMN()-1,0)","v":"24/2 - 16/1"},{"$f":"VLOOKUP($B22,Store!$B$6:$AG$308,COLUMN()-1,0)","v":"24/2 - 16/1"},{"$f":"VLOOKUP($B22,Store!$B$6:$AG$308,COLUMN()-1,0)","v":"Fresh"},{"$f":"VLOOKUP($B22,Store!$B$6:$AG$308,COLUMN()-1,0)","v":"Fresh"},{"$f":"VLOOKUP($B22,Store!$B$6:$AG$308,COLUMN()-1,0)","v":0},{"$f":"VLOOKUP($B22,Store!$B$6:$AG$308,COLUMN()-1,0)","v":"محمود"},{"$f":"VLOOKUP($B22,Store!$B$6:$AG$308,COLUMN()-1,0)","v":1.5},{"$f":"VLOOKUP($B22,Store!$B$6:$AG$308,COLUMN()-1,0)","v":25},{"$f":"VLOOKUP($B22,Store!$B$6:$AG$308,COLUMN()-1,0)","v":1.75},{"$f":"VLOOKUP($B22,Store!$B$6:$AG$308,COLUMN()-1,0)","v":"Jacquard"},{"$f":"VLOOKUP($B22,Store!$B$6:$AG$308,COLUMN()-1,0)","v":"Normal"},null,null,{"$f":"SUMIFS(Store!$AD$6:$AD$308,Store!$B$6:$B$308,Rassed!B22,Store!$AH$6:$AH$308,\"اضافه\")","v":50},{"$f":"SUMIFS(Store!$AD$6:$AD$308,Store!$B$6:$B$308,Rassed!B22,Store!$AN$6:$AN$308,\"صرف\")","v":114},-64]
[null,"0019 - 34",{"$f":"VLOOKUP($B23,Store!$B$6:$AG$308,COLUMN()-1,0)","v":"GGGG"},{"$f":"VLOOKUP($B23,Store!$B$6:$AG$308,COLUMN()-1,0)","v":9114000015},{"$f":"VLOOKUP($B23,Store!$B$6:$AG$308,COLUMN()-1,0)","v":"مشكل عميل 34 اوردر 7002"},{"$f":"VLOOKUP($B23,Store!$B$6:$AG$308,COLUMN()-1,0)","v":34},{"$f":"VLOOKUP($B23,Store!$B$6:$AG$308,COLUMN()-1,0)","v":7007},{"$f":"VLOOKUP($B23,Store!$B$6:$AG$308,COLUMN()-1,0)","v":7007},{"$f":"VLOOKUP($B23,Store!$B$6:$AG$308,COLUMN()-1,0)","v":"Kitchen Towel"},{"$f":"VLOOKUP($B23,Store!$B$6:$AG$308,COLUMN()-1,0)","v":"Kitchen Towel"},{"$f":"VLOOKUP($B23,Store!$B$6:$AG$308,COLUMN()-1,0)","v":"Flat"},{"$f":"VLOOKUP($B23,Store!$B$6:$AG$308,COLUMN()-1,0)","v":"Flat"},{"$f":"VLOOKUP($B23,Store!$B$6:$AG$308,COLUMN()-1,0)","v":"50 X 70"},{"$f":"VLOOKUP($B23,Store!$B$6:$AG$308,COLUMN()-1,0)","v":"50 X 70"},{"$f":"VLOOKUP($B23,Store!$B$6:$AG$308,COLUMN()-1,0)","v":70},{"$f":"VLOOKUP($B23,Store!$B$6:$AG$308,COLUMN()-1,0)","v":70},{"$f":"VLOOKUP($B23,Store!$B$6:$AG$308,COLUMN()-1,0)","v":200},{"$f":"VLOOKUP($B23,Store!$B$6:$AG$308,COLUMN()-1,0)","v":"Very Light weight"},{"$f":"VLOOKUP($B23,Store!$B$6:$AG$308,COLUMN()-1,0)","v":"dark"},{"$f":"VLOOKUP($B23,Store!$B$6:$AG$308,COLUMN()-1,0)","v":"Second Choice"},{"$f":"VLOOKUP($B23,Store!$B$6:$AG$308,COLUMN()-1,0)","v":"100% cotton"},{"$f":"VLOOKUP($B23,Store!$B$6:$AG$308,COLUMN()-1,0)","v":"100% cotton"},{"$f":"VLOOKUP($B23,Store!$B$6:$AG$308,COLUMN()-1,0)","v":"24/2 - 16/1"},{"$f":"VLOOKUP($B23,Store!$B$6:$AG$308,COLUMN()-1,0)","v":"24/2 - 16/1"},{"$f":"VLOOKUP($B23,Store!$B$6:$AG$308,COLUMN()-1,0)","v":"Fresh"},{"$f":"VLOOKUP($B23,Store!$B$6:$AG$308,COLUMN()-1,0)","v":"Fresh"},{"$f":"VLOOKUP($B23,Store!$B$6:$AG$308,COLUMN()-1,0)","v":0},{"$f":"VLOOKUP($B23,Store!$B$6:$AG$308,COLUMN()-1,0)","v":"محمود"},{"$f":"VLOOKUP($B23,Store!$B$6:$AG$308,COLUMN()-1,0)","v":1.5},{"$f":"VLOOKUP($B23,Store!$B$6:$AG$308,COLUMN()-1,0)","v":25},{"$f":"VLOOKUP($B23,Store!$B$6:$AG$308,COLUMN()-1,0)","v":1.75},{"$f":"VLOOKUP($B23,Store!$B$6:$AG$308,COLUMN()-1,0)","v":"Dobby"},{"$f":"VLOOKUP($B23,Store!$B$6:$AG$308,COLUMN()-1,0)","v":"Normal"},null,null,{"$f":"SUMIFS(Store!$AD$6:$AD$308,Store!$B$6:$B$308,Rassed!B23,Store!$AH$6:$AH$308,\"اضافه\")","v":57},{"$f":"SUMIFS(Store!$AD$6:$AD$308,Store!$B$6:$B$308,Rassed!B23,Store!$AN$6:$AN$308,\"صرف\")","v":132},-75]
[null,"0020 - 34",{"$f":"VLOOKUP($B24,Store!$B$6:$AG$308,COLUMN()-1,0)","v":"HHHHH"},{"$f":"VLOOKUP($B24,Store!$B$6:$AG$308,COLUMN()-1,0)","v":9114000016},{"$f":"VLOOKUP($B24,Store!$B$6:$AG$308,COLUMN()-1,0)","v":"مشكل عميل 34 اوردر 7002"},{"$f":"VLOOKUP($B24,Store!$B$6:$AG$308,COLUMN()-1,0)","v":34},{"$f":"VLOOKUP($B24,Store!$B$6:$AG$308,COLUMN()-1,0)","v":7007},{"$f":"VLOOKUP($B24,Store!$B$6:$AG$308,COLUMN()-1,0)","v":7007},{"$f":"VLOOKUP($B24,Store!$B$6:$AG$308,COLUMN()-1,0)","v":"Kitchen Towel"},{"$f":"VLOOKUP($B24,Store!$B$6:$AG$308,COLUMN()-1,0)","v":"Kitchen Towel"},{"$f":"VLOOKUP($B24,Store!$B$6:$AG$308,COLUMN()-1,0)","v":"Flat"},{"$f":"VLOOKUP($B24,Store!$B$6:$AG$308,COLUMN()-1,0)","v":"Flat"},{"$f":"VLOOKUP($B24,Store!$B$6:$AG$308,COLUMN()-1,0)","v":"50 X 70"},{"$f":"VLOOKUP($B24,Store!$B$6:$AG$308,COLUMN()-1,0)","v":"50 X 70"},{"$f":"VLOOKUP($B24,Store!$B$6:$AG$308,COLUMN()-1,0)","v":70},{"$f":"VLOOKUP($B24,Store!$B$6:$AG$308,COLUMN()-1,0)","v":70},{"$f":"VLOOKUP($B24,Store!$B$6:$AG$308,COLUMN()-1,0)","v":200},{"$f":"VLOOKUP($B24,Store!$B$6:$AG$308,COLUMN()-1,0)","v":"Very Light weight"},{"$f":"VLOOKUP($B24,Store!$B$6:$AG$308,COLUMN()-1,0)","v":"dark"},{"$f":"VLOOKUP($B24,Store!$B$6:$AG$308,COLUMN()-1,0)","v":"Second Choice"},{"$f":"VLOOKUP($B24,Store!$B$6:$AG$308,COLUMN()-1,0)","v":"100% cotton"},{"$f":"VLOOKUP($B24,Store!$B$6:$AG$308,COLUMN()-1,0)","v":"100% cotton"},{"$f":"VLOOKUP($B24,Store!$B$6:$AG$308,COLUMN()-1,0)","v":"24/2 - 16/1"},{"$f":"VLOOKUP($B24,Store!$B$6:$AG$308,COLUMN()-1,0)","v":"24/2 - 16/1"},{"$f":"VLOOKUP($B24,Store!$B$6:$AG$308,COLUMN()-1,0)","v":"Fresh"},{"$f":"VLOOKUP($B24,Store!$B$6:$AG$308,COLUMN()-1,0)","v":"Fresh"},{"$f":"VLOOKUP($B24,Store!$B$6:$AG$308,COLUMN()-1,0)","v":0},{"$f":"VLOOKUP($B24,Store!$B$6:$AG$308,COLUMN()-1,0)","v":"محمود"},{"$f":"VLOOKUP($B24,Store!$B$6:$AG$308,COLUMN()-1,0)","v":0.6},{"$f":"VLOOKUP($B24,Store!$B$6:$AG$308,COLUMN()-1,0)","v":10},{"$f":"VLOOKUP($B24,Store!$B$6:$AG$308,COLUMN()-1,0)","v":0.7},{"$f":"VLOOKUP($B24,Store!$B$6:$AG$308,COLUMN()-1,0)","v":"Dobby"},{"$f":"VLOOKUP($B24,Store!$B$6:$AG$308,COLUMN()-1,0)","v":"Normal"},null,null,{"$f":"SUMIFS(Store!$AD$6:$AD$308,Store!$B$6:$B$308,Rassed!B24,Store!$AH$6:$AH$308,\"اضافه\")","v":32},{"$f":"SUMIFS(Store!$AD$6:$AD$308,Store!$B$6:$B$308,Rassed!B24,Store!$AN$6:$AN$308,\"صرف\")","v":62},-30]
[null,"0021 - 34",{"$f":"VLOOKUP($B25,Store!$B$6:$AG$308,COLUMN()-1,0)","v":"JJJJJJ"},{"$f":"VLOOKUP($B25,Store!$B$6:$AG$308,COLUMN()-1,0)","v":9114000017},{"$f":"VLOOKUP($B25,Store!$B$6:$AG$308,COLUMN()-1,0)","v":"مشكل عميل 34 اوردر 7002"},{"$f":"VLOOKUP($B25,Store!$B$6:$AG$308,COLUMN()-1,0)","v":34},{"$f":"VLOOKUP($B25,Store!$B$6:$AG$308,COLUMN()-1,0)","v":7007},{"$f":"VLOOKUP($B25,Store!$B$6:$AG$308,COLUMN()-1,0)","v":7007},{"$f":"VLOOKUP($B25,Store!$B$6:$AG$308,COLUMN()-1,0)","v":"Kitchen Towel"},{"$f":"VLOOKUP($B25,Store!$B$6:$AG$308,COLUMN()-1,0)","v":"Kitchen Towel"},{"$f":"VLOOKUP($B25,Store!$B$6:$AG$308,COLUMN()-1,0)","v":"Flat"},{"$f":"VLOOKUP($B25,Store!$B$6:$AG$308,COLUMN()-1,0)","v":"Flat"},{"$f":"VLOOKUP($B25,Store!$B$6:$AG$308,COLUMN()-1,0)","v":"50 X 70"},{"$f":"VLOOKUP($B25,Store!$B$6:$AG$308,COLUMN()-1,0)","v":"50 X 70"},{"$f":"VLOOKUP($B25,Store!$B$6:$AG$308,COLUMN()-1,0)","v":70},{"$f":"VLOOKUP($B25,Store!$B$6:$AG$308,COLUMN()-1,0)","v":70},{"$f":"VLOOKUP($B25,Store!$B$6:$AG$308,COLUMN()-1,0)","v":200},{"$f":"VLOOKUP($B25,Store!$B$6:$AG$308,COLUMN()-1,0)","v":"Very Light weight"},{"$f":"VLOOKUP($B25,Store!$B$6:$AG$308,COLUMN()-1,0)","v":"dark"},{"$f":"VLOOKUP($B25,Store!$B$6:$AG$308,COLUMN()-1,0)","v":"Second Choice"},{"$f":"VLOOKUP($B25,Store!$B$6:$AG$308,COLUMN()-1,0)","v":"100% cotton"},{"$f":"VLOOKUP($B25,Store!$B$6:$AG$308,COLUMN()-1,0)","v":"100% cotton"},{"$f":"VLOOKUP($B25,Store!$B$6:$AG$308,COLUMN()-1,0)","v":"24/2 - 16/1"},{"$f":"VLOOKUP($B25,Store!$B$6:$AG$308,COLUMN()-1,0)","v":"24/2 - 16/1"},{"$f":"VLOOKUP($B25,Store!$B$6:$AG$308,COLUMN()-1,0)","v":"Fresh"},{"$f":"VLOOKUP($B25,Store!$B$6:$AG$308,COLUMN()-1,0)","v":"Fresh"},{"$f":"VLOOKUP($B25,Store!$B$6:$AG$308,COLUMN()-1,0)","v":0},{"$f":"VLOOKUP($B25,Store!$B$6:$AG$308,COLUMN()-1,0)","v":"محمود"},{"$f":"VLOOKUP($B25,Store!$B$6:$AG$308,COLUMN()-1,0)","v":0.6},{"$f":"VLOOKUP($B25,Store!$B$6:$AG$308,COLUMN()-1,0)","v":10},{"$f":"VLOOKUP($B25,Store!$B$6:$AG$308,COLUMN()-1,0)","v":0.7},{"$f":"VLOOKUP($B25,Store!$B$6:$AG$308,COLUMN()-1,0)","v":"Jacquard"},{"$f":"VLOOKUP($B25,Store!$B$6:$AG$308,COLUMN()-1,0)","v":"Normal"},null,null,{"$f":"SUMIFS(Store!$AD$6:$AD$308,Store!$B$6:$B$308,Rassed!B25,Store!$AH$6:$AH$308,\"اضافه\")","v":40},{"$f":"SUMIFS(Store!$AD$6:$AD$308,Store!$B$6:$B$308,Rassed!B25,Store!$AN$6:$AN$308,\"صرف\")","v":70},-30]
[null,"0001 - 44",{"$f":"VLOOKUP($B26,Store!$B$6:$AG$308,COLUMN()-1,0)","v":"Elephnt"},{"$f":"VLOOKUP($B26,Store!$B$6:$AG$308,COLUMN()-1,0)","v":9114000018},{"$f":"VLOOKUP($B26,Store!$B$6:$AG$308,COLUMN()-1,0)","v":"مشكل عميل 44 اوردر 7008"},{"$f":"VLOOKUP($B26,Store!$B$6:$AG$308,COLUMN()-1,0)","v":44},{"$f":"VLOOKUP($B26,Store!$B$6:$AG$308,COLUMN()-1,0)","v":7008},{"$f":"VLOOKUP($B26,Store!$B$6:$AG$308,COLUMN()-1,0)","v":7008},{"$f":"VLOOKUP($B26,Store!$B$6:$AG$308,COLUMN()-1,0)","v":"Kitchen Towel"},{"$f":"VLOOKUP($B26,Store!$B$6:$AG$308,COLUMN()-1,0)","v":"Kitchen Towel"},{"$f":"VLOOKUP($B26,Store!$B$6:$AG$308,COLUMN()-1,0)","v":"Flat"},{"$f":"VLOOKUP($B26,Store!$B$6:$AG$308,COLUMN()-1,0)","v":"Flat"},{"$f":"VLOOKUP($B26,Store!$B$6:$AG$308,COLUMN()-1,0)","v":"50 X 70"},{"$f":"VLOOKUP($B26,Store!$B$6:$AG$308,COLUMN()-1,0)","v":"50 X 70"},{"$f":"VLOOKUP($B26,Store!$B$6:$AG$308,COLUMN()-1,0)","v":70},{"$f":"VLOOKUP($B26,Store!$B$6:$AG$308,COLUMN()-1,0)","v":70},{"$f":"VLOOKUP($B26,Store!$B$6:$AG$308,COLUMN()-1,0)","v":200},{"$f":"VLOOKUP($B26,Store!$B$6:$AG$308,COLUMN()-1,0)","v":"Very Light weight"},{"$f":"VLOOKUP($B26,Store!$B$6:$AG$308,COLUMN()-1,0)","v":"dark"},{"$f":"VLOOKUP($B26,Store!$B$6:$AG$308,COLUMN()-1,0)","v":"Second Choice"},{"$f":"VLOOKUP($B26,Store!$B$6:$AG$308,COLUMN()-1,0)","v":"100% cotton"},{"$f":"VLOOKUP($B26,Store!$B$6:$AG$308,COLUMN()-1,0)","v":"100% cotton"},{"$f":"VLOOKUP($B26,Store!$B$6:$AG$308,COLUMN()-1,0)","v":"24/2 - 16/1"},{"$f":"VLOOKUP($B26,Store!$B$6:$AG$308,COLUMN()-1,0)","v":"24/2 - 16/1"},{"$f":"VLOOKUP($B26,Store!$B$6:$AG$308,COLUMN()-1,0)","v":"Fresh"},{"$f":"VLOOKUP($B26,Store!$B$6:$AG$308,COLUMN()-1,0)","v":"Fresh"},{"$f":"VLOOKUP($B26,Store!$B$6:$AG$308,COLUMN()-1,0)","v":0},{"$f":"VLOOKUP($B26,Store!$B$6:$AG$308,COLUMN()-1,0)","v":"محمود"},{"$f":"VLOOKUP($B26,Store!$B$6:$AG$308,COLUMN()-1,0)","v":7.2727272727272716},{"$f":"VLOOKUP($B26,Store!$B$6:$AG$308,COLUMN()-1,0)","v":100},{"$f":"VLOOKUP($B26,Store!$B$6:$AG$308,COLUMN()-1,0)","v":7},{"$f":"VLOOKUP($B26,Store!$B$6:$AG$308,COLUMN()-1,0)","v":"Dobby"},{"$f":"VLOOKUP($B26,Store!$B$6:$AG$308,COLUMN()-1,0)","v":"Normal"},null,null,{"$f":"SUMIFS(Store!$AD$6:$AD$308,Store!$B$6:$B$308,Rassed!B26,Store!$AH$6:$AH$308,\"اضافه\")","v":1550},{"$f":"SUMIFS(Store!$AD$6:$AD$308,Store!$B$6:$B$308,Rassed!B26,Store!$AN$6:$AN$308,\"صرف\")","v":2050},-500]
[null,"0002 - 44",{"$f":"VLOOKUP($B27,Store!$B$6:$AG$308,COLUMN()-1,0)","v":"BroB"},{"$f":"VLOOKUP($B27,Store!$B$6:$AG$308,COLUMN()-1,0)","v":9114000019},{"$f":"VLOOKUP($B27,Store!$B$6:$AG$308,COLUMN()-1,0)","v":"مشكل عميل 44 اوردر 7008"},{"$f":"VLOOKUP($B27,Store!$B$6:$AG$308,COLUMN()-1,0)","v":44},{"$f":"VLOOKUP($B27,Store!$B$6:$AG$308,COLUMN()-1,0)","v":7008},{"$f":"VLOOKUP($B27,Store!$B$6:$AG$308,COLUMN()-1,0)","v":7008},{"$f":"VLOOKUP($B27,Store!$B$6:$AG$308,COLUMN()-1,0)","v":"Kitchen Towel"},{"$f":"VLOOKUP($B27,Store!$B$6:$AG$308,COLUMN()-1,0)","v":"Kitchen Towel"},{"$f":"VLOOKUP($B27,Store!$B$6:$AG$308,COLUMN()-1,0)","v":"Flat"},{"$f":"VLOOKUP($B27,Store!$B$6:$AG$308,COLUMN()-1,0)","v":"Flat"},{"$f":"VLOOKUP($B27,Store!$B$6:$AG$308,COLUMN()-1,0)","v":"50 X 70"},{"$f":"VLOOKUP($B27,Store!$B$6:$AG$308,COLUMN()-1,0)","v":"50 X 70"},{"$f":"VLOOKUP($B27,Store!$B$6:$AG$308,COLUMN()-1,0)","v":70},{"$f":"VLOOKUP($B27,Store!$B$6:$AG$308,COLUMN()-1,0)","v":70},{"$f":"VLOOKUP($B27,Store!$B$6:$AG$308,COLUMN()-1,0)","v":200},{"$f":"VLOOKUP($B27,Store!$B$6:$AG$308,COLUMN()-1,0)","v":"Very Light weight"},{"$f":"VLOOKUP($B27,Store!$B$6:$AG$308,COLUMN()-1,0)","v":"dark"},{"$f":"VLOOKUP($B27,Store!$B$6:$AG$308,COLUMN()-1,0)","v":"Second Choice"},{"$f":"VLOOKUP($B27,Store!$B$6:$AG$308,COLUMN()-1,0)","v":"100% cotton"},{"$f":"VLOOKUP($B27,Store!$B$6:$AG$308,COLUMN()-1,0)","v":"100% cotton"},{"$f":"VLOOKUP($B27,Store!$B$6:$AG$308,COLUMN()-1,0)","v":"24/2 - 16/1"},{"$f":"VLOOKUP($B27,Store!$B$6:$AG$308,COLUMN()-1,0)","v":"24/2 - 16/1"},{"$f":"VLOOKUP($B27,Store!$B$6:$AG$308,COLUMN()-1,0)","v":"Fresh"},{"$f":"VLOOKUP($B27,Store!$B$6:$AG$308,COLUMN()-1,0)","v":"Fresh"},{"$f":"VLOOKUP($B27,Store!$B$6:$AG$308,COLUMN()-1,0)","v":0},{"$f":"VLOOKUP($B27,Store!$B$6:$AG$308,COLUMN()-1,0)","v":"محمود"},{"$f":"VLOOKUP($B27,Store!$B$6:$AG$308,COLUMN()-1,0)","v":10.909090909090908},{"$f":"VLOOKUP($B27,Store!$B$6:$AG$308,COLUMN()-1,0)","v":150},{"$f":"VLOOKUP($B27,Store!$B$6:$AG$308,COLUMN()-1,0)","v":10.5},{"$f":"VLOOKUP($B27,Store!$B$6:$AG$308,COLUMN()-1,0)","v":"Dobby"},{"$f":"VLOOKUP($B27,Store!$B$6:$AG$308,COLUMN()-1,0)","v":"Normal"},null,null,{"$f":"SUMIFS(Store!$AD$6:$AD$308,Store!$B$6:$B$308,Rassed!B27,Store!$AH$6:$AH$308,\"اضافه\")","v":150},{"$f":"SUMIFS(Store!$AD$6:$AD$308,Store!$B$6:$B$308,Rassed!B27,Store!$AN$6:$AN$308,\"صرف\")","v":300},-150]
[null,"0003 - 44",{"$f":"VLOOKUP($B28,Store!$B$6:$AG$308,COLUMN()-1,0)","v":"hgh"},{"$f":"VLOOKUP($B28,Store!$B$6:$AG$308,COLUMN()-1,0)","v":9114000020},{"$f":"VLOOKUP($B28,Store!$B$6:$AG$308,COLUMN()-1,0)","v":"مشكل عميل 44 اوردر 7008"},{"$f":"VLOOKUP($B28,Store!$B$6:$AG$308,COLUMN()-1,0)","v":44},{"$f":"VLOOKUP($B28,Store!$B$6:$AG$308,COLUMN()-1,0)","v":7008},{"$f":"VLOOKUP($B28,Store!$B$6:$AG$308,COLUMN()-1,0)","v":7008},{"$f":"VLOOKUP($B28,Store!$B$6:$AG$308,COLUMN()-1,0)","v":"Kitchen Towel"},{"$f":"VLOOKUP($B28,Store!$B$6:$AG$308,COLUMN()-1,0)","v":"Kitchen Towel"},{"$f":"VLOOKUP($B28,Store!$B$6:$AG$308,COLUMN()-1,0)","v":"Flat"},{"$f":"VLOOKUP($B28,Store!$B$6:$AG$308,COLUMN()-1,0)","v":"Flat"},{"$f":"VLOOKUP($B28,Store!$B$6:$AG$308,COLUMN()-1,0)","v":"50 X 70"},{"$f":"VLOOKUP($B28,Store!$B$6:$AG$308,COLUMN()-1,0)","v":"50 X 70"},{"$f":"VLOOKUP($B28,Store!$B$6:$AG$308,COLUMN()-1,0)","v":70},{"$f":"VLOOKUP($B28,Store!$B$6:$AG$308,COLUMN()-1,0)","v":70},{"$f":"VLOOKUP($B28,Store!$B$6:$AG$308,COLUMN()-1,0)","v":200},{"$f":"VLOOKUP($B28,Store!$B$6:$AG$308,COLUMN()-1,0)","v":"Very Light weight"},{"$f":"VLOOKUP($B28,Store!$B$6:$AG$308,COLUMN()-1,0)","v":"dark"},{"$f":"VLOOKUP($B28,Store!$B$6:$AG$308,COLUMN()-1,0)","v":"Second Choice"},{"$f":"VLOOKUP($B28,Store!$B$6:$AG$308,COLUMN()-1,0)","v":"100% cotton"},{"$f":"VLOOKUP($B28,Store!$B$6:$AG$308,COLUMN()-1,0)","v":"100% cotton"},{"$f":"VLOOKUP($B28,Store!$B$6:$AG$308,COLUMN()-1,0)","v":"24/2 - 16/1"},{"$f":"VLOOKUP($B28,Store!$B$6:$AG$308,COLUMN()-1,0)","v":"24/2 - 16/2"},{"$f":"VLOOKUP($B28,Store!$B$6:$AG$308,COLUMN()-1,0)","v":"Fresh"},{"$f":"VLOOKUP($B28,Store!$B$6:$AG$308,COLUMN()-1,0)","v":"Fresh"},{"$f":"VLOOKUP($B28,Store!$B$6:$AG$308,COLUMN()-1,0)","v":0},{"$f":"VLOOKUP($B28,Store!$B$6:$AG$308,COLUMN()-1,0)","v":"محمود"},{"$f":"VLOOKUP($B28,Store!$B$6:$AG$308,COLUMN()-1,0)","v":14.545454545454543},{"$f":"VLOOKUP($B28,Store!$B$6:$AG$308,COLUMN()-1,0)","v":200},{"$f":"VLOOKUP($B28,Store!$B$6:$AG$308,COLUMN()-1,0)","v":14},{"$f":"VLOOKUP($B28,Store!$B$6:$AG$308,COLUMN()-1,0)","v":"Jacquard"},{"$f":"VLOOKUP($B28,Store!$B$6:$AG$308,COLUMN()-1,0)","v":"Normal"},null,null,{"$f":"SUMIFS(Store!$AD$6:$AD$308,Store!$B$6:$B$308,Rassed!B28,Store!$AH$6:$AH$308,\"اضافه\")","v":200},{"$f":"SUMIFS(Store!$AD$6:$AD$308,Store!$B$6:$B$308,Rassed!B28,Store!$AN$6:$AN$308,\"صرف\")","v":400},-200]
[null,"0004 - 44",{"$f":"VLOOKUP($B29,Store!$B$6:$AG$308,COLUMN()-1,0)","v":"yurturhy"},{"$f":"VLOOKUP($B29,Store!$B$6:$AG$308,COLUMN()-1,0)","v":9114000021},{"$f":"VLOOKUP($B29,Store!$B$6:$AG$308,COLUMN()-1,0)","v":"مشكل عميل 44 اوردر 7008"},{"$f":"VLOOKUP($B29,Store!$B$6:$AG$308,COLUMN()-1,0)","v":44},{"$f":"VLOOKUP($B29,Store!$B$6:$AG$308,COLUMN()-1,0)","v":7008},{"$f":"VLOOKUP($B29,Store!$B$6:$AG$308,COLUMN()-1,0)","v":7008},{"$f":"VLOOKUP($B29,Store!$B$6:$AG$308,COLUMN()-1,0)","v":"Kitchen Towel"},{"$f":"VLOOKUP($B29,Store!$B$6:$AG$308,COLUMN()-1,0)","v":"Kitchen Towel"},{"$f":"VLOOKUP($B29,Store!$B$6:$AG$308,COLUMN()-1,0)","v":"Flat"},{"$f":"VLOOKUP($B29,Store!$B$6:$AG$308,COLUMN()-1,0)","v":"Flat"},{"$f":"VLOOKUP($B29,Store!$B$6:$AG$308,COLUMN()-1,0)","v":"50 X 70"},{"$f":"VLOOKUP($B29,Store!$B$6:$AG$308,COLUMN()-1,0)","v":"50 X 70"},{"$f":"VLOOKUP($B29,Store!$B$6:$AG$308,COLUMN()-1,0)","v":70},{"$f":"VLOOKUP($B29,Store!$B$6:$AG$308,COLUMN()-1,0)","v":70},{"$f":"VLOOKUP($B29,Store!$B$6:$AG$308,COLUMN()-1,0)","v":200},{"$f":"VLOOKUP($B29,Store!$B$6:$AG$308,COLUMN()-1,0)","v":"Very Light weight"},{"$f":"VLOOKUP($B29,Store!$B$6:$AG$308,COLUMN()-1,0)","v":"dark"},{"$f":"VLOOKUP($B29,Store!$B$6:$AG$308,COLUMN()-1,0)","v":"Second Choice"},{"$f":"VLOOKUP($B29,Store!$B$6:$AG$308,COLUMN()-1,0)","v":"100% cotton"},{"$f":"VLOOKUP($B29,Store!$B$6:$AG$308,COLUMN()-1,0)","v":"100% cotton"},{"$f":"VLOOKUP($B29,Store!$B$6:$AG$308,COLUMN()-1,0)","v":"24/2 - 16/1"},{"$f":"VLOOKUP($B29,Store!$B$6:$AG$308,COLUMN()-1,0)","v":"24/2 - 16/3"},{"$f":"VLOOKUP($B29,Store!$B$6:$AG$308,COLUMN()-1,0)","v":"Fresh"},{"$f":"VLOOKUP($B29,Store!$B$6:$AG$308,COLUMN()-1,0)","v":"Fresh"},{"$f":"VLOOKUP($B29,Store!$B$6:$AG$308,COLUMN()-1,0)","v":0},{"$f":"VLOOKUP($B29,Store!$B$6:$AG$308,COLUMN()-1,0)","v":"محمود"},{"$f":"VLOOKUP($B29,Store!$B$6:$AG$308,COLUMN()-1,0)","v":21.818181818181817},{"$f":"VLOOKUP($B29,Store!$B$6:$AG$308,COLUMN()-1,0)","v":300},{"$f":"VLOOKUP($B29,Store!$B$6:$AG$308,COLUMN()-1,0)","v":21},{"$f":"VLOOKUP($B29,Store!$B$6:$AG$308,COLUMN()-1,0)","v":"Jacquard"},{"$f":"VLOOKUP($B29,Store!$B$6:$AG$308,COLUMN()-1,0)","v":"Normal"},null,null,{"$f":"SUMIFS(Store!$AD$6:$AD$308,Store!$B$6:$B$308,Rassed!B29,Store!$AH$6:$AH$308,\"اضافه\")","v":300},{"$f":"SUMIFS(Store!$AD$6:$AD$308,Store!$B$6:$B$308,Rassed!B29,Store!$AN$6:$AN$308,\"صرف\")","v":600},-300]
[null,"0005 - 44",{"$f":"VLOOKUP($B30,Store!$B$6:$AG$308,COLUMN()-1,0)","v":"dytrto"},{"$f":"VLOOKUP($B30,Store!$B$6:$AG$308,COLUMN()-1,0)","v":9114000022},{"$f":"VLOOKUP($B30,Store!$B$6:$AG$308,COLUMN()-1,0)","v":"مشكل عميل 44 اوردر 7008"},{"$f":"VLOOKUP($B30,Store!$B$6:$AG$308,COLUMN()-1,0)","v":44},{"$f":"VLOOKUP($B30,Store!$B$6:$AG$308,COLUMN()-1,0)","v":7008},{"$f":"VLOOKUP($B30,Store!$B$6:$AG$308,COLUMN()-1,0)","v":7008},{"$f":"VLOOKUP($B30,Store!$B$6:$AG$308,COLUMN()-1,0)","v":"Kitchen Towel"},{"$f":"VLOOKUP($B30,Store!$B$6:$AG$308,COLUMN()-1,0)","v":"Kitchen Towel"},{"$f":"VLOOKUP($B30,Store!$B$6:$AG$308,COLUMN()-1,0)","v":"Flat"},{"$f":"VLOOKUP($B30,Store!$B$6:$AG$308,COLUMN()-1,0)","v":"Flat"},{"$f":"VLOOKUP($B30,Store!$B$6:$AG$308,COLUMN()-1,0)","v":"50 X 70"},{"$f":"VLOOKUP($B30,Store!$B$6:$AG$308,COLUMN()-1,0)","v":"50 X 70"},{"$f":"VLOOKUP($B30,Store!$B$6:$AG$308,COLUMN()-1,0)","v":70},{"$f":"VLOOKUP($B30,Store!$B$6:$AG$308,COLUMN()-1,0)","v":70},{"$f":"VLOOKUP($B30,Store!$B$6:$AG$308,COLUMN()-1,0)","v":200},{"$f":"VLOOKUP($B30,Store!$B$6:$AG$308,COLUMN()-1,0)","v":"Very Light weight"},{"$f":"VLOOKUP($B30,Store!$B$6:$AG$308,COLUMN()-1,0)","v":"dark"},{"$f":"VLOOKUP($B30,Store!$B$6:$AG$308,COLUMN()-1,0)","v":"Second Choice"},{"$f":"VLOOKUP($B30,Store!$B$6:$AG$308,COLUMN()-1,0)","v":"100% cotton"},{"$f":"VLOOKUP($B30,Store!$B$6:$AG$308,COLUMN()-1,0)","v":"100% cotton"},{"$f":"VLOOKUP($B30,Store!$B$6:$AG$308,COLUMN()-1,0)","v":"24/2 - 16/1"},{"$f":"VLOOKUP($B30,Store!$B$6:$AG$308,COLUMN()-1,0)","v":"24/2 - 16/4"},{"$f":"VLOOKUP($B30,Store!$B$6:$AG$308,COLUMN()-1,0)","v":"Fresh"},{"$f":"VLOOKUP($B30,Store!$B$6:$AG$308,COLUMN()-1,0)","v":"Fresh"},{"$f":"VLOOKUP($B30,Store!$B$6:$AG$308,COLUMN()-1,0)","v":0},{"$f":"VLOOKUP($B30,Store!$B$6:$AG$308,COLUMN()-1,0)","v":"محمود"},{"$f":"VLOOKUP($B30,Store!$B$6:$AG$308,COLUMN()-1,0)","v":29.090909090909086},{"$f":"VLOOKUP($B30,Store!$B$6:$AG$308,COLUMN()-1,0)","v":400},{"$f":"VLOOKUP($B30,Store!$B$6:$AG$308,COLUMN()-1,0)","v":28},{"$f":"VLOOKUP($B30,Store!$B$6:$AG$308,COLUMN()-1,0)","v":"Jacquard"},{"$f":"VLOOKUP($B30,Store!$B$6:$AG$308,COLUMN()-1,0)","v":"Normal"},null,null,{"$f":"SUMIFS(Store!$AD$6:$AD$308,Store!$B$6:$B$308,Rassed!B30,Store!$AH$6:$AH$308,\"اضافه\")","v":400},{"$f":"SUMIFS(Store!$AD$6:$AD$308,Store!$B$6:$B$308,Rassed!B30,Store!$AN$6:$AN$308,\"صرف\")","v":800},-400]
[null,"0006 - 44",{"$f":"VLOOKUP($B31,Store!$B$6:$AG$308,COLUMN()-1,0)","v":"srttLLLLl"},{"$f":"VLOOKUP($B31,Store!$B$6:$AG$308,COLUMN()-1,0)","v":9114000023},{"$f":"VLOOKUP($B31,Store!$B$6:$AG$308,COLUMN()-1,0)","v":"مشكل عميل 44 اوردر 7008"},{"$f":"VLOOKUP($B31,Store!$B$6:$AG$308,COLUMN()-1,0)","v":44},{"$f":"VLOOKUP($B31,Store!$B$6:$AG$308,COLUMN()-1,0)","v":7008},{"$f":"VLOOKUP($B31,Store!$B$6:$AG$308,COLUMN()-1,0)","v":7008},{"$f":"VLOOKUP($B31,Store!$B$6:$AG$308,COLUMN()-1,0)","v":"Kitchen Towel"},{"$f":"VLOOKUP($B31,Store!$B$6:$AG$308,COLUMN()-1,0)","v":"Kitchen Towel"},{"$f":"VLOOKUP($B31,Store!$B$6:$AG$308,COLUMN()-1,0)","v":"Flat"},{"$f":"VLOOKUP($B31,Store!$B$6:$AG$308,COLUMN()-1,0)","v":"Flat"},{"$f":"VLOOKUP($B31,Store!$B$6:$AG$308,COLUMN()-1,0)","v":"50 X 70"},{"$f":"VLOOKUP($B31,Store!$B$6:$AG$308,COLUMN()-1,0)","v":"50 X 70"},{"$f":"VLOOKUP($B31,Store!$B$6:$AG$308,COLUMN()-1,0)","v":70},{"$f":"VLOOKUP($B31,Store!$B$6:$AG$308,COLUMN()-1,0)","v":70},{"$f":"VLOOKUP($B31,Store!$B$6:$AG$308,COLUMN()-1,0)","v":200},{"$f":"VLOOKUP($B31,Store!$B$6:$AG$308,COLUMN()-1,0)","v":"Very Light weight"},{"$f":"VLOOKUP($B31,Store!$B$6:$AG$308,COLUMN()-1,0)","v":"dark"},{"$f":"VLOOKUP($B31,Store!$B$6:$AG$308,COLUMN()-1,0)","v":"Second Choice"},{"$f":"VLOOKUP($B31,Store!$B$6:$AG$308,COLUMN()-1,0)","v":"100% cotton"},{"$f":"VLOOKUP($B31,Store!$B$6:$AG$308,COLUMN()-1,0)","v":"100% cotton"},{"$f":"VLOOKUP($B31,Store!$B$6:$AG$308,COLUMN()-1,0)","v":"24/2 - 16/1"},{"$f":"VLOOKUP($B31,Store!$B$6:$AG$308,COLUMN()-1,0)","v":"24/2 - 16/5"},{"$f":"VLOOKUP($B31,Store!$B$6:$AG$308,COLUMN()-1,0)","v":"Fresh"},{"$f":"VLOOKUP($B31,Store!$B$6:$AG$308,COLUMN()-1,0)","v":"Fresh"},{"$f":"VLOOKUP($B31,Store!$B$6:$AG$308,COLUMN()-1,0)","v":0},{"$f":"VLOOKUP($B31,Store!$B$6:$AG$308,COLUMN()-1,0)","v":"محمود"},{"$f":"VLOOKUP($B31,Store!$B$6:$AG$308,COLUMN()-1,0)","v":36.36363636363636},{"$f":"VLOOKUP($B31,Store!$B$6:$AG$308,COLUMN()-1,0)","v":500},{"$f":"VLOOKUP($B31,Store!$B$6:$AG$308,COLUMN()-1,0)","v":35},{"$f":"VLOOKUP($B31,Store!$B$6:$AG$308,COLUMN()-1,0)","v":"Jacquard"},{"$f":"VLOOKUP($B31,Store!$B$6:$AG$308,COLUMN()-1,0)","v":"Normal"},null,null,{"$f":"SUMIFS(Store!$AD$6:$AD$308,Store!$B$6:$B$308,Rassed!B31,Store!$AH$6:$AH$308,\"اضافه\")","v":500},{"$f":"SUMIFS(Store!$AD$6:$AD$308,Store!$B$6:$B$308,Rassed!B31,Store!$AN$6:$AN$308,\"صرف\")","v":1000},-500]
[null,"0001 - 55",{"$f":"VLOOKUP($B32,Store!$B$6:$AG$308,COLUMN()-1,0)","v":"palm blue"},{"$f":"VLOOKUP($B32,Store!$B$6:$AG$308,COLUMN()-1,0)","v":9114000024},{"$f":"VLOOKUP($B32,Store!$B$6:$AG$308,COLUMN()-1,0)","v":"مشكل عميل 55 اوردر 7009"},{"$f":"VLOOKUP($B32,Store!$B$6:$AG$308,COLUMN()-1,0)","v":55},{"$f":"VLOOKUP($B32,Store!$B$6:$AG$308,COLUMN()-1,0)","v":7009},{"$f":"VLOOKUP($B32,Store!$B$6:$AG$308,COLUMN()-1,0)","v":7009},{"$f":"VLOOKUP($B32,Store!$B$6:$AG$308,COLUMN()-1,0)","v":"Kitchen Towel"},{"$f":"VLOOKUP($B32,Store!$B$6:$AG$308,COLUMN()-1,0)","v":"Kitchen Towel"},{"$f":"VLOOKUP($B32,Store!$B$6:$AG$308,COLUMN()-1,0)","v":"Flat"},{"$f":"VLOOKUP($B32,Store!$B$6:$AG$308,COLUMN()-1,0)","v":"Flat"},{"$f":"VLOOKUP($B32,Store!$B$6:$AG$308,COLUMN()-1,0)","v":"50 X 70"},{"$f":"VLOOKUP($B32,Store!$B$6:$AG$308,COLUMN()-1,0)","v":"50 X 70"},{"$f":"VLOOKUP($B32,Store!$B$6:$AG$308,COLUMN()-1,0)","v":70},{"$f":"VLOOKUP($B32,Store!$B$6:$AG$308,COLUMN()-1,0)","v":70},{"$f":"VLOOKUP($B32,Store!$B$6:$AG$308,COLUMN()-1,0)","v":200},{"$f":"VLOOKUP($B32,Store!$B$6:$AG$308,COLUMN()-1,0)","v":"Very Light weight"},{"$f":"VLOOKUP($B32,Store!$B$6:$AG$308,COLUMN()-1,0)","v":"dark"},{"$f":"VLOOKUP($B32,Store!$B$6:$AG$308,COLUMN()-1,0)","v":"Second Choice"},{"$f":"VLOOKUP($B32,Store!$B$6:$AG$308,COLUMN()-1,0)","v":"100% cotton"},{"$f":"VLOOKUP($B32,Store!$B$6:$AG$308,COLUMN()-1,0)","v":"100% cotton"},{"$f":"VLOOKUP($B32,Store!$B$6:$AG$308,COLUMN()-1,0)","v":"24/2 - 16/1"},{"$f":"VLOOKUP($B32,Store!$B$6:$AG$308,COLUMN()-1,0)","v":"24/2 - 16/1"},{"$f":"VLOOKUP($B32,Store!$B$6:$AG$308,COLUMN()-1,0)","v":"Fresh"},{"$f":"VLOOKUP($B32,Store!$B$6:$AG$308,COLUMN()-1,0)","v":"Fresh"},{"$f":"VLOOKUP($B32,Store!$B$6:$AG$308,COLUMN()-1,0)","v":0},{"$f":"VLOOKUP($B32,Store!$B$6:$AG$308,COLUMN()-1,0)","v":"محمود"},{"$f":"VLOOKUP($B32,Store!$B$6:$AG$308,COLUMN()-1,0)","v":14},{"$f":"VLOOKUP($B32,Store!$B$6:$AG$308,COLUMN()-1,0)","v":200},{"$f":"VLOOKUP($B32,Store!$B$6:$AG$308,COLUMN()-1,0)","v":14},{"$f":"VLOOKUP($B32,Store!$B$6:$AG$308,COLUMN()-1,0)","v":"Dobby"},{"$f":"VLOOKUP($B32,Store!$B$6:$AG$308,COLUMN()-1,0)","v":"Normal"},null,null,{"$f":"SUMIFS(Store!$AD$6:$AD$308,Store!$B$6:$B$308,Rassed!B32,Store!$AH$6:$AH$308,\"اضافه\")","v":600},{"$f":"SUMIFS(Store!$AD$6:$AD$308,Store!$B$6:$B$308,Rassed!B32,Store!$AN$6:$AN$308,\"صرف\")","v":1000},-400]
[null,"0002 - 55",{"$f":"VLOOKUP($B33,Store!$B$6:$AG$308,COLUMN()-1,0)","v":"palm nel"},{"$f":"VLOOKUP($B33,Store!$B$6:$AG$308,COLUMN()-1,0)","v":9114000025},{"$f":"VLOOKUP($B33,Store!$B$6:$AG$308,COLUMN()-1,0)","v":"مشكل عميل 55 اوردر 7009"},{"$f":"VLOOKUP($B33,Store!$B$6:$AG$308,COLUMN()-1,0)","v":55},{"$f":"VLOOKUP($B33,Store!$B$6:$AG$308,COLUMN()-1,0)","v":7009},{"$f":"VLOOKUP($B33,Store!$B$6:$AG$308,COLUMN()-1,0)","v":7009},{"$f":"VLOOKUP($B33,Store!$B$6:$AG$308,COLUMN()-1,0)","v":"Kitchen Towel"},{"$f":"VLOOKUP($B33,Store!$B$6:$AG$308,COLUMN()-1,0)","v":"Kitchen Towel"},{"$f":"VLOOKUP($B33,Store!$B$6:$AG$308,COLUMN()-1,0)","v":"Flat"},{"$f":"VLOOKUP($B33,Store!$B$6:$AG$308,COLUMN()-1,0)","v":"Flat"},{"$f":"VLOOKUP($B33,Store!$B$6:$AG$308,COLUMN()-1,0)","v":"50 X 70"},{"$f":"VLOOKUP($B33,Store!$B$6:$AG$308,COLUMN()-1,0)","v":"50 X 70"},{"$f":"VLOOKUP($B33,Store!$B$6:$AG$308,COLUMN()-1,0)","v":70},{"$f":"VLOOKUP($B33,Store!$B$6:$AG$308,COLUMN()-1,0)","v":70},{"$f":"VLOOKUP($B33,Store!$B$6:$AG$308,COLUMN()-1,0)","v":200},{"$f":"VLOOKUP($B33,Store!$B$6:$AG$308,COLUMN()-1,0)","v":"Very Light weight"},{"$f":"VLOOKUP($B33,Store!$B$6:$AG$308,COLUMN()-1,0)","v":"dark"},{"$f":"VLOOKUP($B33,Store!$B$6:$AG$308,COLUMN()-1,0)","v":"Second Choice"},{"$f":"VLOOKUP($B33,Store!$B$6:$AG$308,COLUMN()-1,0)","v":"100% cotton"},{"$f":"VLOOKUP($B33,Store!$B$6:$AG$308,COLUMN()-1,0)","v":"100% cotton"},{"$f":"VLOOKUP($B33,Store!$B$6:$AG$308,COLUMN()-1,0)","v":"24/2 - 16/1"},{"$f":"VLOOKUP($B33,Store!$B$6:$AG$308,COLUMN()-1,0)","v":"24/2 - 16/1"},{"$f":"VLOOKUP($B33,Store!$B$6:$AG$308,COLUMN()-1,0)","v":"Fresh"},{"$f":"VLOOKUP($B33,Store!$B$6:$AG$308,COLUMN()-1,0)","v":"Fresh"},{"$f":"VLOOKUP($B33,Store!$B$6:$AG$308,COLUMN()-1,0)","v":0},{"$f":"VLOOKUP($B33,Store!$B$6:$AG$308,COLUMN()-1,0)","v":"محمود"},{"$f":"VLOOKUP($B33,Store!$B$6:$AG$308,COLUMN()-1,0)","v":3.5},{"$f":"VLOOKUP($B33,Store!$B$6:$AG$308,COLUMN()-1,0)","v":50},{"$f":"VLOOKUP($B33,Store!$B$6:$AG$308,COLUMN()-1,0)","v":3.5},{"$f":"VLOOKUP($B33,Store!$B$6:$AG$308,COLUMN()-1,0)","v":"Dobby"},{"$f":"VLOOKUP($B33,Store!$B$6:$AG$308,COLUMN()-1,0)","v":"Normal"},null,null,{"$f":"SUMIFS(Store!$AD$6:$AD$308,Store!$B$6:$B$308,Rassed!B33,Store!$AH$6:$AH$308,\"اضافه\")","v":170},{"$f":"SUMIFS(Store!$AD$6:$AD$308,Store!$B$6:$B$308,Rassed!B33,Store!$AN$6:$AN$308,\"صرف\")","v":290},-120]
[null,"0003 - 55",{"$f":"VLOOKUP($B34,Store!$B$6:$AG$308,COLUMN()-1,0)","v":"palm Turq"},{"$f":"VLOOKUP($B34,Store!$B$6:$AG$308,COLUMN()-1,0)","v":9114000026},{"$f":"VLOOKUP($B34,Store!$B$6:$AG$308,COLUMN()-1,0)","v":"مشكل عميل 55 اوردر 7009"},{"$f":"VLOOKUP($B34,Store!$B$6:$AG$308,COLUMN()-1,0)","v":55},{"$f":"VLOOKUP($B34,Store!$B$6:$AG$308,COLUMN()-1,0)","v":7009},{"$f":"VLOOKUP($B34,Store!$B$6:$AG$308,COLUMN()-1,0)","v":7009},{"$f":"VLOOKUP($B34,Store!$B$6:$AG$308,COLUMN()-1,0)","v":"Kitchen Towel"},{"$f":"VLOOKUP($B34,Store!$B$6:$AG$308,COLUMN()-1,0)","v":"Kitchen Towel"},{"$f":"VLOOKUP($B34,Store!$B$6:$AG$308,COLUMN()-1,0)","v":"Flat"},{"$f":"VLOOKUP($B34,Store!$B$6:$AG$308,COLUMN()-1,0)","v":"Flat"},{"$f":"VLOOKUP($B34,Store!$B$6:$AG$308,COLUMN()-1,0)","v":"50 X 70"},{"$f":"VLOOKUP($B34,Store!$B$6:$AG$308,COLUMN()-1,0)","v":"50 X 70"},{"$f":"VLOOKUP($B34,Store!$B$6:$AG$308,COLUMN()-1,0)","v":70},{"$f":"VLOOKUP($B34,Store!$B$6:$AG$308,COLUMN()-1,0)","v":70},{"$f":"VLOOKUP($B34,Store!$B$6:$AG$308,COLUMN()-1,0)","v":200},{"$f":"VLOOKUP($B34,Store!$B$6:$AG$308,COLUMN()-1,0)","v":"Very Light weight"},{"$f":"VLOOKUP($B34,Store!$B$6:$AG$308,COLUMN()-1,0)","v":"dark"},{"$f":"VLOOKUP($B34,Store!$B$6:$AG$308,COLUMN()-1,0)","v":"Second Choice"},{"$f":"VLOOKUP($B34,Store!$B$6:$AG$308,COLUMN()-1,0)","v":"100% cotton"},{"$f":"VLOOKUP($B34,Store!$B$6:$AG$308,COLUMN()-1,0)","v":"100% cotton"},{"$f":"VLOOKUP($B34,Store!$B$6:$AG$308,COLUMN()-1,0)","v":"24/2 - 16/1"},{"$f":"VLOOKUP($B34,Store!$B$6:$AG$308,COLUMN()-1,0)","v":"24/2 - 16/1"},{"$f":"VLOOKUP($B34,Store!$B$6:$AG$308,COLUMN()-1,0)","v":"Fresh"},{"$f":"VLOOKUP($B34,Store!$B$6:$AG$308,COLUMN()-1,0)","v":"Fresh"},{"$f":"VLOOKUP($B34,Store!$B$6:$AG$308,COLUMN()-1,0)","v":0},{"$f":"VLOOKUP($B34,Store!$B$6:$AG$308,COLUMN()-1,0)","v":"محمود"},{"$f":"VLOOKUP($B34,Store!$B$6:$AG$308,COLUMN()-1,0)","v":1.75},{"$f":"VLOOKUP($B34,Store!$B$6:$AG$308,COLUMN()-1,0)","v":25},{"$f":"VLOOKUP($B34,Store!$B$6:$AG$308,COLUMN()-1,0)","v":1.75},{"$f":"VLOOKUP($B34,Store!$B$6:$AG$308,COLUMN()-1,0)","v":"Dobby"},{"$f":"VLOOKUP($B34,Store!$B$6:$AG$308,COLUMN()-1,0)","v":"Normal"},null,null,{"$f":"SUMIFS(Store!$AD$6:$AD$308,Store!$B$6:$B$308,Rassed!B34,Store!$AH$6:$AH$308,\"اضافه\")","v":33},{"$f":"SUMIFS(Store!$AD$6:$AD$308,Store!$B$6:$B$308,Rassed!B34,Store!$AN$6:$AN$308,\"صرف\")","v":41},-8]
[null,"0004 - 55",{"$f":"VLOOKUP($B35,Store!$B$6:$AG$308,COLUMN()-1,0)","v":"palm orange"},{"$f":"VLOOKUP($B35,Store!$B$6:$AG$308,COLUMN()-1,0)","v":9114000027},{"$f":"VLOOKUP($B35,Store!$B$6:$AG$308,COLUMN()-1,0)","v":"مشكل عميل 55 اوردر 7009"},{"$f":"VLOOKUP($B35,Store!$B$6:$AG$308,COLUMN()-1,0)","v":55},{"$f":"VLOOKUP($B35,Store!$B$6:$AG$308,COLUMN()-1,0)","v":7009},{"$f":"VLOOKUP($B35,Store!$B$6:$AG$308,COLUMN()-1,0)","v":7009},{"$f":"VLOOKUP($B35,Store!$B$6:$AG$308,COLUMN()-1,0)","v":"Kitchen Towel"},{"$f":"VLOOKUP($B35,Store!$B$6:$AG$308,COLUMN()-1,0)","v":"Kitchen Towel"},{"$f":"VLOOKUP($B35,Store!$B$6:$AG$308,COLUMN()-1,0)","v":"Flat"},{"$f":"VLOOKUP($B35,Store!$B$6:$AG$308,COLUMN()-1,0)","v":"Flat"},{"$f":"VLOOKUP($B35,Store!$B$6:$AG$308,COLUMN()-1,0)","v":"50 X 70"},{"$f":"VLOOKUP($B35,Store!$B$6:$AG$308,COLUMN()-1,0)","v":"50 X 70"},{"$f":"VLOOKUP($B35,Store!$B$6:$AG$308,COLUMN()-1,0)","v":70},{"$f":"VLOOKUP($B35,Store!$B$6:$AG$308,COLUMN()-1,0)","v":70},{"$f":"VLOOKUP($B35,Store!$B$6:$AG$308,COLUMN()-1,0)","v":200},{"$f":"VLOOKUP($B35,Store!$B$6:$AG$308,COLUMN()-1,0)","v":"Very Light weight"},{"$f":"VLOOKUP($B35,Store!$B$6:$AG$308,COLUMN()-1,0)","v":"dark"},{"$f":"VLOOKUP($B35,Store!$B$6:$AG$308,COLUMN()-1,0)","v":"Second Choice"},{"$f":"VLOOKUP($B35,Store!$B$6:$AG$308,COLUMN()-1,0)","v":"100% cotton"},{"$f":"VLOOKUP($B35,Store!$B$6:$AG$308,COLUMN()-1,0)","v":"100% cotton"},{"$f":"VLOOKUP($B35,Store!$B$6:$AG$308,COLUMN()-1,0)","v":"24/2 - 16/1"},{"$f":"VLOOKUP($B35,Store!$B$6:$AG$308,COLUMN()-1,0)","v":"24/2 - 16/1"},{"$f":"VLOOKUP($B35,Store!$B$6:$AG$308,COLUMN()-1,0)","v":"Fresh"},{"$f":"VLOOKUP($B35,Store!$B$6:$AG$308,COLUMN()-1,0)","v":"Fresh"},{"$f":"VLOOKUP($B35,Store!$B$6:$AG$308,COLUMN()-1,0)","v":0},{"$f":"VLOOKUP($B35,Store!$B$6:$AG$308,COLUMN()-1,0)","v":"محمود"},{"$f":"VLOOKUP($B35,Store!$B$6:$AG$308,COLUMN()-1,0)","v":2.1},{"$f":"VLOOKUP($B35,Store!$B$6:$AG$308,COLUMN()-1,0)","v":30},{"$f":"VLOOKUP($B35,Store!$B$6:$AG$308,COLUMN()-1,0)","v":2.1},{"$f":"VLOOKUP($B35,Store!$B$6:$AG$308,COLUMN()-1,0)","v":"Dobby"},{"$f":"VLOOKUP($B35,Store!$B$6:$AG$308,COLUMN()-1,0)","v":"Normal"},null,null,{"$f":"SUMIFS(Store!$AD$6:$AD$308,Store!$B$6:$B$308,Rassed!B35,Store!$AH$6:$AH$308,\"اضافه\")","v":42},{"$f":"SUMIFS(Store!$AD$6:$AD$308,Store!$B$6:$B$308,Rassed!B35,Store!$AN$6:$AN$308,\"صرف\")","v":54},-12]
[null,"0005 - 55",{"$f":"VLOOKUP($B36,Store!$B$6:$AG$308,COLUMN()-1,0)","v":"palm red"},{"$f":"VLOOKUP($B36,Store!$B$6:$AG$308,COLUMN()-1,0)","v":9114000028},{"$f":"VLOOKUP($B36,Store!$B$6:$AG$308,COLUMN()-1,0)","v":"مشكل عميل 55 اوردر 7009"},{"$f":"VLOOKUP($B36,Store!$B$6:$AG$308,COLUMN()-1,0)","v":55},{"$f":"VLOOKUP($B36,Store!$B$6:$AG$308,COLUMN()-1,0)","v":7009},{"$f":"VLOOKUP($B36,Store!$B$6:$AG$308,COLUMN()-1,0)","v":7009},{"$f":"VLOOKUP($B36,Store!$B$6:$AG$308,COLUMN()-1,0)","v":"Kitchen Towel"},{"$f":"VLOOKUP($B36,Store!$B$6:$AG$308,COLUMN()-1,0)","v":"Kitchen Towel"},{"$f":"VLOOKUP($B36,Store!$B$6:$AG$308,COLUMN()-1,0)","v":"Flat"},{"$f":"VLOOKUP($B36,Store!$B$6:$AG$308,COLUMN()-1,0)","v":"Flat"},{"$f":"VLOOKUP($B36,Store!$B$6:$AG$308,COLUMN()-1,0)","v":"50 X 70"},{"$f":"VLOOKUP($B36,Store!$B$6:$AG$308,COLUMN()-1,0)","v":"50 X 70"},{"$f":"VLOOKUP($B36,Store!$B$6:$AG$308,COLUMN()-1,0)","v":70},{"$f":"VLOOKUP($B36,Store!$B$6:$AG$308,COLUMN()-1,0)","v":70},{"$f":"VLOOKUP($B36,Store!$B$6:$AG$308,COLUMN()-1,0)","v":200},{"$f":"VLOOKUP($B36,Store!$B$6:$AG$308,COLUMN()-1,0)","v":"Very Light weight"},{"$f":"VLOOKUP($B36,Store!$B$6:$AG$308,COLUMN()-1,0)","v":"dark"},{"$f":"VLOOKUP($B36,Store!$B$6:$AG$308,COLUMN()-1,0)","v":"Second Choice"},{"$f":"VLOOKUP($B36,Store!$B$6:$AG$308,COLUMN()-1,0)","v":"100% cotton"},{"$f":"VLOOKUP($B36,Store!$B$6:$AG$308,COLUMN()-1,0)","v":"100% cotton"},{"$f":"VLOOKUP($B36,Store!$B$6:$AG$308,COLUMN()-1,0)","v":"24/2 - 16/1"},{"$f":"VLOOKUP($B36,Store!$B$6:$AG$308,COLUMN()-1,0)","v":"24/2 - 16/1"},{"$f":"VLOOKUP($B36,Store!$B$6:$AG$308,COLUMN()-1,0)","v":"Fresh"},{"$f":"VLOOKUP($B36,Store!$B$6:$AG$308,COLUMN()-1,0)","v":"Fresh"},{"$f":"VLOOKUP($B36,Store!$B$6:$AG$308,COLUMN()-1,0)","v":0},{"$f":"VLOOKUP($B36,Store!$B$6:$AG$308,COLUMN()-1,0)","v":"محمود"},{"$f":"VLOOKUP($B36,Store!$B$6:$AG$308,COLUMN()-1,0)","v":0.84},{"$f":"VLOOKUP($B36,Store!$B$6:$AG$308,COLUMN()-1,0)","v":12},{"$f":"VLOOKUP($B36,Store!$B$6:$AG$308,COLUMN()-1,0)","v":0.84},{"$f":"VLOOKUP($B36,Store!$B$6:$AG$308,COLUMN()-1,0)","v":"Dobby"},{"$f":"VLOOKUP($B36,Store!$B$6:$AG$308,COLUMN()-1,0)","v":"Normal"},null,null,{"$f":"SUMIFS(Store!$AD$6:$AD$308,Store!$B$6:$B$308,Rassed!B36,Store!$AH$6:$AH$308,\"اضافه\")","v":42},{"$f":"SUMIFS(Store!$AD$6:$AD$308,Store!$B$6:$B$308,Rassed!B36,Store!$AN$6:$AN$308,\"صرف\")","v":72},-30]
[null,"0006 - 55",{"$f":"VLOOKUP($B37,Store!$B$6:$AG$308,COLUMN()-1,0)","v":"palm Brown"},{"$f":"VLOOKUP($B37,Store!$B$6:$AG$308,COLUMN()-1,0)","v":9114000029},{"$f":"VLOOKUP($B37,Store!$B$6:$AG$308,COLUMN()-1,0)","v":"مشكل عميل 55 اوردر 7009"},{"$f":"VLOOKUP($B37,Store!$B$6:$AG$308,COLUMN()-1,0)","v":55},{"$f":"VLOOKUP($B37,Store!$B$6:$AG$308,COLUMN()-1,0)","v":7009},{"$f":"VLOOKUP($B37,Store!$B$6:$AG$308,COLUMN()-1,0)","v":7009},{"$f":"VLOOKUP($B37,Store!$B$6:$AG$308,COLUMN()-1,0)","v":"Kitchen Towel"},{"$f":"VLOOKUP($B37,Store!$B$6:$AG$308,COLUMN()-1,0)","v":"Kitchen Towel"},{"$f":"VLOOKUP($B37,Store!$B$6:$AG$308,COLUMN()-1,0)","v":"Flat"},{"$f":"VLOOKUP($B37,Store!$B$6:$AG$308,COLUMN()-1,0)","v":"Flat"},{"$f":"VLOOKUP($B37,Store!$B$6:$AG$308,COLUMN()-1,0)","v":"50 X 70"},{"$f":"VLOOKUP($B37,Store!$B$6:$AG$308,COLUMN()-1,0)","v":"50 X 70"},{"$f":"VLOOKUP($B37,Store!$B$6:$AG$308,COLUMN()-1,0)","v":70},{"$f":"VLOOKUP($B37,Store!$B$6:$AG$308,COLUMN()-1,0)","v":70},{"$f":"VLOOKUP($B37,Store!$B$6:$AG$308,COLUMN()-1,0)","v":200},{"$f":"VLOOKUP($B37,Store!$B$6:$AG$308,COLUMN()-1,0)","v":"Very Light weight"},{"$f":"VLOOKUP($B37,Store!$B$6:$AG$308,COLUMN()-1,0)","v":"dark"},{"$f":"VLOOKUP($B37,Store!$B$6:$AG$308,COLUMN()-1,0)","v":"Second Choice"},{"$f":"VLOOKUP($B37,Store!$B$6:$AG$308,COLUMN()-1,0)","v":"100% cotton"},{"$f":"VLOOKUP($B37,Store!$B$6:$AG$308,COLUMN()-1,0)","v":"100% cotton"},{"$f":"VLOOKUP($B37,Store!$B$6:$AG$308,COLUMN()-1,0)","v":"24/2 - 16/1"},{"$f":"VLOOKUP($B37,Store!$B$6:$AG$308,COLUMN()-1,0)","v":"24/2 - 16/1"},{"$f":"VLOOKUP($B37,Store!$B$6:$AG$308,COLUMN()-1,0)","v":"Fresh"},{"$f":"VLOOKUP($B37,Store!$B$6:$AG$308,COLUMN()-1,0)","v":"Fresh"},{"$f":"VLOOKUP($B37,Store!$B$6:$AG$308,COLUMN()-1,0)","v":0},{"$f":"VLOOKUP($B37,Store!$B$6:$AG$308,COLUMN()-1,0)","v":"محمود"},{"$f":"VLOOKUP($B37,Store!$B$6:$AG$308,COLUMN()-1,0)","v":0.56000000000000005},{"$f":"VLOOKUP($B37,Store!$B$6:$AG$308,COLUMN()-1,0)","v":8},{"$f":"VLOOKUP($B37,Store!$B$6:$AG$308,COLUMN()-1,0)","v":0.56000000000000005},{"$f":"VLOOKUP($B37,Store!$B$6:$AG$308,COLUMN()-1,0)","v":"Dobby"},{"$f":"VLOOKUP($B37,Store!$B$6:$AG$308,COLUMN()-1,0)","v":"Normal"},null,null,{"$f":"SUMIFS(Store!$AD$6:$AD$308,Store!$B$6:$B$308,Rassed!B37,Store!$AH$6:$AH$308,\"اضافه\")","v":30},{"$f":"SUMIFS(Store!$AD$6:$AD$308,Store!$B$6:$B$308,Rassed!B37,Store!$AN$6:$AN$308,\"صرف\")","v":52},-22]
[null,"0007 - 55",{"$f":"VLOOKUP($B38,Store!$B$6:$AG$308,COLUMN()-1,0)","v":"Moon - Blue"},{"$f":"VLOOKUP($B38,Store!$B$6:$AG$308,COLUMN()-1,0)","v":9114000030},{"$f":"VLOOKUP($B38,Store!$B$6:$AG$308,COLUMN()-1,0)","v":"مشكل عميل 55 اوردر 7010"},{"$f":"VLOOKUP($B38,Store!$B$6:$AG$308,COLUMN()-1,0)","v":55},{"$f":"VLOOKUP($B38,Store!$B$6:$AG$308,COLUMN()-1,0)","v":7010},{"$f":"VLOOKUP($B38,Store!$B$6:$AG$308,COLUMN()-1,0)","v":7010},{"$f":"VLOOKUP($B38,Store!$B$6:$AG$308,COLUMN()-1,0)","v":"Kitchen Towel"},{"$f":"VLOOKUP($B38,Store!$B$6:$AG$308,COLUMN()-1,0)","v":"Kitchen Towel"},{"$f":"VLOOKUP($B38,Store!$B$6:$AG$308,COLUMN()-1,0)","v":"Flat"},{"$f":"VLOOKUP($B38,Store!$B$6:$AG$308,COLUMN()-1,0)","v":"Flat"},{"$f":"VLOOKUP($B38,Store!$B$6:$AG$308,COLUMN()-1,0)","v":"50 X 70"},{"$f":"VLOOKUP($B38,Store!$B$6:$AG$308,COLUMN()-1,0)","v":"50 X 70"},{"$f":"VLOOKUP($B38,Store!$B$6:$AG$308,COLUMN()-1,0)","v":70},{"$f":"VLOOKUP($B38,Store!$B$6:$AG$308,COLUMN()-1,0)","v":70},{"$f":"VLOOKUP($B38,Store!$B$6:$AG$308,COLUMN()-1,0)","v":200},{"$f":"VLOOKUP($B38,Store!$B$6:$AG$308,COLUMN()-1,0)","v":"Very Light weight"},{"$f":"VLOOKUP($B38,Store!$B$6:$AG$308,COLUMN()-1,0)","v":"dark"},{"$f":"VLOOKUP($B38,Store!$B$6:$AG$308,COLUMN()-1,0)","v":"Second Choice"},{"$f":"VLOOKUP($B38,Store!$B$6:$AG$308,COLUMN()-1,0)","v":"100% cotton"},{"$f":"VLOOKUP($B38,Store!$B$6:$AG$308,COLUMN()-1,0)","v":"100% cotton"},{"$f":"VLOOKUP($B38,Store!$B$6:$AG$308,COLUMN()-1,0)","v":"24/2 - 16/1"},{"$f":"VLOOKUP($B38,Store!$B$6:$AG$308,COLUMN()-1,0)","v":"24/2 - 16/1"},{"$f":"VLOOKUP($B38,Store!$B$6:$AG$308,COLUMN()-1,0)","v":"Fresh"},{"$f":"VLOOKUP($B38,Store!$B$6:$AG$308,COLUMN()-1,0)","v":"Fresh"},{"$f":"VLOOKUP($B38,Store!$B$6:$AG$308,COLUMN()-1,0)","v":0},{"$f":"VLOOKUP($B38,Store!$B$6:$AG$308,COLUMN()-1,0)","v":"محمود"},{"$f":"VLOOKUP($B38,Store!$B$6:$AG$308,COLUMN()-1,0)","v":28},{"$f":"VLOOKUP($B38,Store!$B$6:$AG$308,COLUMN()-1,0)","v":400},{"$f":"VLOOKUP($B38,Store!$B$6:$AG$308,COLUMN()-1,0)","v":28},{"$f":"VLOOKUP($B38,Store!$B$6:$AG$308,COLUMN()-1,0)","v":"Dobby"},{"$f":"VLOOKUP($B38,Store!$B$6:$AG$308,COLUMN()-1,0)","v":"Normal"},null,null,{"$f":"SUMIFS(Store!$AD$6:$AD$308,Store!$B$6:$B$308,Rassed!B38,Store!$AH$6:$AH$308,\"اضافه\")","v":1800},{"$f":"SUMIFS(Store!$AD$6:$AD$308,Store!$B$6:$B$308,Rassed!B38,Store!$AN$6:$AN$308,\"صرف\")","v":3300},-1500]
[null,"0008 - 55",{"$f":"VLOOKUP($B39,Store!$B$6:$AG$308,COLUMN()-1,0)","v":"Moon - Red"},{"$f":"VLOOKUP($B39,Store!$B$6:$AG$308,COLUMN()-1,0)","v":9114000031},{"$f":"VLOOKUP($B39,Store!$B$6:$AG$308,COLUMN()-1,0)","v":"مشكل عميل 55 اوردر 7010"},{"$f":"VLOOKUP($B39,Store!$B$6:$AG$308,COLUMN()-1,0)","v":55},{"$f":"VLOOKUP($B39,Store!$B$6:$AG$308,COLUMN()-1,0)","v":7010},{"$f":"VLOOKUP($B39,Store!$B$6:$AG$308,COLUMN()-1,0)","v":7010},{"$f":"VLOOKUP($B39,Store!$B$6:$AG$308,COLUMN()-1,0)","v":"Kitchen Towel"},{"$f":"VLOOKUP($B39,Store!$B$6:$AG$308,COLUMN()-1,0)","v":"Kitchen Towel"},{"$f":"VLOOKUP($B39,Store!$B$6:$AG$308,COLUMN()-1,0)","v":"Flat"},{"$f":"VLOOKUP($B39,Store!$B$6:$AG$308,COLUMN()-1,0)","v":"Flat"},{"$f":"VLOOKUP($B39,Store!$B$6:$AG$308,COLUMN()-1,0)","v":"50 X 70"},{"$f":"VLOOKUP($B39,Store!$B$6:$AG$308,COLUMN()-1,0)","v":"50 X 70"},{"$f":"VLOOKUP($B39,Store!$B$6:$AG$308,COLUMN()-1,0)","v":70},{"$f":"VLOOKUP($B39,Store!$B$6:$AG$308,COLUMN()-1,0)","v":70},{"$f":"VLOOKUP($B39,Store!$B$6:$AG$308,COLUMN()-1,0)","v":200},{"$f":"VLOOKUP($B39,Store!$B$6:$AG$308,COLUMN()-1,0)","v":"Very Light weight"},{"$f":"VLOOKUP($B39,Store!$B$6:$AG$308,COLUMN()-1,0)","v":"dark"},{"$f":"VLOOKUP($B39,Store!$B$6:$AG$308,COLUMN()-1,0)","v":"Second Choice"},{"$f":"VLOOKUP($B39,Store!$B$6:$AG$308,COLUMN()-1,0)","v":"100% cotton"},{"$f":"VLOOKUP($B39,Store!$B$6:$AG$308,COLUMN()-1,0)","v":"100% cotton"},{"$f":"VLOOKUP($B39,Store!$B$6:$AG$308,COLUMN()-1,0)","v":"24/2 - 16/1"},{"$f":"VLOOKUP($B39,Store!$B$6:$AG$308,COLUMN()-1,0)","v":"24/2 - 16/1"},{"$f":"VLOOKUP($B39,Store!$B$6:$AG$308,COLUMN()-1,0)","v":"Fresh"},{"$f":"VLOOKUP($B39,Store!$B$6:$AG$308,COLUMN()-1,0)","v":"Fresh"},{"$f":"VLOOKUP($B39,Store!$B$6:$AG$308,COLUMN()-1,0)","v":0},{"$f":"VLOOKUP($B39,Store!$B$6:$AG$308,COLUMN()-1,0)","v":"محمود"},{"$f":"VLOOKUP($B39,Store!$B$6:$AG$308,COLUMN()-1,0)","v":8.4},{"$f":"VLOOKUP($B39,Store!$B$6:$AG$308,COLUMN()-1,0)","v":120},{"$f":"VLOOKUP($B39,Store!$B$6:$AG$308,COLUMN()-1,0)","v":8.4},{"$f":"VLOOKUP($B39,Store!$B$6:$AG$308,COLUMN()-1,0)","v":"Jacquard"},{"$f":"VLOOKUP($B39,Store!$B$6:$AG$308,COLUMN()-1,0)","v":"Normal"},null,null,{"$f":"SUMIFS(Store!$AD$6:$AD$308,Store!$B$6:$B$308,Rassed!B39,Store!$AH$6:$AH$308,\"اضافه\")","v":120},{"$f":"SUMIFS(Store!$AD$6:$AD$308,Store!$B$6:$B$308,Rassed!B39,Store!$AN$6:$AN$308,\"صرف\")","v":240},-120]
[null,"0007 - 55",{"$f":"VLOOKUP($B40,Store!$B$6:$AG$308,COLUMN()-1,0)","v":"Moon - Blue"},{"$f":"VLOOKUP($B40,Store!$B$6:$AG$308,COLUMN()-1,0)","v":9114000030},{"$f":"VLOOKUP($B40,Store!$B$6:$AG$308,COLUMN()-1,0)","v":"مشكل عميل 55 اوردر 7010"},{"$f":"VLOOKUP($B40,Store!$B$6:$AG$308,COLUMN()-1,0)","v":55},{"$f":"VLOOKUP($B40,Store!$B$6:$AG$308,COLUMN()-1,0)","v":7010},{"$f":"VLOOKUP($B40,Store!$B$6:$AG$308,COLUMN()-1,0)","v":7010},{"$f":"VLOOKUP($B40,Store!$B$6:$AG$308,COLUMN()-1,0)","v":"Kitchen Towel"},{"$f":"VLOOKUP($B40,Store!$B$6:$AG$308,COLUMN()-1,0)","v":"Kitchen Towel"},{"$f":"VLOOKUP($B40,Store!$B$6:$AG$308,COLUMN()-1,0)","v":"Flat"},{"$f":"VLOOKUP($B40,Store!$B$6:$AG$308,COLUMN()-1,0)","v":"Flat"},{"$f":"VLOOKUP($B40,Store!$B$6:$AG$308,COLUMN()-1,0)","v":"50 X 70"},{"$f":"VLOOKUP($B40,Store!$B$6:$AG$308,COLUMN()-1,0)","v":"50 X 70"},{"$f":"VLOOKUP($B40,Store!$B$6:$AG$308,COLUMN()-1,0)","v":70},{"$f":"VLOOKUP($B40,Store!$B$6:$AG$308,COLUMN()-1,0)","v":70},{"$f":"VLOOKUP($B40,Store!$B$6:$AG$308,COLUMN()-1,0)","v":200},{"$f":"VLOOKUP($B40,Store!$B$6:$AG$308,COLUMN()-1,0)","v":"Very Light weight"},{"$f":"VLOOKUP($B40,Store!$B$6:$AG$308,COLUMN()-1,0)","v":"dark"},{"$f":"VLOOKUP($B40,Store!$B$6:$AG$308,COLUMN()-1,0)","v":"Second Choice"},{"$f":"VLOOKUP($B40,Store!$B$6:$AG$308,COLUMN()-1,0)","v":"100% cotton"},{"$f":"VLOOKUP($B40,Store!$B$6:$AG$308,COLUMN()-1,0)","v":"100% cotton"},{"$f":"VLOOKUP($B40,Store!$B$6:$AG$308,COLUMN()-1,0)","v":"24/2 - 16/1"},{"$f":"VLOOKUP($B40,Store!$B$6:$AG$308,COLUMN()-1,0)","v":"24/2 - 16/1"},{"$f":"VLOOKUP($B40,Store!$B$6:$AG$308,COLUMN()-1,0)","v":"Fresh"},{"$f":"VLOOKUP($B40,Store!$B$6:$AG$308,COLUMN()-1,0)","v":"Fresh"},{"$f":"VLOOKUP($B40,Store!$B$6:$AG$308,COLUMN()-1,0)","v":0},{"$f":"VLOOKUP($B40,Store!$B$6:$AG$308,COLUMN()-1,0)","v":"محمود"},{"$f":"VLOOKUP($B40,Store!$B$6:$AG$308,COLUMN()-1,0)","v":28},{"$f":"VLOOKUP($B40,Store!$B$6:$AG$308,COLUMN()-1,0)","v":400},{"$f":"VLOOKUP($B40,Store!$B$6:$AG$308,COLUMN()-1,0)","v":28},{"$f":"VLOOKUP($B40,Store!$B$6:$AG$308,COLUMN()-1,0)","v":"Dobby"},{"$f":"VLOOKUP($B40,Store!$B$6:$AG$308,COLUMN()-1,0)","v":"Normal"},null,null,{"$f":"SUMIFS(Store!$AD$6:$AD$308,Store!$B$6:$B$308,Rassed!B40,Store!$AH$6:$AH$308,\"اضافه\")","v":1800},{"$f":"SUMIFS(Store!$AD$6:$AD$308,Store!$B$6:$B$308,Rassed!B40,Store!$AN$6:$AN$308,\"صرف\")","v":3300},-1500]
[null,"0001 - 60",{"$f":"VLOOKUP($B41,Store!$B$6:$AG$308,COLUMN()-1,0)","v":"ttoo"},{"$f":"VLOOKUP($B41,Store!$B$6:$AG$308,COLUMN()-1,0)","v":9114000032},{"$f":"VLOOKUP($B41,Store!$B$6:$AG$308,COLUMN()-1,0)","v":"مشكل عميل 60 اوردر 7011"},{"$f":"VLOOKUP($B41,Store!$B$6:$AG$308,COLUMN()-1,0)","v":60},{"$f":"VLOOKUP($B41,Store!$B$6:$AG$308,COLUMN()-1,0)","v":7011},{"$f":"VLOOKUP($B41,Store!$B$6:$AG$308,COLUMN()-1,0)","v":7011},{"$f":"VLOOKUP($B41,Store!$B$6:$AG$308,COLUMN()-1,0)","v":"Kitchen Towel"},{"$f":"VLOOKUP($B41,Store!$B$6:$AG$308,COLUMN()-1,0)","v":"Kitchen Towel"},{"$f":"VLOOKUP($B41,Store!$B$6:$AG$308,COLUMN()-1,0)","v":"Flat"},{"$f":"VLOOKUP($B41,Store!$B$6:$AG$308,COLUMN()-1,0)","v":"Flat"},{"$f":"VLOOKUP($B41,Store!$B$6:$AG$308,COLUMN()-1,0)","v":"50 X 70"},{"$f":"VLOOKUP($B41,Store!$B$6:$AG$308,COLUMN()-1,0)","v":"50 X 70"},{"$f":"VLOOKUP($B41,Store!$B$6:$AG$308,COLUMN()-1,0)","v":70},{"$f":"VLOOKUP($B41,Store!$B$6:$AG$308,COLUMN()-1,0)","v":70},{"$f":"VLOOKUP($B41,Store!$B$6:$AG$308,COLUMN()-1,0)","v":200},{"$f":"VLOOKUP($B41,Store!$B$6:$AG$308,COLUMN()-1,0)","v":"Very Light weight"},{"$f":"VLOOKUP($B41,Store!$B$6:$AG$308,COLUMN()-1,0)","v":"dark"},{"$f":"VLOOKUP($B41,Store!$B$6:$AG$308,COLUMN()-1,0)","v":"Second Choice"},{"$f":"VLOOKUP($B41,Store!$B$6:$AG$308,COLUMN()-1,0)","v":"100% cotton"},{"$f":"VLOOKUP($B41,Store!$B$6:$AG$308,COLUMN()-1,0)","v":"100% cotton"},{"$f":"VLOOKUP($B41,Store!$B$6:$AG$308,COLUMN()-1,0)","v":"24/2 - 16/1"},{"$f":"VLOOKUP($B41,Store!$B$6:$AG$308,COLUMN()-1,0)","v":"24/2 - 16/1"},{"$f":"VLOOKUP($B41,Store!$B$6:$AG$308,COLUMN()-1,0)","v":"Fresh"},{"$f":"VLOOKUP($B41,Store!$B$6:$AG$308,COLUMN()-1,0)","v":"Fresh"},{"$f":"VLOOKUP($B41,Store!$B$6:$AG$308,COLUMN()-1,0)","v":0},{"$f":"VLOOKUP($B41,Store!$B$6:$AG$308,COLUMN()-1,0)","v":"محمود"},{"$f":"VLOOKUP($B41,Store!$B$6:$AG$308,COLUMN()-1,0)","v":7},{"$f":"VLOOKUP($B41,Store!$B$6:$AG$308,COLUMN()-1,0)","v":100},{"$f":"VLOOKUP($B41,Store!$B$6:$AG$308,COLUMN()-1,0)","v":7},{"$f":"VLOOKUP($B41,Store!$B$6:$AG$308,COLUMN()-1,0)","v":"Dobby"},{"$f":"VLOOKUP($B41,Store!$B$6:$AG$308,COLUMN()-1,0)","v":"Normal"},null,null,{"$f":"SUMIFS(Store!$AD$6:$AD$308,Store!$B$6:$B$308,Rassed!B41,Store!$AH$6:$AH$308,\"اضافه\")","v":320},{"$f":"SUMIFS(Store!$AD$6:$AD$308,Store!$B$6:$B$308,Rassed!B41,Store!$AN$6:$AN$308,\"صرف\")","v":420},-100]
[null,"0002 - 60",{"$f":"VLOOKUP($B42,Store!$B$6:$AG$308,COLUMN()-1,0)","v":"cairo"},{"$f":"VLOOKUP($B42,Store!$B$6:$AG$308,COLUMN()-1,0)","v":9114000033},{"$f":"VLOOKUP($B42,Store!$B$6:$AG$308,COLUMN()-1,0)","v":"مشكل عميل 60 اوردر 7011"},{"$f":"VLOOKUP($B42,Store!$B$6:$AG$308,COLUMN()-1,0)","v":60},{"$f":"VLOOKUP($B42,Store!$B$6:$AG$308,COLUMN()-1,0)","v":7011},{"$f":"VLOOKUP($B42,Store!$B$6:$AG$308,COLUMN()-1,0)","v":7011},{"$f":"VLOOKUP($B42,Store!$B$6:$AG$308,COLUMN()-1,0)","v":"Kitchen Towel"},{"$f":"VLOOKUP($B42,Store!$B$6:$AG$308,COLUMN()-1,0)","v":"Kitchen Towel"},{"$f":"VLOOKUP($B42,Store!$B$6:$AG$308,COLUMN()-1,0)","v":"Flat"},{"$f":"VLOOKUP($B42,Store!$B$6:$AG$308,COLUMN()-1,0)","v":"Flat"},{"$f":"VLOOKUP($B42,Store!$B$6:$AG$308,COLUMN()-1,0)","v":"50 X 70"},{"$f":"VLOOKUP($B42,Store!$B$6:$AG$308,COLUMN()-1,0)","v":"50 X 70"},{"$f":"VLOOKUP($B42,Store!$B$6:$AG$308,COLUMN()-1,0)","v":70},{"$f":"VLOOKUP($B42,Store!$B$6:$AG$308,COLUMN()-1,0)","v":70},{"$f":"VLOOKUP($B42,Store!$B$6:$AG$308,COLUMN()-1,0)","v":200},{"$f":"VLOOKUP($B42,Store!$B$6:$AG$308,COLUMN()-1,0)","v":"Very Light weight"},{"$f":"VLOOKUP($B42,Store!$B$6:$AG$308,COLUMN()-1,0)","v":"dark"},{"$f":"VLOOKUP($B42,Store!$B$6:$AG$308,COLUMN()-1,0)","v":"Second Choice"},{"$f":"VLOOKUP($B42,Store!$B$6:$AG$308,COLUMN()-1,0)","v":"100% cotton"},{"$f":"VLOOKUP($B42,Store!$B$6:$AG$308,COLUMN()-1,0)","v":"100% cotton"},{"$f":"VLOOKUP($B42,Store!$B$6:$AG$308,COLUMN()-1,0)","v":"24/2 - 16/1"},{"$f":"VLOOKUP($B42,Store!$B$6:$AG$308,COLUMN()-1,0)","v":"24/2 - 16/1"},{"$f":"VLOOKUP($B42,Store!$B$6:$AG$308,COLUMN()-1,0)","v":"Fresh"},{"$f":"VLOOKUP($B42,Store!$B$6:$AG$308,COLUMN()-1,0)","v":"Fresh"},{"$f":"VLOOKUP($B42,Store!$B$6:$AG$308,COLUMN()-1,0)","v":0},{"$f":"VLOOKUP($B42,Store!$B$6:$AG$308,COLUMN()-1,0)","v":"محمود"},{"$f":"VLOOKUP($B42,Store!$B$6:$AG$308,COLUMN()-1,0)","v":8.4},{"$f":"VLOOKUP($B42,Store!$B$6:$AG$308,COLUMN()-1,0)","v":120},{"$f":"VLOOKUP($B42,Store!$B$6:$AG$308,COLUMN()-1,0)","v":8.4},{"$f":"VLOOKUP($B42,Store!$B$6:$AG$308,COLUMN()-1,0)","v":"Jacquard"},{"$f":"VLOOKUP($B42,Store!$B$6:$AG$308,COLUMN()-1,0)","v":"Normal"},null,null,{"$f":"SUMIFS(Store!$AD$6:$AD$308,Store!$B$6:$B$308,Rassed!B42,Store!$AH$6:$AH$308,\"اضافه\")","v":438},{"$f":"SUMIFS(Store!$AD$6:$AD$308,Store!$B$6:$B$308,Rassed!B42,Store!$AN$6:$AN$308,\"صرف\")","v":558},-120]
[null,"0003 - 60",{"$f":"VLOOKUP($B43,Store!$B$6:$AG$308,COLUMN()-1,0)","v":"mansura"},{"$f":"VLOOKUP($B43,Store!$B$6:$AG$308,COLUMN()-1,0)","v":9114000034},{"$f":"VLOOKUP($B43,Store!$B$6:$AG$308,COLUMN()-1,0)","v":"مشكل عميل 60 اوردر 7011"},{"$f":"VLOOKUP($B43,Store!$B$6:$AG$308,COLUMN()-1,0)","v":60},{"$f":"VLOOKUP($B43,Store!$B$6:$AG$308,COLUMN()-1,0)","v":7011},{"$f":"VLOOKUP($B43,Store!$B$6:$AG$308,COLUMN()-1,0)","v":7011},{"$f":"VLOOKUP($B43,Store!$B$6:$AG$308,COLUMN()-1,0)","v":"Kitchen Towel"},{"$f":"VLOOKUP($B43,Store!$B$6:$AG$308,COLUMN()-1,0)","v":"Kitchen Towel"},{"$f":"VLOOKUP($B43,Store!$B$6:$AG$308,COLUMN()-1,0)","v":"Flat"},{"$f":"VLOOKUP($B43,Store!$B$6:$AG$308,COLUMN()-1,0)","v":"Flat"},{"$f":"VLOOKUP($B43,Store!$B$6:$AG$308,COLUMN()-1,0)","v":"50 X 70"},{"$f":"VLOOKUP($B43,Store!$B$6:$AG$308,COLUMN()-1,0)","v":"50 X 70"},{"$f":"VLOOKUP($B43,Store!$B$6:$AG$308,COLUMN()-1,0)","v":70},{"$f":"VLOOKUP($B43,Store!$B$6:$AG$308,COLUMN()-1,0)","v":70},{"$f":"VLOOKUP($B43,Store!$B$6:$AG$308,COLUMN()-1,0)","v":200},{"$f":"VLOOKUP($B43,Store!$B$6:$AG$308,COLUMN()-1,0)","v":"Very Light weight"},{"$f":"VLOOKUP($B43,Store!$B$6:$AG$308,COLUMN()-1,0)","v":"dark"},{"$f":"VLOOKUP($B43,Store!$B$6:$AG$308,COLUMN()-1,0)","v":"Second Choice"},{"$f":"VLOOKUP($B43,Store!$B$6:$AG$308,COLUMN()-1,0)","v":"100% cotton"},{"$f":"VLOOKUP($B43,Store!$B$6:$AG$308,COLUMN()-1,0)","v":"100% cotton"},{"$f":"VLOOKUP($B43,Store!$B$6:$AG$308,COLUMN()-1,0)","v":"24/2 - 16/1"},{"$f":"VLOOKUP($B43,Store!$B$6:$AG$308,COLUMN()-1,0)","v":"24/2 - 16/1"},{"$f":"VLOOKUP($B43,Store!$B$6:$AG$308,COLUMN()-1,0)","v":"Fresh"},{"$f":"VLOOKUP($B43,Store!$B$6:$AG$308,COLUMN()-1,0)","v":"Fresh"},{"$f":"VLOOKUP($B43,Store!$B$6:$AG$308,COLUMN()-1,0)","v":0},{"$f":"VLOOKUP($B43,Store!$B$6:$AG$308,COLUMN()-1,0)","v":"محمود"},{"$f":"VLOOKUP($B43,Store!$B$6:$AG$308,COLUMN()-1,0)","v":2.1},{"$f":"VLOOKUP($B43,Store!$B$6:$AG$308,COLUMN()-1,0)","v":30},{"$f":"VLOOKUP($B43,Store!$B$6:$AG$308,COLUMN()-1,0)","v":2.1},{"$f":"VLOOKUP($B43,Store!$B$6:$AG$308,COLUMN()-1,0)","v":"Jacquard"},{"$f":"VLOOKUP($B43,Store!$B$6:$AG$308,COLUMN()-1,0)","v":"Normal"},null,null,{"$f":"SUMIFS(Store!$AD$6:$AD$308,Store!$B$6:$B$308,Rassed!B43,Store!$AH$6:$AH$308,\"اضافه\")","v":30},{"$f":"SUMIFS(Store!$AD$6:$AD$308,Store!$B$6:$B$308,Rassed!B43,Store!$AN$6:$AN$308,\"صرف\")","v":60},-30]
[null,"0004 - 60",{"$f":"VLOOKUP($B44,Store!$B$6:$AG$308,COLUMN()-1,0)","v":"mahalla"},{"$f":"VLOOKUP($B44,Store!$B$6:$AG$308,COLUMN()-1,0)","v":9114000035},{"$f":"VLOOKUP($B44,Store!$B$6:$AG$308,COLUMN()-1,0)","v":"مشكل عميل 60 اوردر 7011"},{"$f":"VLOOKUP($B44,Store!$B$6:$AG$308,COLUMN()-1,0)","v":60},{"$f":"VLOOKUP($B44,Store!$B$6:$AG$308,COLUMN()-1,0)","v":7011},{"$f":"VLOOKUP($B44,Store!$B$6:$AG$308,COLUMN()-1,0)","v":7011},{"$f":"VLOOKUP($B44,Store!$B$6:$AG$308,COLUMN()-1,0)","v":"Kitchen Towel"},{"$f":"VLOOKUP($B44,Store!$B$6:$AG$308,COLUMN()-1,0)","v":"Kitchen Towel"},{"$f":"VLOOKUP($B44,Store!$B$6:$AG$308,COLUMN()-1,0)","v":"Flat"},{"$f":"VLOOKUP($B44,Store!$B$6:$AG$308,COLUMN()-1,0)","v":"Flat"},{"$f":"VLOOKUP($B44,Store!$B$6:$AG$308,COLUMN()-1,0)","v":"50 X 70"},{"$f":"VLOOKUP($B44,Store!$B$6:$AG$308,COLUMN()-1,0)","v":"50 X 70"},{"$f":"VLOOKUP($B44,Store!$B$6:$AG$308,COLUMN()-1,0)","v":70},{"$f":"VLOOKUP($B44,Store!$B$6:$AG$308,COLUMN()-1,0)","v":70},{"$f":"VLOOKUP($B44,Store!$B$6:$AG$308,COLUMN()-1,0)","v":200},{"$f":"VLOOKUP($B44,Store!$B$6:$AG$308,COLUMN()-1,0)","v":"Very Light weight"},{"$f":"VLOOKUP($B44,Store!$B$6:$AG$308,COLUMN()-1,0)","v":"dark"},{"$f":"VLOOKUP($B44,Store!$B$6:$AG$308,COLUMN()-1,0)","v":"Second Choice"},{"$f":"VLOOKUP($B44,Store!$B$6:$AG$308,COLUMN()-1,0)","v":"100% cotton"},{"$f":"VLOOKUP($B44,Store!$B$6:$AG$308,COLUMN()-1,0)","v":"100% cotton"},{"$f":"VLOOKUP($B44,Store!$B$6:$AG$308,COLUMN()-1,0)","v":"24/2 - 16/1"},{"$f":"VLOOKUP($B44,Store!$B$6:$AG$308,COLUMN()-1,0)","v":"24/2 - 16/1"},{"$f":"VLOOKUP($B44,Store!$B$6:$AG$308,COLUMN()-1,0)","v":"Fresh"},{"$f":"VLOOKUP($B44,Store!$B$6:$AG$308,COLUMN()-1,0)","v":"Fresh"},{"$f":"VLOOKUP($B44,Store!$B$6:$AG$308,COLUMN()-1,0)","v":0},{"$f":"VLOOKUP($B44,Store!$B$6:$AG$308,COLUMN()-1,0)","v":"محمود"},{"$f":"VLOOKUP($B44,Store!$B$6:$AG$308,COLUMN()-1,0)","v":1.05},{"$f":"VLOOKUP($B44,Store!$B$6:$AG$308,COLUMN()-1,0)","v":15},{"$f":"VLOOKUP($B44,Store!$B$6:$AG$308,COLUMN()-1,0)","v":1.05},{"$f":"VLOOKUP($B44,Store!$B$6:$AG$308,COLUMN()-1,0)","v":"Dobby"},{"$f":"VLOOKUP($B44,Store!$B$6:$AG$308,COLUMN()-1,0)","v":"Normal"},null,null,{"$f":"SUMIFS(Store!$AD$6:$AD$308,Store!$B$6:$B$308,Rassed!B44,Store!$AH$6:$AH$308,\"اضافه\")","v":15},{"$f":"SUMIFS(Store!$AD$6:$AD$308,Store!$B$6:$B$308,Rassed!B44,Store!$AN$6:$AN$308,\"صرف\")","v":30},-15]
[null,"0005 - 60",{"$f":"VLOOKUP($B45,Store!$B$6:$AG$308,COLUMN()-1,0)","v":"louxur"},{"$f":"VLOOKUP($B45,Store!$B$6:$AG$308,COLUMN()-1,0)","v":9114000036},{"$f":"VLOOKUP($B45,Store!$B$6:$AG$308,COLUMN()-1,0)","v":"مشكل عميل 60 اوردر 7011"},{"$f":"VLOOKUP($B45,Store!$B$6:$AG$308,COLUMN()-1,0)","v":60},{"$f":"VLOOKUP($B45,Store!$B$6:$AG$308,COLUMN()-1,0)","v":7011},{"$f":"VLOOKUP($B45,Store!$B$6:$AG$308,COLUMN()-1,0)","v":7011},{"$f":"VLOOKUP($B45,Store!$B$6:$AG$308,COLUMN()-1,0)","v":"Kitchen Towel"},{"$f":"VLOOKUP($B45,Store!$B$6:$AG$308,COLUMN()-1,0)","v":"Kitchen Towel"},{"$f":"VLOOKUP($B45,Store!$B$6:$AG$308,COLUMN()-1,0)","v":"Flat"},{"$f":"VLOOKUP($B45,Store!$B$6:$AG$308,COLUMN()-1,0)","v":"Flat"},{"$f":"VLOOKUP($B45,Store!$B$6:$AG$308,COLUMN()-1,0)","v":"50 X 70"},{"$f":"VLOOKUP($B45,Store!$B$6:$AG$308,COLUMN()-1,0)","v":"50 X 70"},{"$f":"VLOOKUP($B45,Store!$B$6:$AG$308,COLUMN()-1,0)","v":70},{"$f":"VLOOKUP($B45,Store!$B$6:$AG$308,COLUMN()-1,0)","v":70},{"$f":"VLOOKUP($B45,Store!$B$6:$AG$308,COLUMN()-1,0)","v":200},{"$f":"VLOOKUP($B45,Store!$B$6:$AG$308,COLUMN()-1,0)","v":"Very Light weight"},{"$f":"VLOOKUP($B45,Store!$B$6:$AG$308,COLUMN()-1,0)","v":"dark"},{"$f":"VLOOKUP($B45,Store!$B$6:$AG$308,COLUMN()-1,0)","v":"Second Choice"},{"$f":"VLOOKUP($B45,Store!$B$6:$AG$308,COLUMN()-1,0)","v":"100% cotton"},{"$f":"VLOOKUP($B45,Store!$B$6:$AG$308,COLUMN()-1,0)","v":"100% cotton"},{"$f":"VLOOKUP($B45,Store!$B$6:$AG$308,COLUMN()-1,0)","v":"24/2 - 16/1"},{"$f":"VLOOKUP($B45,Store!$B$6:$AG$308,COLUMN()-1,0)","v":"24/2 - 16/1"},{"$f":"VLOOKUP($B45,Store!$B$6:$AG$308,COLUMN()-1,0)","v":"Fresh"},{"$f":"VLOOKUP($B45,Store!$B$6:$AG$308,COLUMN()-1,0)","v":"Fresh"},{"$f":"VLOOKUP($B45,Store!$B$6:$AG$308,COLUMN()-1,0)","v":0},{"$f":"VLOOKUP($B45,Store!$B$6:$AG$308,COLUMN()-1,0)","v":"محمود"},{"$f":"VLOOKUP($B45,Store!$B$6:$AG$308,COLUMN()-1,0)","v":0.7},{"$f":"VLOOKUP($B45,Store!$B$6:$AG$308,COLUMN()-1,0)","v":10},{"$f":"VLOOKUP($B45,Store!$B$6:$AG$308,COLUMN()-1,0)","v":0.7},{"$f":"VLOOKUP($B45,Store!$B$6:$AG$308,COLUMN()-1,0)","v":"Dobby"},{"$f":"VLOOKUP($B45,Store!$B$6:$AG$308,COLUMN()-1,0)","v":"Normal"},null,null,{"$f":"SUMIFS(Store!$AD$6:$AD$308,Store!$B$6:$B$308,Rassed!B45,Store!$AH$6:$AH$308,\"اضافه\")","v":10},{"$f":"SUMIFS(Store!$AD$6:$AD$308,Store!$B$6:$B$308,Rassed!B45,Store!$AN$6:$AN$308,\"صرف\")","v":20},-10]
[null,"0006 - 60",{"$f":"VLOOKUP($B46,Store!$B$6:$AG$308,COLUMN()-1,0)","v":"aswan"},{"$f":"VLOOKUP($B46,Store!$B$6:$AG$308,COLUMN()-1,0)","v":9114000037},{"$f":"VLOOKUP($B46,Store!$B$6:$AG$308,COLUMN()-1,0)","v":"مشكل عميل 60 اوردر 7011"},{"$f":"VLOOKUP($B46,Store!$B$6:$AG$308,COLUMN()-1,0)","v":60},{"$f":"VLOOKUP($B46,Store!$B$6:$AG$308,COLUMN()-1,0)","v":7011},{"$f":"VLOOKUP($B46,Store!$B$6:$AG$308,COLUMN()-1,0)","v":7011},{"$f":"VLOOKUP($B46,Store!$B$6:$AG$308,COLUMN()-1,0)","v":"Kitchen Towel"},{"$f":"VLOOKUP($B46,Store!$B$6:$AG$308,COLUMN()-1,0)","v":"Kitchen Towel"},{"$f":"VLOOKUP($B46,Store!$B$6:$AG$308,COLUMN()-1,0)","v":"Flat"},{"$f":"VLOOKUP($B46,Store!$B$6:$AG$308,COLUMN()-1,0)","v":"Flat"},{"$f":"VLOOKUP($B46,Store!$B$6:$AG$308,COLUMN()-1,0)","v":"50 X 70"},{"$f":"VLOOKUP($B46,Store!$B$6:$AG$308,COLUMN()-1,0)","v":"50 X 70"},{"$f":"VLOOKUP($B46,Store!$B$6:$AG$308,COLUMN()-1,0)","v":70},{"$f":"VLOOKUP($B46,Store!$B$6:$AG$308,COLUMN()-1,0)","v":70},{"$f":"VLOOKUP($B46,Store!$B$6:$AG$308,COLUMN()-1,0)","v":200},{"$f":"VLOOKUP($B46,Store!$B$6:$AG$308,COLUMN()-1,0)","v":"Very Light weight"},{"$f":"VLOOKUP($B46,Store!$B$6:$AG$308,COLUMN()-1,0)","v":"dark"},{"$f":"VLOOKUP($B46,Store!$B$6:$AG$308,COLUMN()-1,0)","v":"Second Choice"},{"$f":"VLOOKUP($B46,Store!$B$6:$AG$308,COLUMN()-1,0)","v":"100% cotton"},{"$f":"VLOOKUP($B46,Store!$B$6:$AG$308,COLUMN()-1,0)","v":"100% cotton"},{"$f":"VLOOKUP($B46,Store!$B$6:$AG$308,COLUMN()-1,0)","v":"24/2 - 16/1"},{"$f":"VLOOKUP($B46,Store!$B$6:$AG$308,COLUMN()-1,0)","v":"24/2 - 16/1"},{"$f":"VLOOKUP($B46,Store!$B$6:$AG$308,COLUMN()-1,0)","v":"Fresh"},{"$f":"VLOOKUP($B46,Store!$B$6:$AG$308,COLUMN()-1,0)","v":"Fresh"},{"$f":"VLOOKUP($B46,Store!$B$6:$AG$308,COLUMN()-1,0)","v":0},{"$f":"VLOOKUP($B46,Store!$B$6:$AG$308,COLUMN()-1,0)","v":"محمود"},{"$f":"VLOOKUP($B46,Store!$B$6:$AG$308,COLUMN()-1,0)","v":1.75},{"$f":"VLOOKUP($B46,Store!$B$6:$AG$308,COLUMN()-1,0)","v":25},{"$f":"VLOOKUP($B46,Store!$B$6:$AG$308,COLUMN()-1,0)","v":1.75},{"$f":"VLOOKUP($B46,Store!$B$6:$AG$308,COLUMN()-1,0)","v":"Jacquard"},{"$f":"VLOOKUP($B46,Store!$B$6:$AG$308,COLUMN()-1,0)","v":"Normal"},null,null,{"$f":"SUMIFS(Store!$AD$6:$AD$308,Store!$B$6:$B$308,Rassed!B46,Store!$AH$6:$AH$308,\"اضافه\")","v":25},{"$f":"SUMIFS(Store!$AD$6:$AD$308,Store!$B$6:$B$308,Rassed!B46,Store!$AN$6:$AN$308,\"صرف\")","v":50},-25]
[null,"0013 - 34",{"$f":"VLOOKUP($B47,Store!$B$6:$AG$308,COLUMN()-1,0)","v":"AAAA"},{"$f":"VLOOKUP($B47,Store!$B$6:$AG$308,COLUMN()-1,0)","v":9114000009},{"$f":"VLOOKUP($B47,Store!$B$6:$AG$308,COLUMN()-1,0)","v":"مشكل عميل 34 اوردر 7002"},{"$f":"VLOOKUP($B47,Store!$B$6:$AG$308,COLUMN()-1,0)","v":34},{"$f":"VLOOKUP($B47,Store!$B$6:$AG$308,COLUMN()-1,0)","v":7007},{"$f":"VLOOKUP($B47,Store!$B$6:$AG$308,COLUMN()-1,0)","v":7007},{"$f":"VLOOKUP($B47,Store!$B$6:$AG$308,COLUMN()-1,0)","v":"Kitchen Towel"},{"$f":"VLOOKUP($B47,Store!$B$6:$AG$308,COLUMN()-1,0)","v":"Kitchen Towel"},{"$f":"VLOOKUP($B47,Store!$B$6:$AG$308,COLUMN()-1,0)","v":"Flat"},{"$f":"VLOOKUP($B47,Store!$B$6:$AG$308,COLUMN()-1,0)","v":"Flat"},{"$f":"VLOOKUP($B47,Store!$B$6:$AG$308,COLUMN()-1,0)","v":"50 X 70"},{"$f":"VLOOKUP($B47,Store!$B$6:$AG$308,COLUMN()-1,0)","v":"50 X 70"},{"$f":"VLOOKUP($B47,Store!$B$6:$AG$308,COLUMN()-1,0)","v":70},{"$f":"VLOOKUP($B47,Store!$B$6:$AG$308,COLUMN()-1,0)","v":70},{"$f":"VLOOKUP($B47,Store!$B$6:$AG$308,COLUMN()-1,0)","v":200},{"$f":"VLOOKUP($B47,Store!$B$6:$AG$308,COLUMN()-1,0)","v":"Very Light weight"},{"$f":"VLOOKUP($B47,Store!$B$6:$AG$308,COLUMN()-1,0)","v":"dark"},{"$f":"VLOOKUP($B47,Store!$B$6:$AG$308,COLUMN()-1,0)","v":"Second Choice"},{"$f":"VLOOKUP($B47,Store!$B$6:$AG$308,COLUMN()-1,0)","v":"100% cotton"},{"$f":"VLOOKUP($B47,Store!$B$6:$AG$308,COLUMN()-1,0)","v":"100% cotton"},{"$f":"VLOOKUP($B47,Store!$B$6:$AG$308,COLUMN()-1,0)","v":"24/2 - 16/1"},{"$f":"VLOOKUP($B47,Store!$B$6:$AG$308,COLUMN()-1,0)","v":"24/2 - 16/1"},{"$f":"VLOOKUP($B47,Store!$B$6:$AG$308,COLUMN()-1,0)","v":"Fresh"},{"$f":"VLOOKUP($B47,Store!$B$6:$AG$308,COLUMN()-1,0)","v":"Fresh"},{"$f":"VLOOKUP($B47,Store!$B$6:$AG$308,COLUMN()-1,0)","v":0},{"$f":"VLOOKUP($B47,Store!$B$6:$AG$308,COLUMN()-1,0)","v":"محمود"},{"$f":"VLOOKUP($B47,Store!$B$6:$AG$308,COLUMN()-1,0)","v":1.2},{"$f":"VLOOKUP($B47,Store!$B$6:$AG$308,COLUMN()-1,0)","v":20},{"$f":"VLOOKUP($B47,Store!$B$6:$AG$308,COLUMN()-1,0)","v":1.4},{"$f":"VLOOKUP($B47,Store!$B$6:$AG$308,COLUMN()-1,0)","v":"Jacquard"},{"$f":"VLOOKUP($B47,Store!$B$6:$AG$308,COLUMN()-1,0)","v":"Normal"},null,null,{"$f":"SUMIFS(Store!$AD$6:$AD$308,Store!$B$6:$B$308,Rassed!B47,Store!$AH$6:$AH$308,\"اضافه\")","v":52},{"$f":"SUMIFS(Store!$AD$6:$AD$308,Store!$B$6:$B$308,Rassed!B47,Store!$AN$6:$AN$308,\"صرف\")","v":112},-60]
[null,"0014 - 34",{"$f":"VLOOKUP($B48,Store!$B$6:$AG$308,COLUMN()-1,0)","v":"BBBB"},{"$f":"VLOOKUP($B48,Store!$B$6:$AG$308,COLUMN()-1,0)","v":9114000010},{"$f":"VLOOKUP($B48,Store!$B$6:$AG$308,COLUMN()-1,0)","v":"مشكل عميل 34 اوردر 7002"},{"$f":"VLOOKUP($B48,Store!$B$6:$AG$308,COLUMN()-1,0)","v":34},{"$f":"VLOOKUP($B48,Store!$B$6:$AG$308,COLUMN()-1,0)","v":7007},{"$f":"VLOOKUP($B48,Store!$B$6:$AG$308,COLUMN()-1,0)","v":7007},{"$f":"VLOOKUP($B48,Store!$B$6:$AG$308,COLUMN()-1,0)","v":"Kitchen Towel"},{"$f":"VLOOKUP($B48,Store!$B$6:$AG$308,COLUMN()-1,0)","v":"Kitchen Towel"},{"$f":"VLOOKUP($B48,Store!$B$6:$AG$308,COLUMN()-1,0)","v":"Flat"},{"$f":"VLOOKUP($B48,Store!$B$6:$AG$308,COLUMN()-1,0)","v":"Flat"},{"$f":"VLOOKUP($B48,Store!$B$6:$AG$308,COLUMN()-1,0)","v":"50 X 70"},{"$f":"VLOOKUP($B48,Store!$B$6:$AG$308,COLUMN()-1,0)","v":"50 X 70"},{"$f":"VLOOKUP($B48,Store!$B$6:$AG$308,COLUMN()-1,0)","v":70},{"$f":"VLOOKUP($B48,Store!$B$6:$AG$308,COLUMN()-1,0)","v":70},{"$f":"VLOOKUP($B48,Store!$B$6:$AG$308,COLUMN()-1,0)","v":200},{"$f":"VLOOKUP($B48,Store!$B$6:$AG$308,COLUMN()-1,0)","v":"Very Light weight"},{"$f":"VLOOKUP($B48,Store!$B$6:$AG$308,COLUMN()-1,0)","v":"dark"},{"$f":"VLOOKUP($B48,Store!$B$6:$AG$308,COLUMN()-1,0)","v":"Second Choice"},{"$f":"VLOOKUP($B48,Store!$B$6:$AG$308,COLUMN()-1,0)","v":"100% cotton"},{"$f":"VLOOKUP($B48,Store!$B$6:$AG$308,COLUMN()-1,0)","v":"100% cotton"},{"$f":"VLOOKUP($B48,Store!$B$6:$AG$308,COLUMN()-1,0)","v":"24/2 - 16/1"},{"$f":"VLOOKUP($B48,Store!$B$6:$AG$308,COLUMN()-1,0)","v":"24/2 - 16/1"},{"$f":"VLOOKUP($B48,Store!$B$6:$AG$308,COLUMN()-1,0)","v":"Fresh"},{"$f":"VLOOKUP($B48,Store!$B$6:$AG$308,COLUMN()-1,0)","v":"Fresh"},{"$f":"VLOOKUP($B48,Store!$B$6:$AG$308,COLUMN()-1,0)","v":0},{"$f":"VLOOKUP($B48,Store!$B$6:$AG$308,COLUMN()-1,0)","v":"محمود"},{"$f":"VLOOKUP($B48,Store!$B$6:$AG$308,COLUMN()-1,0)","v":1.2},{"$f":"VLOOKUP($B48,Store!$B$6:$AG$308,COLUMN()-1,0)","v":20},{"$f":"VLOOKUP($B48,Store!$B$6:$AG$308,COLUMN()-1,0)","v":1.4},{"$f":"VLOOKUP($B48,Store!$B$6:$AG$308,COLUMN()-1,0)","v":"Dobby"},{"$f":"VLOOKUP($B48,Store!$B$6:$AG$308,COLUMN()-1,0)","v":"Normal"},null,null,{"$f":"SUMIFS(Store!$AD$6:$AD$308,Store!$B$6:$B$308,Rassed!B48,Store!$AH$6:$AH$308,\"اضافه\")","v":73},{"$f":"SUMIFS(Store!$AD$6:$AD$308,Store!$B$6:$B$308,Rassed!B48,Store!$AN$6:$AN$308,\"صرف\")","v":143},-70]
[null,"0015 - 34",{"$f":"VLOOKUP($B49,Store!$B$6:$AG$308,COLUMN()-1,0)","v":"CCCC"},{"$f":"VLOOKUP($B49,Store!$B$6:$AG$308,COLUMN()-1,0)","v":9114000011},{"$f":"VLOOKUP($B49,Store!$B$6:$AG$308,COLUMN()-1,0)","v":"مشكل عميل 34 اوردر 7002"},{"$f":"VLOOKUP($B49,Store!$B$6:$AG$308,COLUMN()-1,0)","v":34},{"$f":"VLOOKUP($B49,Store!$B$6:$AG$308,COLUMN()-1,0)","v":7007},{"$f":"VLOOKUP($B49,Store!$B$6:$AG$308,COLUMN()-1,0)","v":7007},{"$f":"VLOOKUP($B49,Store!$B$6:$AG$308,COLUMN()-1,0)","v":"Kitchen Towel"},{"$f":"VLOOKUP($B49,Store!$B$6:$AG$308,COLUMN()-1,0)","v":"Kitchen Towel"},{"$f":"VLOOKUP($B49,Store!$B$6:$AG$308,COLUMN()-1,0)","v":"Flat"},{"$f":"VLOOKUP($B49,Store!$B$6:$AG$308,COLUMN()-1,0)","v":"Flat"},{"$f":"VLOOKUP($B49,Store!$B$6:$AG$308,COLUMN()-1,0)","v":"50 X 70"},{"$f":"VLOOKUP($B49,Store!$B$6:$AG$308,COLUMN()-1,0)","v":"50 X 70"},{"$f":"VLOOKUP($B49,Store!$B$6:$AG$308,COLUMN()-1,0)","v":70},{"$f":"VLOOKUP($B49,Store!$B$6:$AG$308,COLUMN()-1,0)","v":70},{"$f":"VLOOKUP($B49,Store!$B$6:$AG$308,COLUMN()-1,0)","v":200},{"$f":"VLOOKUP($B49,Store!$B$6:$AG$308,COLUMN()-1,0)","v":"Very Light weight"},{"$f":"VLOOKUP($B49,Store!$B$6:$AG$308,COLUMN()-1,0)","v":"dark"},{"$f":"VLOOKUP($B49,Store!$B$6:$AG$308,COLUMN()-1,0)","v":"Second Choice"},{"$f":"VLOOKUP($B49,Store!$B$6:$AG$308,COLUMN()-1,0)","v":"100% cotton"},{"$f":"VLOOKUP($B49,Store!$B$6:$AG$308,COLUMN()-1,0)","v":"100% cotton"},{"$f":"VLOOKUP($B49,Store!$B$6:$AG$308,COLUMN()-1,0)","v":"24/2 - 16/1"},{"$f":"VLOOKUP($B49,Store!$B$6:$AG$308,COLUMN()-1,0)","v":"24/2 - 16/1"},{"$f":"VLOOKUP($B49,Store!$B$6:$AG$308,COLUMN()-1,0)","v":"Fresh"},{"$f":"VLOOKUP($B49,Store!$B$6:$AG$308,COLUMN()-1,0)","v":"Fresh"},{"$f":"VLOOKUP($B49,Store!$B$6:$AG$308,COLUMN()-1,0)","v":0},{"$f":"VLOOKUP($B49,Store!$B$6:$AG$308,COLUMN()-1,0)","v":"محمود"},{"$f":"VLOOKUP($B49,Store!$B$6:$AG$308,COLUMN()-1,0)","v":1.8000000000000003},{"$f":"VLOOKUP($B49,Store!$B$6:$AG$308,COLUMN()-1,0)","v":30},{"$f":"VLOOKUP($B49,Store!$B$6:$AG$308,COLUMN()-1,0)","v":2.1},{"$f":"VLOOKUP($B49,Store!$B$6:$AG$308,COLUMN()-1,0)","v":"Jacquard"},{"$f":"VLOOKUP($B49,Store!$B$6:$AG$308,COLUMN()-1,0)","v":"Normal"},null,null,{"$f":"SUMIFS(Store!$AD$6:$AD$308,Store!$B$6:$B$308,Rassed!B49,Store!$AH$6:$AH$308,\"اضافه\")","v":105},{"$f":"SUMIFS(Store!$AD$6:$AD$308,Store!$B$6:$B$308,Rassed!B49,Store!$AN$6:$AN$308,\"صرف\")","v":195},-90]
[null,"0016 - 34",{"$f":"VLOOKUP($B50,Store!$B$6:$AG$308,COLUMN()-1,0)","v":"DDDD"},{"$f":"VLOOKUP($B50,Store!$B$6:$AG$308,COLUMN()-1,0)","v":9114000012},{"$f":"VLOOKUP($B50,Store!$B$6:$AG$308,COLUMN()-1,0)","v":"مشكل عميل 34 اوردر 7002"},{"$f":"VLOOKUP($B50,Store!$B$6:$AG$308,COLUMN()-1,0)","v":34},{"$f":"VLOOKUP($B50,Store!$B$6:$AG$308,COLUMN()-1,0)","v":7007},{"$f":"VLOOKUP($B50,Store!$B$6:$AG$308,COLUMN()-1,0)","v":7007},{"$f":"VLOOKUP($B50,Store!$B$6:$AG$308,COLUMN()-1,0)","v":"Kitchen Towel"},{"$f":"VLOOKUP($B50,Store!$B$6:$AG$308,COLUMN()-1,0)","v":"Kitchen Towel"},{"$f":"VLOOKUP($B50,Store!$B$6:$AG$308,COLUMN()-1,0)","v":"Flat"},{"$f":"VLOOKUP($B50,Store!$B$6:$AG$308,COLUMN()-1,0)","v":"Flat"},{"$f":"VLOOKUP($B50,Store!$B$6:$AG$308,COLUMN()-1,0)","v":"50 X 70"},{"$f":"VLOOKUP($B50,Store!$B$6:$AG$308,COLUMN()-1,0)","v":"50 X 70"},{"$f":"VLOOKUP($B50,Store!$B$6:$AG$308,COLUMN()-1,0)","v":70},{"$f":"VLOOKUP($B50,Store!$B$6:$AG$308,COLUMN()-1,0)","v":70},{"$f":"VLOOKUP($B50,Store!$B$6:$AG$308,COLUMN()-1,0)","v":200},{"$f":"VLOOKUP($B50,Store!$B$6:$AG$308,COLUMN()-1,0)","v":"Very Light weight"},{"$f":"VLOOKUP($B50,Store!$B$6:$AG$308,COLUMN()-1,0)","v":"dark"},{"$f":"VLOOKUP($B50,Store!$B$6:$AG$308,COLUMN()-1,0)","v":"Second Choice"},{"$f":"VLOOKUP($B50,Store!$B$6:$AG$308,COLUMN()-1,0)","v":"100% cotton"},{"$f":"VLOOKUP($B50,Store!$B$6:$AG$308,COLUMN()-1,0)","v":"100% cotton"},{"$f":"VLOOKUP($B50,Store!$B$6:$AG$308,COLUMN()-1,0)","v":"24/2 - 16/1"},{"$f":"VLOOKUP($B50,Store!$B$6:$AG$308,COLUMN()-1,0)","v":"24/2 - 16/1"},{"$f":"VLOOKUP($B50,Store!$B$6:$AG$308,COLUMN()-1,0)","v":"Fresh"},{"$f":"VLOOKUP($B50,Store!$B$6:$AG$308,COLUMN()-1,0)","v":"Fresh"},{"$f":"VLOOKUP($B50,Store!$B$6:$AG$308,COLUMN()-1,0)","v":0},{"$f":"VLOOKUP($B50,Store!$B$6:$AG$308,COLUMN()-1,0)","v":"محمود"},{"$f":"VLOOKUP($B50,Store!$B$6:$AG$308,COLUMN()-1,0)","v":3},{"$f":"VLOOKUP($B50,Store!$B$6:$AG$308,COLUMN()-1,0)","v":50},{"$f":"VLOOKUP($B50,Store!$B$6:$AG$308,COLUMN()-1,0)","v":3.5},{"$f":"VLOOKUP($B50,Store!$B$6:$AG$308,COLUMN()-1,0)","v":"Dobby"},{"$f":"VLOOKUP($B50,Store!$B$6:$AG$308,COLUMN()-1,0)","v":"Normal"},null,null,{"$f":"SUMIFS(Store!$AD$6:$AD$308,Store!$B$6:$B$308,Rassed!B50,Store!$AH$6:$AH$308,\"اضافه\")","v":112},{"$f":"SUMIFS(Store!$AD$6:$AD$308,Store!$B$6:$B$308,Rassed!B50,Store!$AN$6:$AN$308,\"صرف\")","v":224},-112]
[null,"0017 - 34",{"$f":"VLOOKUP($B51,Store!$B$6:$AG$308,COLUMN()-1,0)","v":"EEEE"},{"$f":"VLOOKUP($B51,Store!$B$6:$AG$308,COLUMN()-1,0)","v":9114000013},{"$f":"VLOOKUP($B51,Store!$B$6:$AG$308,COLUMN()-1,0)","v":"مشكل عميل 34 اوردر 7002"},{"$f":"VLOOKUP($B51,Store!$B$6:$AG$308,COLUMN()-1,0)","v":34},{"$f":"VLOOKUP($B51,Store!$B$6:$AG$308,COLUMN()-1,0)","v":7007},{"$f":"VLOOKUP($B51,Store!$B$6:$AG$308,COLUMN()-1,0)","v":7007},{"$f":"VLOOKUP($B51,Store!$B$6:$AG$308,COLUMN()-1,0)","v":"Kitchen Towel"},{"$f":"VLOOKUP($B51,Store!$B$6:$AG$308,COLUMN()-1,0)","v":"Kitchen Towel"},{"$f":"VLOOKUP($B51,Store!$B$6:$AG$308,COLUMN()-1,0)","v":"Flat"},{"$f":"VLOOKUP($B51,Store!$B$6:$AG$308,COLUMN()-1,0)","v":"Flat"},{"$f":"VLOOKUP($B51,Store!$B$6:$AG$308,COLUMN()-1,0)","v":"50 X 70"},{"$f":"VLOOKUP($B51,Store!$B$6:$AG$308,COLUMN()-1,0)","v":"50 X 70"},{"$f":"VLOOKUP($B51,Store!$B$6:$AG$308,COLUMN()-1,0)","v":70},{"$f":"VLOOKUP($B51,Store!$B$6:$AG$308,COLUMN()-1,0)","v":70},{"$f":"VLOOKUP($B51,Store!$B$6:$AG$308,COLUMN()-1,0)","v":200},{"$f":"VLOOKUP($B51,Store!$B$6:$AG$308,COLUMN()-1,0)","v":"Very Light weight"},{"$f":"VLOOKUP($B51,Store!$B$6:$AG$308,COLUMN()-1,0)","v":"dark"},{"$f":"VLOOKUP($B51,Store!$B$6:$AG$308,COLUMN()-1,0)","v":"Second Choice"},{"$f":"VLOOKUP($B51,Store!$B$6:$AG$308,COLUMN()-1,0)","v":"100% cotton"},{"$f":"VLOOKUP($B51,Store!$B$6:$AG$308,COLUMN()-1,0)","v":"100% cotton"},{"$f":"VLOOKUP($B51,Store!$B$6:$AG$308,COLUMN()-1,0)","v":"24/2 - 16/1"},{"$f":"VLOOKUP($B51,Store!$B$6:$AG$308,COLUMN()-1,0)","v":"24/2 - 16/1"},{"$f":"VLOOKUP($B51,Store!$B$6:$AG$308,COLUMN()-1,0)","v":"Fresh"},{"$f":"VLOOKUP($B51,Store!$B$6:$AG$308,COLUMN()-1,0)","v":"Fresh"},{"$f":"VLOOKUP($B51,Store!$B$6:$AG$308,COLUMN()-1,0)","v":0},{"$f":"VLOOKUP($B51,Store!$B$6:$AG$308,COLUMN()-1,0)","v":"محمود"},{"$f":"VLOOKUP($B51,Store!$B$6:$AG$308,COLUMN()-1,0)","v":0.6},{"$f":"VLOOKUP($B51,Store!$B$6:$AG$308,COLUMN()-1,0)","v":10},{"$f":"VLOOKUP($B51,Store!$B$6:$AG$308,COLUMN()-1,0)","v":0.7},{"$f":"VLOOKUP($B51,Store!$B$6:$AG$308,COLUMN()-1,0)","v":"Dobby"},{"$f":"VLOOKUP($B51,Store!$B$6:$AG$308,COLUMN()-1,0)","v":"Normal"},null,null,{"$f":"SUMIFS(Store!$AD$6:$AD$308,Store!$B$6:$B$308,Rassed!B51,Store!$AH$6:$AH$308,\"اضافه\")","v":30},{"$f":"SUMIFS(Store!$AD$6:$AD$308,Store!$B$6:$B$308,Rassed!B51,Store!$AN$6:$AN$308,\"صرف\")","v":60},-30]
[null,"0018 - 34",{"$f":"VLOOKUP($B52,Store!$B$6:$AG$308,COLUMN()-1,0)","v":"FFFFF"},{"$f":"VLOOKUP($B52,Store!$B$6:$AG$308,COLUMN()-1,0)","v":9114000014},{"$f":"VLOOKUP($B52,Store!$B$6:$AG$308,COLUMN()-1,0)","v":"مشكل عميل 34 اوردر 7002"},{"$f":"VLOOKUP($B52,Store!$B$6:$AG$308,COLUMN()-1,0)","v":34},{"$f":"VLOOKUP($B52,Store!$B$6:$AG$308,COLUMN()-1,0)","v":7007},{"$f":"VLOOKUP($B52,Store!$B$6:$AG$308,COLUMN()-1,0)","v":7007},{"$f":"VLOOKUP($B52,Store!$B$6:$AG$308,COLUMN()-1,0)","v":"Kitchen Towel"},{"$f":"VLOOKUP($B52,Store!$B$6:$AG$308,COLUMN()-1,0)","v":"Kitchen Towel"},{"$f":"VLOOKUP($B52,Store!$B$6:$AG$308,COLUMN()-1,0)","v":"Flat"},{"$f":"VLOOKUP($B52,Store!$B$6:$AG$308,COLUMN()-1,0)","v":"Flat"},{"$f":"VLOOKUP($B52,Store!$B$6:$AG$308,COLUMN()-1,0)","v":"50 X 70"},{"$f":"VLOOKUP($B52,Store!$B$6:$AG$308,COLUMN()-1,0)","v":"50 X 70"},{"$f":"VLOOKUP($B52,Store!$B$6:$AG$308,COLUMN()-1,0)","v":70},{"$f":"VLOOKUP($B52,Store!$B$6:$AG$308,COLUMN()-1,0)","v":70},{"$f":"VLOOKUP($B52,Store!$B$6:$AG$308,COLUMN()-1,0)","v":200},{"$f":"VLOOKUP($B52,Store!$B$6:$AG$308,COLUMN()-1,0)","v":"Very Light weight"},{"$f":"VLOOKUP($B52,Store!$B$6:$AG$308,COLUMN()-1,0)","v":"dark"},{"$f":"VLOOKUP($B52,Store!$B$6:$AG$308,COLUMN()-1,0)","v":"Second Choice"},{"$f":"VLOOKUP($B52,Store!$B$6:$AG$308,COLUMN()-1,0)","v":"100% cotton"},{"$f":"VLOOKUP($B52,Store!$B$6:$AG$308,COLUMN()-1,0)","v":"100% cotton"},{"$f":"VLOOKUP($B52,Store!$B$6:$AG$308,COLUMN()-1,0)","v":"24/2 - 16/1"},{"$f":"VLOOKUP($B52,Store!$B$6:$AG$308,COLUMN()-1,0)","v":"24/2 - 16/1"},{"$f":"VLOOKUP($B52,Store!$B$6:$AG$308,COLUMN()-1,0)","v":"Fresh"},{"$f":"VLOOKUP($B52,Store!$B$6:$AG$308,COLUMN()-1,0)","v":"Fresh"},{"$f":"VLOOKUP($B52,Store!$B$6:$AG$308,COLUMN()-1,0)","v":0},{"$f":"VLOOKUP($B52,Store!$B$6:$AG$308,COLUMN()-1,0)","v":"محمود"},{"$f":"VLOOKUP($B52,Store!$B$6:$AG$308,COLUMN()-1,0)","v":1.5},{"$f":"VLOOKUP($B52,Store!$B$6:$AG$308,COLUMN()-1,0)","v":25},{"$f":"VLOOKUP($B52,Store!$B$6:$AG$308,COLUMN()-1,0)","v":1.75},{"$f":"VLOOKUP($B52,Store!$B$6:$AG$308,COLUMN()-1,0)","v":"Jacquard"},{"$f":"VLOOKUP($B52,Store!$B$6:$AG$308,COLUMN()-1,0)","v":"Normal"},null,null,{"$f":"SUMIFS(Store!$AD$6:$AD$308,Store!$B$6:$B$308,Rassed!B52,Store!$AH$6:$AH$308,\"اضافه\")","v":50},{"$f":"SUMIFS(Store!$AD$6:$AD$308,Store!$B$6:$B$308,Rassed!B52,Store!$AN$6:$AN$308,\"صرف\")","v":114},-64]
[null,"0019 - 34",{"$f":"VLOOKUP($B53,Store!$B$6:$AG$308,COLUMN()-1,0)","v":"GGGG"},{"$f":"VLOOKUP($B53,Store!$B$6:$AG$308,COLUMN()-1,0)","v":9114000015},{"$f":"VLOOKUP($B53,Store!$B$6:$AG$308,COLUMN()-1,0)","v":"مشكل عميل 34 اوردر 7002"},{"$f":"VLOOKUP($B53,Store!$B$6:$AG$308,COLUMN()-1,0)","v":34},{"$f":"VLOOKUP($B53,Store!$B$6:$AG$308,COLUMN()-1,0)","v":7007},{"$f":"VLOOKUP($B53,Store!$B$6:$AG$308,COLUMN()-1,0)","v":7007},{"$f":"VLOOKUP($B53,Store!$B$6:$AG$308,COLUMN()-1,0)","v":"Kitchen Towel"},{"$f":"VLOOKUP($B53,Store!$B$6:$AG$308,COLUMN()-1,0)","v":"Kitchen Towel"},{"$f":"VLOOKUP($B53,Store!$B$6:$AG$308,COLUMN()-1,0)","v":"Flat"},{"$f":"VLOOKUP($B53,Store!$B$6:$AG$308,COLUMN()-1,0)","v":"Flat"},{"$f":"VLOOKUP($B53,Store!$B$6:$AG$308,COLUMN()-1,0)","v":"50 X 70"},{"$f":"VLOOKUP($B53,Store!$B$6:$AG$308,COLUMN()-1,0)","v":"50 X 70"},{"$f":"VLOOKUP($B53,Store!$B$6:$AG$308,COLUMN()-1,0)","v":70},{"$f":"VLOOKUP($B53,Store!$B$6:$AG$308,COLUMN()-1,0)","v":70},{"$f":"VLOOKUP($B53,Store!$B$6:$AG$308,COLUMN()-1,0)","v":200},{"$f":"VLOOKUP($B53,Store!$B$6:$AG$308,COLUMN()-1,0)","v":"Very Light weight"},{"$f":"VLOOKUP($B53,Store!$B$6:$AG$308,COLUMN()-1,0)","v":"dark"},{"$f":"VLOOKUP($B53,Store!$B$6:$AG$308,COLUMN()-1,0)","v":"Second Choice"},{"$f":"VLOOKUP($B53,Store!$B$6:$AG$308,COLUMN()-1,0)","v":"100% cotton"},{"$f":"VLOOKUP($B53,Store!$B$6:$AG$308,COLUMN()-1,0)","v":"100% cotton"},{"$f":"VLOOKUP($B53,Store!$B$6:$AG$308,COLUMN()-1,0)","v":"24/2 - 16/1"},{"$f":"VLOOKUP($B53,Store!$B$6:$AG$308,COLUMN()-1,0)","v":"24/2 - 16/1"},{"$f":"VLOOKUP($B53,Store!$B$6:$AG$308,COLUMN()-1,0)","v":"Fresh"},{"$f":"VLOOKUP($B53,Store!$B$6:$AG$308,COLUMN()-1,0)","v":"Fresh"},{"$f":"VLOOKUP($B53,Store!$B$6:$AG$308,COLUMN()-1,0)","v":0},{"$f":"VLOOKUP($B53,Store!$B$6:$AG$308,COLUMN()-1,0)","v":"محمود"},{"$f":"VLOOKUP($B53,Store!$B$6:$AG$308,COLUMN()-1,0)","v":1.5},{"$f":"VLOOKUP($B53,Store!$B$6:$AG$308,COLUMN()-1,0)","v":25},{"$f":"VLOOKUP($B53,Store!$B$6:$AG$308,COLUMN()-1,0)","v":1.75},{"$f":"VLOOKUP($B53,Store!$B$6:$AG$308,COLUMN()-1,0)","v":"Dobby"},{"$f":"VLOOKUP($B53,Store!$B$6:$AG$308,COLUMN()-1,0)","v":"Normal"},null,null,{"$f":"SUMIFS(Store!$AD$6:$AD$308,Store!$B$6:$B$308,Rassed!B53,Store!$AH$6:$AH$308,\"اضافه\")","v":57},{"$f":"SUMIFS(Store!$AD$6:$AD$308,Store!$B$6:$B$308,Rassed!B53,Store!$AN$6:$AN$308,\"صرف\")","v":132},-75]
[null,"0020 - 34",{"$f":"VLOOKUP($B54,Store!$B$6:$AG$308,COLUMN()-1,0)","v":"HHHHH"},{"$f":"VLOOKUP($B54,Store!$B$6:$AG$308,COLUMN()-1,0)","v":9114000016},{"$f":"VLOOKUP($B54,Store!$B$6:$AG$308,COLUMN()-1,0)","v":"مشكل عميل 34 اوردر 7002"},{"$f":"VLOOKUP($B54,Store!$B$6:$AG$308,COLUMN()-1,0)","v":34},{"$f":"VLOOKUP($B54,Store!$B$6:$AG$308,COLUMN()-1,0)","v":7007},{"$f":"VLOOKUP($B54,Store!$B$6:$AG$308,COLUMN()-1,0)","v":7007},{"$f":"VLOOKUP($B54,Store!$B$6:$AG$308,COLUMN()-1,0)","v":"Kitchen Towel"},{"$f":"VLOOKUP($B54,Store!$B$6:$AG$308,COLUMN()-1,0)","v":"Kitchen Towel"},{"$f":"VLOOKUP($B54,Store!$B$6:$AG$308,COLUMN()-1,0)","v":"Flat"},{"$f":"VLOOKUP($B54,Store!$B$6:$AG$308,COLUMN()-1,0)","v":"Flat"},{"$f":"VLOOKUP($B54,Store!$B$6:$AG$308,COLUMN()-1,0)","v":"50 X 70"},{"$f":"VLOOKUP($B54,Store!$B$6:$AG$308,COLUMN()-1,0)","v":"50 X 70"},{"$f":"VLOOKUP($B54,Store!$B$6:$AG$308,COLUMN()-1,0)","v":70},{"$f":"VLOOKUP($B54,Store!$B$6:$AG$308,COLUMN()-1,0)","v":70},{"$f":"VLOOKUP($B54,Store!$B$6:$AG$308,COLUMN()-1,0)","v":200},{"$f":"VLOOKUP($B54,Store!$B$6:$AG$308,COLUMN()-1,0)","v":"Very Light weight"},{"$f":"VLOOKUP($B54,Store!$B$6:$AG$308,COLUMN()-1,0)","v":"dark"},{"$f":"VLOOKUP($B54,Store!$B$6:$AG$308,COLUMN()-1,0)","v":"Second Choice"},{"$f":"VLOOKUP($B54,Store!$B$6:$AG$308,COLUMN()-1,0)","v":"100% cotton"},{"$f":"VLOOKUP($B54,Store!$B$6:$AG$308,COLUMN()-1,0)","v":"100% cotton"},{"$f":"VLOOKUP($B54,Store!$B$6:$AG$308,COLUMN()-1,0)","v":"24/2 - 16/1"},{"$f":"VLOOKUP($B54,Store!$B$6:$AG$308,COLUMN()-1,0)","v":"24/2 - 16/1"},{"$f":"VLOOKUP($B54,Store!$B$6:$AG$308,COLUMN()-1,0)","v":"Fresh"},{"$f":"VLOOKUP($B54,Store!$B$6:$AG$308,COLUMN()-1,0)","v":"Fresh"},{"$f":"VLOOKUP($B54,Store!$B$6:$AG$308,COLUMN()-1,0)","v":0},{"$f":"VLOOKUP($B54,Store!$B$6:$AG$308,COLUMN()-1,0)","v":"محمود"},{"$f":"VLOOKUP($B54,Store!$B$6:$AG$308,COLUMN()-1,0)","v":0.6},{"$f":"VLOOKUP($B54,Store!$B$6:$AG$308,COLUMN()-1,0)","v":10},{"$f":"VLOOKUP($B54,Store!$B$6:$AG$308,COLUMN()-1,0)","v":0.7},{"$f":"VLOOKUP($B54,Store!$B$6:$AG$308,COLUMN()-1,0)","v":"Dobby"},{"$f":"VLOOKUP($B54,Store!$B$6:$AG$308,COLUMN()-1,0)","v":"Normal"},null,null,{"$f":"SUMIFS(Store!$AD$6:$AD$308,Store!$B$6:$B$308,Rassed!B54,Store!$AH$6:$AH$308,\"اضافه\")","v":32},{"$f":"SUMIFS(Store!$AD$6:$AD$308,Store!$B$6:$B$308,Rassed!B54,Store!$AN$6:$AN$308,\"صرف\")","v":62},-30]
[null,"0021 - 34",{"$f":"VLOOKUP($B55,Store!$B$6:$AG$308,COLUMN()-1,0)","v":"JJJJJJ"},{"$f":"VLOOKUP($B55,Store!$B$6:$AG$308,COLUMN()-1,0)","v":9114000017},{"$f":"VLOOKUP($B55,Store!$B$6:$AG$308,COLUMN()-1,0)","v":"مشكل عميل 34 اوردر 7002"},{"$f":"VLOOKUP($B55,Store!$B$6:$AG$308,COLUMN()-1,0)","v":34},{"$f":"VLOOKUP($B55,Store!$B$6:$AG$308,COLUMN()-1,0)","v":7007},{"$f":"VLOOKUP($B55,Store!$B$6:$AG$308,COLUMN()-1,0)","v":7007},{"$f":"VLOOKUP($B55,Store!$B$6:$AG$308,COLUMN()-1,0)","v":"Kitchen Towel"},{"$f":"VLOOKUP($B55,Store!$B$6:$AG$308,COLUMN()-1,0)","v":"Kitchen Towel"},{"$f":"VLOOKUP($B55,Store!$B$6:$AG$308,COLUMN()-1,0)","v":"Flat"},{"$f":"VLOOKUP($B55,Store!$B$6:$AG$308,COLUMN()-1,0)","v":"Flat"},{"$f":"VLOOKUP($B55,Store!$B$6:$AG$308,COLUMN()-1,0)","v":"50 X 70"},{"$f":"VLOOKUP($B55,Store!$B$6:$AG$308,COLUMN()-1,0)","v":"50 X 70"},{"$f":"VLOOKUP($B55,Store!$B$6:$AG$308,COLUMN()-1,0)","v":70},{"$f":"VLOOKUP($B55,Store!$B$6:$AG$308,COLUMN()-1,0)","v":70},{"$f":"VLOOKUP($B55,Store!$B$6:$AG$308,COLUMN()-1,0)","v":200},{"$f":"VLOOKUP($B55,Store!$B$6:$AG$308,COLUMN()-1,0)","v":"Very Light weight"},{"$f":"VLOOKUP($B55,Store!$B$6:$AG$308,COLUMN()-1,0)","v":"dark"},{"$f":"VLOOKUP($B55,Store!$B$6:$AG$308,COLUMN()-1,0)","v":"Second Choice"},{"$f":"VLOOKUP($B55,Store!$B$6:$AG$308,COLUMN()-1,0)","v":"100% cotton"},{"$f":"VLOOKUP($B55,Store!$B$6:$AG$308,COLUMN()-1,0)","v":"100% cotton"},{"$f":"VLOOKUP($B55,Store!$B$6:$AG$308,COLUMN()-1,0)","v":"24/2 - 16/1"},{"$f":"VLOOKUP($B55,Store!$B$6:$AG$308,COLUMN()-1,0)","v":"24/2 - 16/1"},{"$f":"VLOOKUP($B55,Store!$B$6:$AG$308,COLUMN()-1,0)","v":"Fresh"},{"$f":"VLOOKUP($B55,Store!$B$6:$AG$308,COLUMN()-1,0)","v":"Fresh"},{"$f":"VLOOKUP($B55,Store!$B$6:$AG$308,COLUMN()-1,0)","v":0},{"$f":"VLOOKUP($B55,Store!$B$6:$AG$308,COLUMN()-1,0)","v":"محمود"},{"$f":"VLOOKUP($B55,Store!$B$6:$AG$308,COLUMN()-1,0)","v":0.6},{"$f":"VLOOKUP($B55,Store!$B$6:$AG$308,COLUMN()-1,0)","v":10},{"$f":"VLOOKUP($B55,Store!$B$6:$AG$308,COLUMN()-1,0)","v":0.7},{"$f":"VLOOKUP($B55,Store!$B$6:$AG$308,COLUMN()-1,0)","v":"Jacquard"},{"$f":"VLOOKUP($B55,Store!$B$6:$AG$308,COLUMN()-1,0)","v":"Normal"},null,null,{"$f":"SUMIFS(Store!$AD$6:$AD$308,Store!$B$6:$B$308,Rassed!B55,Store!$AH$6:$AH$308,\"اضافه\")","v":40},{"$f":"SUMIFS(Store!$AD$6:$AD$308,Store!$B$6:$B$308,Rassed!B55,Store!$AN$6:$AN$308,\"صرف\")","v":70},-30]
[null,"0002 - 34",{"$f":"VLOOKUP($B56,Store!$B$6:$AG$308,COLUMN()-1,0)","v":"lion - Blue"},{"$f":"VLOOKUP($B56,Store!$B$6:$AG$308,COLUMN()-1,0)","v":9114000002},{"$f":"VLOOKUP($B56,Store!$B$6:$AG$308,COLUMN()-1,0)","v":"مشكل عميل 34 اوردر 7002"},{"$f":"VLOOKUP($B56,Store!$B$6:$AG$308,COLUMN()-1,0)","v":34},{"$f":"VLOOKUP($B56,Store!$B$6:$AG$308,COLUMN()-1,0)","v":7002},{"$f":"VLOOKUP($B56,Store!$B$6:$AG$308,COLUMN()-1,0)","v":7001},{"$f":"VLOOKUP($B56,Store!$B$6:$AG$308,COLUMN()-1,0)","v":"Kitchen Towel"},{"$f":"VLOOKUP($B56,Store!$B$6:$AG$308,COLUMN()-1,0)","v":"Kitchen Towel"},{"$f":"VLOOKUP($B56,Store!$B$6:$AG$308,COLUMN()-1,0)","v":"Flat"},{"$f":"VLOOKUP($B56,Store!$B$6:$AG$308,COLUMN()-1,0)","v":"Flat"},{"$f":"VLOOKUP($B56,Store!$B$6:$AG$308,COLUMN()-1,0)","v":"50 X 70"},{"$f":"VLOOKUP($B56,Store!$B$6:$AG$308,COLUMN()-1,0)","v":"50 X 70"},{"$f":"VLOOKUP($B56,Store!$B$6:$AG$308,COLUMN()-1,0)","v":75},{"$f":"VLOOKUP($B56,Store!$B$6:$AG$308,COLUMN()-1,0)","v":8.7999999999999995E-2},{"$f":"VLOOKUP($B56,Store!$B$6:$AG$308,COLUMN()-1,0)","v":250},{"$f":"VLOOKUP($B56,Store!$B$6:$AG$308,COLUMN()-1,0)","v":"Light weight"},{"$f":"VLOOKUP($B56,Store!$B$6:$AG$308,COLUMN()-1,0)","v":"dark"},{"$f":"VLOOKUP($B56,Store!$B$6:$AG$308,COLUMN()-1,0)","v":"Second Choice"},{"$f":"VLOOKUP($B56,Store!$B$6:$AG$308,COLUMN()-1,0)","v":"100% cotton"},{"$f":"VLOOKUP($B56,Store!$B$6:$AG$308,COLUMN()-1,0)","v":"100% cotton - Organic"},{"$f":"VLOOKUP($B56,Store!$B$6:$AG$308,COLUMN()-1,0)","v":"24/2 - 16/1"},{"$f":"VLOOKUP($B56,Store!$B$6:$AG$308,COLUMN()-1,0)","v":"24/2 - 16/1"},{"$f":"VLOOKUP($B56,Store!$B$6:$AG$308,COLUMN()-1,0)","v":"Fresh"},{"$f":"VLOOKUP($B56,Store!$B$6:$AG$308,COLUMN()-1,0)","v":"Fresh"},{"$f":"VLOOKUP($B56,Store!$B$6:$AG$308,COLUMN()-1,0)","v":0},{"$f":"VLOOKUP($B56,Store!$B$6:$AG$308,COLUMN()-1,0)","v":"محمود"},{"$f":"VLOOKUP($B56,Store!$B$6:$AG$308,COLUMN()-1,0)","v":16},{"$f":"VLOOKUP($B56,Store!$B$6:$AG$308,COLUMN()-1,0)","v":20},{"$f":"VLOOKUP($B56,Store!$B$6:$AG$308,COLUMN()-1,0)","v":1.5},{"$f":"VLOOKUP($B56,Store!$B$6:$AG$308,COLUMN()-1,0)","v":0},{"$f":"VLOOKUP($B56,Store!$B$6:$AG$308,COLUMN()-1,0)","v":"Normal"},null,null,{"$f":"SUMIFS(Store!$AD$6:$AD$308,Store!$B$6:$B$308,Rassed!B56,Store!$AH$6:$AH$308,\"اضافه\")","v":60},{"$f":"SUMIFS(Store!$AD$6:$AD$308,Store!$B$6:$B$308,Rassed!B56,Store!$AN$6:$AN$308,\"صرف\")","v":60},0]
[null,"0001 - 34",{"$f":"VLOOKUP($B57,Store!$B$6:$AG$308,COLUMN()-1,0)","v":"lion - Brown"},{"$f":"VLOOKUP($B57,Store!$B$6:$AG$308,COLUMN()-1,0)","v":"9114000001"},{"$f":"VLOOKUP($B57,Store!$B$6:$AG$308,COLUMN()-1,0)","v":"مشكل عميل 34 اوردر 7002"},{"$f":"VLOOKUP($B57,Store!$B$6:$AG$308,COLUMN()-1,0)","v":34},{"$f":"VLOOKUP($B57,Store!$B$6:$AG$308,COLUMN()-1,0)","v":7002},{"$f":"VLOOKUP($B57,Store!$B$6:$AG$308,COLUMN()-1,0)","v":7001},{"$f":"VLOOKUP($B57,Store!$B$6:$AG$308,COLUMN()-1,0)","v":"Kitchen Towel"},{"$f":"VLOOKUP($B57,Store!$B$6:$AG$308,COLUMN()-1,0)","v":"Kitchen Towel"},{"$f":"VLOOKUP($B57,Store!$B$6:$AG$308,COLUMN()-1,0)","v":"Flat"},{"$f":"VLOOKUP($B57,Store!$B$6:$AG$308,COLUMN()-1,0)","v":"Flat"},{"$f":"VLOOKUP($B57,Store!$B$6:$AG$308,COLUMN()-1,0)","v":"50 X 70"},{"$f":"VLOOKUP($B57,Store!$B$6:$AG$308,COLUMN()-1,0)","v":"50 X 70"},{"$f":"VLOOKUP($B57,Store!$B$6:$AG$308,COLUMN()-1,0)","v":75},{"$f":"VLOOKUP($B57,Store!$B$6:$AG$308,COLUMN()-1,0)","v":8.7999999999999995E-2},{"$f":"VLOOKUP($B57,Store!$B$6:$AG$308,COLUMN()-1,0)","v":250},{"$f":"VLOOKUP($B57,Store!$B$6:$AG$308,COLUMN()-1,0)","v":"Light weight"},{"$f":"VLOOKUP($B57,Store!$B$6:$AG$308,COLUMN()-1,0)","v":"dark"},{"$f":"VLOOKUP($B57,Store!$B$6:$AG$308,COLUMN()-1,0)","v":"Second Choice"},{"$f":"VLOOKUP($B57,Store!$B$6:$AG$308,COLUMN()-1,0)","v":"100% cotton"},{"$f":"VLOOKUP($B57,Store!$B$6:$AG$308,COLUMN()-1,0)","v":"100% cotton - Organic"},{"$f":"VLOOKUP($B57,Store!$B$6:$AG$308,COLUMN()-1,0)","v":"24/2 - 16/1"},{"$f":"VLOOKUP($B57,Store!$B$6:$AG$308,COLUMN()-1,0)","v":"24/2 - 16/1"},{"$f":"VLOOKUP($B57,Store!$B$6:$AG$308,COLUMN()-1,0)","v":"Fresh"},{"$f":"VLOOKUP($B57,Store!$B$6:$AG$308,COLUMN()-1,0)","v":"Fresh"},{"$f":"VLOOKUP($B57,Store!$B$6:$AG$308,COLUMN()-1,0)","v":0},{"$f":"VLOOKUP($B57,Store!$B$6:$AG$308,COLUMN()-1,0)","v":"محمود"},{"$f":"VLOOKUP($B57,Store!$B$6:$AG$308,COLUMN()-1,0)","v":16},{"$f":"VLOOKUP($B57,Store!$B$6:$AG$308,COLUMN()-1,0)","v":20},{"$f":"VLOOKUP($B57,Store!$B$6:$AG$308,COLUMN()-1,0)","v":1.5},{"$f":"VLOOKUP($B57,Store!$B$6:$AG$308,COLUMN()-1,0)","v":0},{"$f":"VLOOKUP($B57,Store!$B$6:$AG$308,COLUMN()-1,0)","v":"Normal"},null,null,{"$f":"SUMIFS(Store!$AD$6:$AD$308,Store!$B$6:$B$308,Rassed!B57,Store!$AH$6:$AH$308,\"اضافه\")","v":60},{"$f":"SUMIFS(Store!$AD$6:$AD$308,Store!$B$6:$B$308,Rassed!B57,Store!$AN$6:$AN$308,\"صرف\")","v":60},0]
[null,"0003 - 34",{"$f":"VLOOKUP($B58,Store!$B$6:$AG$308,COLUMN()-1,0)","v":"tiger - yellow"},{"$f":"VLOOKUP($B58,Store!$B$6:$AG$308,COLUMN()-1,0)","v":"9112000001"},{"$f":"VLOOKUP($B58,Store!$B$6:$AG$308,COLUMN()-1,0)","v":"مشكل عميل 34 اوردر 7002"},{"$f":"VLOOKUP($B58,Store!$B$6:$AG$308,COLUMN()-1,0)","v":34},{"$f":"VLOOKUP($B58,Store!$B$6:$AG$308,COLUMN()-1,0)","v":7002},{"$f":"VLOOKUP($B58,Store!$B$6:$AG$308,COLUMN()-1,0)","v":7001},{"$f":"VLOOKUP($B58,Store!$B$6:$AG$308,COLUMN()-1,0)","v":"Kitchen Towel"},{"$f":"VLOOKUP($B58,Store!$B$6:$AG$308,COLUMN()-1,0)","v":"Beach Towel"},{"$f":"VLOOKUP($B58,Store!$B$6:$AG$308,COLUMN()-1,0)","v":"Flat"},{"$f":"VLOOKUP($B58,Store!$B$6:$AG$308,COLUMN()-1,0)","v":"Velour"},{"$f":"VLOOKUP($B58,Store!$B$6:$AG$308,COLUMN()-1,0)","v":"50 X 70"},{"$f":"VLOOKUP($B58,Store!$B$6:$AG$308,COLUMN()-1,0)","v":"100 x 170"},{"$f":"VLOOKUP($B58,Store!$B$6:$AG$308,COLUMN()-1,0)","v":75},{"$f":"VLOOKUP($B58,Store!$B$6:$AG$308,COLUMN()-1,0)","v":0.71399999999999997},{"$f":"VLOOKUP($B58,Store!$B$6:$AG$308,COLUMN()-1,0)","v":420},{"$f":"VLOOKUP($B58,Store!$B$6:$AG$308,COLUMN()-1,0)","v":"Medium weight"},{"$f":"VLOOKUP($B58,Store!$B$6:$AG$308,COLUMN()-1,0)","v":"dark"},{"$f":"VLOOKUP($B58,Store!$B$6:$AG$308,COLUMN()-1,0)","v":"Second Choice"},{"$f":"VLOOKUP($B58,Store!$B$6:$AG$308,COLUMN()-1,0)","v":"100% cotton"},{"$f":"VLOOKUP($B58,Store!$B$6:$AG$308,COLUMN()-1,0)","v":"100% cotton - Organic"},{"$f":"VLOOKUP($B58,Store!$B$6:$AG$308,COLUMN()-1,0)","v":"24/2 - 16/1"},{"$f":"VLOOKUP($B58,Store!$B$6:$AG$308,COLUMN()-1,0)","v":"24/2 - 24/2 - 16/1"},{"$f":"VLOOKUP($B58,Store!$B$6:$AG$308,COLUMN()-1,0)","v":"Fresh"},{"$f":"VLOOKUP($B58,Store!$B$6:$AG$308,COLUMN()-1,0)","v":"Fresh"},{"$f":"VLOOKUP($B58,Store!$B$6:$AG$308,COLUMN()-1,0)","v":0},{"$f":"VLOOKUP($B58,Store!$B$6:$AG$308,COLUMN()-1,0)","v":"محمود"},{"$f":"VLOOKUP($B58,Store!$B$6:$AG$308,COLUMN()-1,0)","v":16},{"$f":"VLOOKUP($B58,Store!$B$6:$AG$308,COLUMN()-1,0)","v":30},{"$f":"VLOOKUP($B58,Store!$B$6:$AG$308,COLUMN()-1,0)","v":2.25},{"$f":"VLOOKUP($B58,Store!$B$6:$AG$308,COLUMN()-1,0)","v":0},{"$f":"VLOOKUP($B58,Store!$B$6:$AG$308,COLUMN()-1,0)","v":"Normal"},null,null,{"$f":"SUMIFS(Store!$AD$6:$AD$308,Store!$B$6:$B$308,Rassed!B58,Store!$AH$6:$AH$308,\"اضافه\")","v":90},{"$f":"SUMIFS(Store!$AD$6:$AD$308,Store!$B$6:$B$308,Rassed!B58,Store!$AN$6:$AN$308,\"صرف\")","v":90},0]
[null,"0004 - 34",{"$f":"VLOOKUP($B59,Store!$B$6:$AG$308,COLUMN()-1,0)","v":"tiger - Orange"},{"$f":"VLOOKUP($B59,Store!$B$6:$AG$308,COLUMN()-1,0)","v":9112000002},{"$f":"VLOOKUP($B59,Store!$B$6:$AG$308,COLUMN()-1,0)","v":"مشكل عميل 34 اوردر 7002"},{"$f":"VLOOKUP($B59,Store!$B$6:$AG$308,COLUMN()-1,0)","v":34},{"$f":"VLOOKUP($B59,Store!$B$6:$AG$308,COLUMN()-1,0)","v":7002},{"$f":"VLOOKUP($B59,Store!$B$6:$AG$308,COLUMN()-1,0)","v":7001},{"$f":"VLOOKUP($B59,Store!$B$6:$AG$308,COLUMN()-1,0)","v":"Kitchen Towel"},{"$f":"VLOOKUP($B59,Store!$B$6:$AG$308,COLUMN()-1,0)","v":"Beach Towel"},{"$f":"VLOOKUP($B59,Store!$B$6:$AG$308,COLUMN()-1,0)","v":"Flat"},{"$f":"VLOOKUP($B59,Store!$B$6:$AG$308,COLUMN()-1,0)","v":"Velour"},{"$f":"VLOOKUP($B59,Store!$B$6:$AG$308,COLUMN()-1,0)","v":"50 X 70"},{"$f":"VLOOKUP($B59,Store!$B$6:$AG$308,COLUMN()-1,0)","v":"100 x 170"},{"$f":"VLOOKUP($B59,Store!$B$6:$AG$308,COLUMN()-1,0)","v":75},{"$f":"VLOOKUP($B59,Store!$B$6:$AG$308,COLUMN()-1,0)","v":0.71399999999999997},{"$f":"VLOOKUP($B59,Store!$B$6:$AG$308,COLUMN()-1,0)","v":420},{"$f":"VLOOKUP($B59,Store!$B$6:$AG$308,COLUMN()-1,0)","v":"Medium weight"},{"$f":"VLOOKUP($B59,Store!$B$6:$AG$308,COLUMN()-1,0)","v":"dark"},{"$f":"VLOOKUP($B59,Store!$B$6:$AG$308,COLUMN()-1,0)","v":"Second Choice"},{"$f":"VLOOKUP($B59,Store!$B$6:$AG$308,COLUMN()-1,0)","v":"100% cotton"},{"$f":"VLOOKUP($B59,Store!$B$6:$AG$308,COLUMN()-1,0)","v":"100% cotton - Organic"},{"$f":"VLOOKUP($B59,Store!$B$6:$AG$308,COLUMN()-1,0)","v":"24/2 - 16/1"},{"$f":"VLOOKUP($B59,Store!$B$6:$AG$308,COLUMN()-1,0)","v":"24/2 - 24/2 - 16/1"},{"$f":"VLOOKUP($B59,Store!$B$6:$AG$308,COLUMN()-1,0)","v":"Fresh"},{"$f":"VLOOKUP($B59,Store!$B$6:$AG$308,COLUMN()-1,0)","v":"Fresh"},{"$f":"VLOOKUP($B59,Store!$B$6:$AG$308,COLUMN()-1,0)","v":0},{"$f":"VLOOKUP($B59,Store!$B$6:$AG$308,COLUMN()-1,0)","v":"محمود"},{"$f":"VLOOKUP($B59,Store!$B$6:$AG$308,COLUMN()-1,0)","v":16},{"$f":"VLOOKUP($B59,Store!$B$6:$AG$308,COLUMN()-1,0)","v":50},{"$f":"VLOOKUP($B59,Store!$B$6:$AG$308,COLUMN()-1,0)","v":3.75},{"$f":"VLOOKUP($B59,Store!$B$6:$AG$308,COLUMN()-1,0)","v":0},{"$f":"VLOOKUP($B59,Store!$B$6:$AG$308,COLUMN()-1,0)","v":"Normal"},null,null,{"$f":"SUMIFS(Store!$AD$6:$AD$308,Store!$B$6:$B$308,Rassed!B59,Store!$AH$6:$AH$308,\"اضافه\")","v":150},{"$f":"SUMIFS(Store!$AD$6:$AD$308,Store!$B$6:$B$308,Rassed!B59,Store!$AN$6:$AN$308,\"صرف\")","v":150},0]
[null,"0005 - 34",{"$f":"VLOOKUP($B60,Store!$B$6:$AG$308,COLUMN()-1,0)","v":"sun - red"},{"$f":"VLOOKUP($B60,Store!$B$6:$AG$308,COLUMN()-1,0)","v":9112000003},{"$f":"VLOOKUP($B60,Store!$B$6:$AG$308,COLUMN()-1,0)","v":"مشكل عميل 34 اوردر 7002"},{"$f":"VLOOKUP($B60,Store!$B$6:$AG$308,COLUMN()-1,0)","v":34},{"$f":"VLOOKUP($B60,Store!$B$6:$AG$308,COLUMN()-1,0)","v":7002},{"$f":"VLOOKUP($B60,Store!$B$6:$AG$308,COLUMN()-1,0)","v":7002},{"$f":"VLOOKUP($B60,Store!$B$6:$AG$308,COLUMN()-1,0)","v":"Kitchen Towel"},{"$f":"VLOOKUP($B60,Store!$B$6:$AG$308,COLUMN()-1,0)","v":"Beach Towel"},{"$f":"VLOOKUP($B60,Store!$B$6:$AG$308,COLUMN()-1,0)","v":"Flat"},{"$f":"VLOOKUP($B60,Store!$B$6:$AG$308,COLUMN()-1,0)","v":"Velour"},{"$f":"VLOOKUP($B60,Store!$B$6:$AG$308,COLUMN()-1,0)","v":"50 X 70"},{"$f":"VLOOKUP($B60,Store!$B$6:$AG$308,COLUMN()-1,0)","v":"90 x 160"},{"$f":"VLOOKUP($B60,Store!$B$6:$AG$308,COLUMN()-1,0)","v":75},{"$f":"VLOOKUP($B60,Store!$B$6:$AG$308,COLUMN()-1,0)","v":0.57599999999999996},{"$f":"VLOOKUP($B60,Store!$B$6:$AG$308,COLUMN()-1,0)","v":400},{"$f":"VLOOKUP($B60,Store!$B$6:$AG$308,COLUMN()-1,0)","v":"Medium weight"},{"$f":"VLOOKUP($B60,Store!$B$6:$AG$308,COLUMN()-1,0)","v":"dark"},{"$f":"VLOOKUP($B60,Store!$B$6:$AG$308,COLUMN()-1,0)","v":"Second Choice"},{"$f":"VLOOKUP($B60,Store!$B$6:$AG$308,COLUMN()-1,0)","v":"100% cotton"},{"$f":"VLOOKUP($B60,Store!$B$6:$AG$308,COLUMN()-1,0)","v":"100% cotton"},{"$f":"VLOOKUP($B60,Store!$B$6:$AG$308,COLUMN()-1,0)","v":"24/2 - 16/1"},{"$f":"VLOOKUP($B60,Store!$B$6:$AG$308,COLUMN()-1,0)","v":"24/2 - 24/2 - 16/1"},{"$f":"VLOOKUP($B60,Store!$B$6:$AG$308,COLUMN()-1,0)","v":"Fresh"},{"$f":"VLOOKUP($B60,Store!$B$6:$AG$308,COLUMN()-1,0)","v":"Fresh"},{"$f":"VLOOKUP($B60,Store!$B$6:$AG$308,COLUMN()-1,0)","v":0},{"$f":"VLOOKUP($B60,Store!$B$6:$AG$308,COLUMN()-1,0)","v":"محمود"},{"$f":"VLOOKUP($B60,Store!$B$6:$AG$308,COLUMN()-1,0)","v":16},{"$f":"VLOOKUP($B60,Store!$B$6:$AG$308,COLUMN()-1,0)","v":10},{"$f":"VLOOKUP($B60,Store!$B$6:$AG$308,COLUMN()-1,0)","v":0.75},{"$f":"VLOOKUP($B60,Store!$B$6:$AG$308,COLUMN()-1,0)","v":0},{"$f":"VLOOKUP($B60,Store!$B$6:$AG$308,COLUMN()-1,0)","v":"Normal"},null,null,{"$f":"SUMIFS(Store!$AD$6:$AD$308,Store!$B$6:$B$308,Rassed!B60,Store!$AH$6:$AH$308,\"اضافه\")","v":30},{"$f":"SUMIFS(Store!$AD$6:$AD$308,Store!$B$6:$B$308,Rassed!B60,Store!$AN$6:$AN$308,\"صرف\")","v":30},0]
[null,"0006 - 34",{"$f":"VLOOKUP($B61,Store!$B$6:$AG$308,COLUMN()-1,0)","v":"sun - orange"},{"$f":"VLOOKUP($B61,Store!$B$6:$AG$308,COLUMN()-1,0)","v":9112000004},{"$f":"VLOOKUP($B61,Store!$B$6:$AG$308,COLUMN()-1,0)","v":"مشكل عميل 34 اوردر 7002"},{"$f":"VLOOKUP($B61,Store!$B$6:$AG$308,COLUMN()-1,0)","v":34},{"$f":"VLOOKUP($B61,Store!$B$6:$AG$308,COLUMN()-1,0)","v":7002},{"$f":"VLOOKUP($B61,Store!$B$6:$AG$308,COLUMN()-1,0)","v":7002},{"$f":"VLOOKUP($B61,Store!$B$6:$AG$308,COLUMN()-1,0)","v":"Kitchen Towel"},{"$f":"VLOOKUP($B61,Store!$B$6:$AG$308,COLUMN()-1,0)","v":"Beach Towel"},{"$f":"VLOOKUP($B61,Store!$B$6:$AG$308,COLUMN()-1,0)","v":"Flat"},{"$f":"VLOOKUP($B61,Store!$B$6:$AG$308,COLUMN()-1,0)","v":"Velour"},{"$f":"VLOOKUP($B61,Store!$B$6:$AG$308,COLUMN()-1,0)","v":"50 X 70"},{"$f":"VLOOKUP($B61,Store!$B$6:$AG$308,COLUMN()-1,0)","v":"90 x 160"},{"$f":"VLOOKUP($B61,Store!$B$6:$AG$308,COLUMN()-1,0)","v":75},{"$f":"VLOOKUP($B61,Store!$B$6:$AG$308,COLUMN()-1,0)","v":0.57599999999999996},{"$f":"VLOOKUP($B61,Store!$B$6:$AG$308,COLUMN()-1,0)","v":400},{"$f":"VLOOKUP($B61,Store!$B$6:$AG$308,COLUMN()-1,0)","v":"Medium weight"},{"$f":"VLOOKUP($B61,Store!$B$6:$AG$308,COLUMN()-1,0)","v":"dark"},{"$f":"VLOOKUP($B61,Store!$B$6:$AG$308,COLUMN()-1,0)","v":"Second Choice"},{"$f":"VLOOKUP($B61,Store!$B$6:$AG$308,COLUMN()-1,0)","v":"100% cotton"},{"$f":"VLOOKUP($B61,Store!$B$6:$AG$308,COLUMN()-1,0)","v":"100% cotton"},{"$f":"VLOOKUP($B61,Store!$B$6:$AG$308,COLUMN()-1,0)","v":"24/2 - 16/1"},{"$f":"VLOOKUP($B61,Store!$B$6:$AG$308,COLUMN()-1,0)","v":"24/2 - 24/2 - 16/1"},{"$f":"VLOOKUP($B61,Store!$B$6:$AG$308,COLUMN()-1,0)","v":"Fresh"},{"$f":"VLOOKUP($B61,Store!$B$6:$AG$308,COLUMN()-1,0)","v":"Fresh"},{"$f":"VLOOKUP($B61,Store!$B$6:$AG$308,COLUMN()-1,0)","v":0},{"$f":"VLOOKUP($B61,Store!$B$6:$AG$308,COLUMN()-1,0)","v":"محمود"},{"$f":"VLOOKUP($B61,Store!$B$6:$AG$308,COLUMN()-1,0)","v":16},{"$f":"VLOOKUP($B61,Store!$B$6:$AG$308,COLUMN()-1,0)","v":25},{"$f":"VLOOKUP($B61,Store!$B$6:$AG$308,COLUMN()-1,0)","v":1.875},{"$f":"VLOOKUP($B61,Store!$B$6:$AG$308,COLUMN()-1,0)","v":"DOBBY"},{"$f":"VLOOKUP($B61,Store!$B$6:$AG$308,COLUMN()-1,0)","v":"Normal"},null,null,{"$f":"SUMIFS(Store!$AD$6:$AD$308,Store!$B$6:$B$308,Rassed!B61,Store!$AH$6:$AH$308,\"اضافه\")","v":75},{"$f":"SUMIFS(Store!$AD$6:$AD$308,Store!$B$6:$B$308,Rassed!B61,Store!$AN$6:$AN$308,\"صرف\")","v":75},0]
[null,"0007 - 34",{"$f":"VLOOKUP($B62,Store!$B$6:$AG$308,COLUMN()-1,0)","v":"LOO"},{"$f":"VLOOKUP($B62,Store!$B$6:$AG$308,COLUMN()-1,0)","v":9114000003},{"$f":"VLOOKUP($B62,Store!$B$6:$AG$308,COLUMN()-1,0)","v":"مشكل عميل 34 اوردر 7002"},{"$f":"VLOOKUP($B62,Store!$B$6:$AG$308,COLUMN()-1,0)","v":34},{"$f":"VLOOKUP($B62,Store!$B$6:$AG$308,COLUMN()-1,0)","v":7002},{"$f":"VLOOKUP($B62,Store!$B$6:$AG$308,COLUMN()-1,0)","v":7003},{"$f":"VLOOKUP($B62,Store!$B$6:$AG$308,COLUMN()-1,0)","v":"Kitchen Towel"},{"$f":"VLOOKUP($B62,Store!$B$6:$AG$308,COLUMN()-1,0)","v":"Kitchen Towel"},{"$f":"VLOOKUP($B62,Store!$B$6:$AG$308,COLUMN()-1,0)","v":"Flat"},{"$f":"VLOOKUP($B62,Store!$B$6:$AG$308,COLUMN()-1,0)","v":"Flat"},{"$f":"VLOOKUP($B62,Store!$B$6:$AG$308,COLUMN()-1,0)","v":"50 X 70"},{"$f":"VLOOKUP($B62,Store!$B$6:$AG$308,COLUMN()-1,0)","v":"50 X 70"},{"$f":"VLOOKUP($B62,Store!$B$6:$AG$308,COLUMN()-1,0)","v":75},{"$f":"VLOOKUP($B62,Store!$B$6:$AG$308,COLUMN()-1,0)","v":7.0000000000000007E-2},{"$f":"VLOOKUP($B62,Store!$B$6:$AG$308,COLUMN()-1,0)","v":200},{"$f":"VLOOKUP($B62,Store!$B$6:$AG$308,COLUMN()-1,0)","v":"Very Light weight"},{"$f":"VLOOKUP($B62,Store!$B$6:$AG$308,COLUMN()-1,0)","v":"dark"},{"$f":"VLOOKUP($B62,Store!$B$6:$AG$308,COLUMN()-1,0)","v":"Second Choice"},{"$f":"VLOOKUP($B62,Store!$B$6:$AG$308,COLUMN()-1,0)","v":"100% cotton"},{"$f":"VLOOKUP($B62,Store!$B$6:$AG$308,COLUMN()-1,0)","v":"100% cotton"},{"$f":"VLOOKUP($B62,Store!$B$6:$AG$308,COLUMN()-1,0)","v":"24/2 - 16/1"},{"$f":"VLOOKUP($B62,Store!$B$6:$AG$308,COLUMN()-1,0)","v":"24/2 - 16/1"},{"$f":"VLOOKUP($B62,Store!$B$6:$AG$308,COLUMN()-1,0)","v":"Fresh"},{"$f":"VLOOKUP($B62,Store!$B$6:$AG$308,COLUMN()-1,0)","v":"Fresh"},{"$f":"VLOOKUP($B62,Store!$B$6:$AG$308,COLUMN()-1,0)","v":0},{"$f":"VLOOKUP($B62,Store!$B$6:$AG$308,COLUMN()-1,0)","v":"محمود"},{"$f":"VLOOKUP($B62,Store!$B$6:$AG$308,COLUMN()-1,0)","v":16},{"$f":"VLOOKUP($B62,Store!$B$6:$AG$308,COLUMN()-1,0)","v":25},{"$f":"VLOOKUP($B62,Store!$B$6:$AG$308,COLUMN()-1,0)","v":1.875},{"$f":"VLOOKUP($B62,Store!$B$6:$AG$308,COLUMN()-1,0)","v":"Jacquard"},{"$f":"VLOOKUP($B62,Store!$B$6:$AG$308,COLUMN()-1,0)","v":"Normal"},null,null,{"$f":"SUMIFS(Store!$AD$6:$AD$308,Store!$B$6:$B$308,Rassed!B62,Store!$AH$6:$AH$308,\"اضافه\")","v":75},{"$f":"SUMIFS(Store!$AD$6:$AD$308,Store!$B$6:$B$308,Rassed!B62,Store!$AN$6:$AN$308,\"صرف\")","v":75},0]
[null,"0008 - 34",{"$f":"VLOOKUP($B63,Store!$B$6:$AG$308,COLUMN()-1,0)","v":"TOO"},{"$f":"VLOOKUP($B63,Store!$B$6:$AG$308,COLUMN()-1,0)","v":9114000004},{"$f":"VLOOKUP($B63,Store!$B$6:$AG$308,COLUMN()-1,0)","v":"مشكل عميل 34 اوردر 7002"},{"$f":"VLOOKUP($B63,Store!$B$6:$AG$308,COLUMN()-1,0)","v":34},{"$f":"VLOOKUP($B63,Store!$B$6:$AG$308,COLUMN()-1,0)","v":7002},{"$f":"VLOOKUP($B63,Store!$B$6:$AG$308,COLUMN()-1,0)","v":7003},{"$f":"VLOOKUP($B63,Store!$B$6:$AG$308,COLUMN()-1,0)","v":"Kitchen Towel"},{"$f":"VLOOKUP($B63,Store!$B$6:$AG$308,COLUMN()-1,0)","v":"Kitchen Towel"},{"$f":"VLOOKUP($B63,Store!$B$6:$AG$308,COLUMN()-1,0)","v":"Flat"},{"$f":"VLOOKUP($B63,Store!$B$6:$AG$308,COLUMN()-1,0)","v":"Flat"},{"$f":"VLOOKUP($B63,Store!$B$6:$AG$308,COLUMN()-1,0)","v":"50 X 70"},{"$f":"VLOOKUP($B63,Store!$B$6:$AG$308,COLUMN()-1,0)","v":"50 X 70"},{"$f":"VLOOKUP($B63,Store!$B$6:$AG$308,COLUMN()-1,0)","v":75},{"$f":"VLOOKUP($B63,Store!$B$6:$AG$308,COLUMN()-1,0)","v":7.0000000000000007E-2},{"$f":"VLOOKUP($B63,Store!$B$6:$AG$308,COLUMN()-1,0)","v":200},{"$f":"VLOOKUP($B63,Store!$B$6:$AG$308,COLUMN()-1,0)","v":"Very Light weight"},{"$f":"VLOOKUP($B63,Store!$B$6:$AG$308,COLUMN()-1,0)","v":"dark"},{"$f":"VLOOKUP($B63,Store!$B$6:$AG$308,COLUMN()-1,0)","v":"Second Choice"},{"$f":"VLOOKUP($B63,Store!$B$6:$AG$308,COLUMN()-1,0)","v":"100% cotton"},{"$f":"VLOOKUP($B63,Store!$B$6:$AG$308,COLUMN()-1,0)","v":"100% cotton"},{"$f":"VLOOKUP($B63,Store!$B$6:$AG$308,COLUMN()-1,0)","v":"24/2 - 16/1"},{"$f":"VLOOKUP($B63,Store!$B$6:$AG$308,COLUMN()-1,0)","v":"24/2 - 16/1"},{"$f":"VLOOKUP($B63,Store!$B$6:$AG$308,COLUMN()-1,0)","v":"Fresh"},{"$f":"VLOOKUP($B63,Store!$B$6:$AG$308,COLUMN()-1,0)","v":"Fresh"},{"$f":"VLOOKUP($B63,Store!$B$6:$AG$308,COLUMN()-1,0)","v":0},{"$f":"VLOOKUP($B63,Store!$B$6:$AG$308,COLUMN()-1,0)","v":"محمود"},{"$f":"VLOOKUP($B63,Store!$B$6:$AG$308,COLUMN()-1,0)","v":16},{"$f":"VLOOKUP($B63,Store!$B$6:$AG$308,COLUMN()-1,0)","v":10},{"$f":"VLOOKUP($B63,Store!$B$6:$AG$308,COLUMN()-1,0)","v":0.75},{"$f":"VLOOKUP($B63,Store!$B$6:$AG$308,COLUMN()-1,0)","v":"Jacquard"},{"$f":"VLOOKUP($B63,Store!$B$6:$AG$308,COLUMN()-1,0)","v":"Normal"},null,null,{"$f":"SUMIFS(Store!$AD$6:$AD$308,Store!$B$6:$B$308,Rassed!B63,Store!$AH$6:$AH$308,\"اضافه\")","v":30},{"$f":"SUMIFS(Store!$AD$6:$AD$308,Store!$B$6:$B$308,Rassed!B63,Store!$AN$6:$AN$308,\"صرف\")","v":30},0]
[null,"0010 - 34",{"$f":"VLOOKUP($B64,Store!$B$6:$AG$308,COLUMN()-1,0)","v":"BOO"},{"$f":"VLOOKUP($B64,Store!$B$6:$AG$308,COLUMN()-1,0)","v":9114000006},{"$f":"VLOOKUP($B64,Store!$B$6:$AG$308,COLUMN()-1,0)","v":"مشكل عميل 34 اوردر 7002"},{"$f":"VLOOKUP($B64,Store!$B$6:$AG$308,COLUMN()-1,0)","v":34},{"$f":"VLOOKUP($B64,Store!$B$6:$AG$308,COLUMN()-1,0)","v":7002},{"$f":"VLOOKUP($B64,Store!$B$6:$AG$308,COLUMN()-1,0)","v":7003},{"$f":"VLOOKUP($B64,Store!$B$6:$AG$308,COLUMN()-1,0)","v":"Kitchen Towel"},{"$f":"VLOOKUP($B64,Store!$B$6:$AG$308,COLUMN()-1,0)","v":"Kitchen Towel"},{"$f":"VLOOKUP($B64,Store!$B$6:$AG$308,COLUMN()-1,0)","v":"Flat"},{"$f":"VLOOKUP($B64,Store!$B$6:$AG$308,COLUMN()-1,0)","v":"Flat"},{"$f":"VLOOKUP($B64,Store!$B$6:$AG$308,COLUMN()-1,0)","v":"50 X 70"},{"$f":"VLOOKUP($B64,Store!$B$6:$AG$308,COLUMN()-1,0)","v":"50 X 70"},{"$f":"VLOOKUP($B64,Store!$B$6:$AG$308,COLUMN()-1,0)","v":75},{"$f":"VLOOKUP($B64,Store!$B$6:$AG$308,COLUMN()-1,0)","v":7.0000000000000007E-2},{"$f":"VLOOKUP($B64,Store!$B$6:$AG$308,COLUMN()-1,0)","v":200},{"$f":"VLOOKUP($B64,Store!$B$6:$AG$308,COLUMN()-1,0)","v":"Very Light weight"},{"$f":"VLOOKUP($B64,Store!$B$6:$AG$308,COLUMN()-1,0)","v":"dark"},{"$f":"VLOOKUP($B64,Store!$B$6:$AG$308,COLUMN()-1,0)","v":"Second Choice"},{"$f":"VLOOKUP($B64,Store!$B$6:$AG$308,COLUMN()-1,0)","v":"100% cotton"},{"$f":"VLOOKUP($B64,Store!$B$6:$AG$308,COLUMN()-1,0)","v":"100% cotton"},{"$f":"VLOOKUP($B64,Store!$B$6:$AG$308,COLUMN()-1,0)","v":"24/2 - 16/1"},{"$f":"VLOOKUP($B64,Store!$B$6:$AG$308,COLUMN()-1,0)","v":"24/2 - 16/1"},{"$f":"VLOOKUP($B64,Store!$B$6:$AG$308,COLUMN()-1,0)","v":"Fresh"},{"$f":"VLOOKUP($B64,Store!$B$6:$AG$308,COLUMN()-1,0)","v":"Fresh"},{"$f":"VLOOKUP($B64,Store!$B$6:$AG$308,COLUMN()-1,0)","v":0},{"$f":"VLOOKUP($B64,Store!$B$6:$AG$308,COLUMN()-1,0)","v":"محمود"},{"$f":"VLOOKUP($B64,Store!$B$6:$AG$308,COLUMN()-1,0)","v":16},{"$f":"VLOOKUP($B64,Store!$B$6:$AG$308,COLUMN()-1,0)","v":10},{"$f":"VLOOKUP($B64,Store!$B$6:$AG$308,COLUMN()-1,0)","v":0.75},{"$f":"VLOOKUP($B64,Store!$B$6:$AG$308,COLUMN()-1,0)","v":"Jacquard"},{"$f":"VLOOKUP($B64,Store!$B$6:$AG$308,COLUMN()-1,0)","v":"Normal"},null,null,{"$f":"SUMIFS(Store!$AD$6:$AD$308,Store!$B$6:$B$308,Rassed!B64,Store!$AH$6:$AH$308,\"اضافه\")","v":30},{"$f":"SUMIFS(Store!$AD$6:$AD$308,Store!$B$6:$B$308,Rassed!B64,Store!$AN$6:$AN$308,\"صرف\")","v":30},0]
[null,"0001 - 75",{"$f":"VLOOKUP($B65,Store!$B$6:$AG$308,COLUMN()-1,0)","v":"frgg"},{"$f":"VLOOKUP($B65,Store!$B$6:$AG$308,COLUMN()-1,0)","v":9114000001},{"$f":"VLOOKUP($B65,Store!$B$6:$AG$308,COLUMN()-1,0)","v":"yhy"},{"$f":"VLOOKUP($B65,Store!$B$6:$AG$308,COLUMN()-1,0)","v":75},{"$f":"VLOOKUP($B65,Store!$B$6:$AG$308,COLUMN()-1,0)","v":7015},{"$f":"VLOOKUP($B65,Store!$B$6:$AG$308,COLUMN()-1,0)","v":7015},{"$f":"VLOOKUP($B65,Store!$B$6:$AG$308,COLUMN()-1,0)","v":"Kitchen Towel"},{"$f":"VLOOKUP($B65,Store!$B$6:$AG$308,COLUMN()-1,0)","v":"Kitchen Towel"},{"$f":"VLOOKUP($B65,Store!$B$6:$AG$308,COLUMN()-1,0)","v":"Flat"},{"$f":"VLOOKUP($B65,Store!$B$6:$AG$308,COLUMN()-1,0)","v":"Flat"},{"$f":"VLOOKUP($B65,Store!$B$6:$AG$308,COLUMN()-1,0)","v":"50 X 70"},{"$f":"VLOOKUP($B65,Store!$B$6:$AG$308,COLUMN()-1,0)","v":"50 X 70"},{"$f":"VLOOKUP($B65,Store!$B$6:$AG$308,COLUMN()-1,0)","v":60.9},{"$f":"VLOOKUP($B65,Store!$B$6:$AG$308,COLUMN()-1,0)","v":70},{"$f":"VLOOKUP($B65,Store!$B$6:$AG$308,COLUMN()-1,0)","v":200},{"$f":"VLOOKUP($B65,Store!$B$6:$AG$308,COLUMN()-1,0)","v":"Very Light weight"},{"$f":"VLOOKUP($B65,Store!$B$6:$AG$308,COLUMN()-1,0)","v":"dark"},{"$f":"VLOOKUP($B65,Store!$B$6:$AG$308,COLUMN()-1,0)","v":"Second Choice"},{"$f":"VLOOKUP($B65,Store!$B$6:$AG$308,COLUMN()-1,0)","v":"100% cotton"},{"$f":"VLOOKUP($B65,Store!$B$6:$AG$308,COLUMN()-1,0)","v":"100% cotton"},{"$f":"VLOOKUP($B65,Store!$B$6:$AG$308,COLUMN()-1,0)","v":"24/2 - 16/1"},{"$f":"VLOOKUP($B65,Store!$B$6:$AG$308,COLUMN()-1,0)","v":"24/2 - 16/1"},{"$f":"VLOOKUP($B65,Store!$B$6:$AG$308,COLUMN()-1,0)","v":"Fresh"},{"$f":"VLOOKUP($B65,Store!$B$6:$AG$308,COLUMN()-1,0)","v":"Fresh"},{"$f":"VLOOKUP($B65,Store!$B$6:$AG$308,COLUMN()-1,0)","v":0},{"$f":"VLOOKUP($B65,Store!$B$6:$AG$308,COLUMN()-1,0)","v":"محمود"},{"$f":"VLOOKUP($B65,Store!$B$6:$AG$308,COLUMN()-1,0)","v":14.022988505747128},{"$f":"VLOOKUP($B65,Store!$B$6:$AG$308,COLUMN()-1,0)","v":200},{"$f":"VLOOKUP($B65,Store!$B$6:$AG$308,COLUMN()-1,0)","v":14},{"$f":"VLOOKUP($B65,Store!$B$6:$AG$308,COLUMN()-1,0)","v":"Dobby"},{"$f":"VLOOKUP($B65,Store!$B$6:$AG$308,COLUMN()-1,0)","v":"Normal"},null,null,{"$f":"SUMIFS(Store!$AD$6:$AD$308,Store!$B$6:$B$308,Rassed!B65,Store!$AH$6:$AH$308,\"اضافه\")","v":900},{"$f":"SUMIFS(Store!$AD$6:$AD$308,Store!$B$6:$B$308,Rassed!B65,Store!$AN$6:$AN$308,\"صرف\")","v":900},0]
[null,"0002 - 75",{"$f":"VLOOKUP($B66,Store!$B$6:$AG$308,COLUMN()-1,0)","v":"dfgdfg"},{"$f":"VLOOKUP($B66,Store!$B$6:$AG$308,COLUMN()-1,0)","v":9114000002},{"$f":"VLOOKUP($B66,Store!$B$6:$AG$308,COLUMN()-1,0)","v":"yhy"},{"$f":"VLOOKUP($B66,Store!$B$6:$AG$308,COLUMN()-1,0)","v":75},{"$f":"VLOOKUP($B66,Store!$B$6:$AG$308,COLUMN()-1,0)","v":7015},{"$f":"VLOOKUP($B66,Store!$B$6:$AG$308,COLUMN()-1,0)","v":7015},{"$f":"VLOOKUP($B66,Store!$B$6:$AG$308,COLUMN()-1,0)","v":"Kitchen Towel"},{"$f":"VLOOKUP($B66,Store!$B$6:$AG$308,COLUMN()-1,0)","v":"Kitchen Towel"},{"$f":"VLOOKUP($B66,Store!$B$6:$AG$308,COLUMN()-1,0)","v":"Flat"},{"$f":"VLOOKUP($B66,Store!$B$6:$AG$308,COLUMN()-1,0)","v":"Flat"},{"$f":"VLOOKUP($B66,Store!$B$6:$AG$308,COLUMN()-1,0)","v":"40 x 60"},{"$f":"VLOOKUP($B66,Store!$B$6:$AG$308,COLUMN()-1,0)","v":"40 x 60"},{"$f":"VLOOKUP($B66,Store!$B$6:$AG$308,COLUMN()-1,0)","v":60.9},{"$f":"VLOOKUP($B66,Store!$B$6:$AG$308,COLUMN()-1,0)","v":48},{"$f":"VLOOKUP($B66,Store!$B$6:$AG$308,COLUMN()-1,0)","v":200},{"$f":"VLOOKUP($B66,Store!$B$6:$AG$308,COLUMN()-1,0)","v":"Very Light weight"},{"$f":"VLOOKUP($B66,Store!$B$6:$AG$308,COLUMN()-1,0)","v":"dark"},{"$f":"VLOOKUP($B66,Store!$B$6:$AG$308,COLUMN()-1,0)","v":"Second Choice"},{"$f":"VLOOKUP($B66,Store!$B$6:$AG$308,COLUMN()-1,0)","v":"100% cotton"},{"$f":"VLOOKUP($B66,Store!$B$6:$AG$308,COLUMN()-1,0)","v":"100% cotton"},{"$f":"VLOOKUP($B66,Store!$B$6:$AG$308,COLUMN()-1,0)","v":"24/2 - 16/1"},{"$f":"VLOOKUP($B66,Store!$B$6:$AG$308,COLUMN()-1,0)","v":"24/2 - 16/1"},{"$f":"VLOOKUP($B66,Store!$B$6:$AG$308,COLUMN()-1,0)","v":"Fresh"},{"$f":"VLOOKUP($B66,Store!$B$6:$AG$308,COLUMN()-1,0)","v":"Fresh"},{"$f":"VLOOKUP($B66,Store!$B$6:$AG$308,COLUMN()-1,0)","v":0},{"$f":"VLOOKUP($B66,Store!$B$6:$AG$308,COLUMN()-1,0)","v":"محمود"},{"$f":"VLOOKUP($B66,Store!$B$6:$AG$308,COLUMN()-1,0)","v":14.423645320197046},{"$f":"VLOOKUP($B66,Store!$B$6:$AG$308,COLUMN()-1,0)","v":300},{"$f":"VLOOKUP($B66,Store!$B$6:$AG$308,COLUMN()-1,0)","v":14.4},{"$f":"VLOOKUP($B66,Store!$B$6:$AG$308,COLUMN()-1,0)","v":"Jacquard"},{"$f":"VLOOKUP($B66,Store!$B$6:$AG$308,COLUMN()-1,0)","v":"Normal"},null,null,{"$f":"SUMIFS(Store!$AD$6:$AD$308,Store!$B$6:$B$308,Rassed!B66,Store!$AH$6:$AH$308,\"اضافه\")","v":312},{"$f":"SUMIFS(Store!$AD$6:$AD$308,Store!$B$6:$B$308,Rassed!B66,Store!$AN$6:$AN$308,\"صرف\")","v":312},0]
[null,"0003 - 75",{"$f":"VLOOKUP($B67,Store!$B$6:$AG$308,COLUMN()-1,0)","v":"dfgdfg"},{"$f":"VLOOKUP($B67,Store!$B$6:$AG$308,COLUMN()-1,0)","v":9114000003},{"$f":"VLOOKUP($B67,Store!$B$6:$AG$308,COLUMN()-1,0)","v":"yhy"},{"$f":"VLOOKUP($B67,Store!$B$6:$AG$308,COLUMN()-1,0)","v":75},{"$f":"VLOOKUP($B67,Store!$B$6:$AG$308,COLUMN()-1,0)","v":7015},{"$f":"VLOOKUP($B67,Store!$B$6:$AG$308,COLUMN()-1,0)","v":7015},{"$f":"VLOOKUP($B67,Store!$B$6:$AG$308,COLUMN()-1,0)","v":"Kitchen Towel"},{"$f":"VLOOKUP($B67,Store!$B$6:$AG$308,COLUMN()-1,0)","v":"Kitchen Towel"},{"$f":"VLOOKUP($B67,Store!$B$6:$AG$308,COLUMN()-1,0)","v":"Flat"},{"$f":"VLOOKUP($B67,Store!$B$6:$AG$308,COLUMN()-1,0)","v":"Flat"},{"$f":"VLOOKUP($B67,Store!$B$6:$AG$308,COLUMN()-1,0)","v":"50 x 65"},{"$f":"VLOOKUP($B67,Store!$B$6:$AG$308,COLUMN()-1,0)","v":"50 x 65"},{"$f":"VLOOKUP($B67,Store!$B$6:$AG$308,COLUMN()-1,0)","v":60.9},{"$f":"VLOOKUP($B67,Store!$B$6:$AG$308,COLUMN()-1,0)","v":65},{"$f":"VLOOKUP($B67,Store!$B$6:$AG$308,COLUMN()-1,0)","v":200},{"$f":"VLOOKUP($B67,Store!$B$6:$AG$308,COLUMN()-1,0)","v":"Very Light weight"},{"$f":"VLOOKUP($B67,Store!$B$6:$AG$308,COLUMN()-1,0)","v":"dark"},{"$f":"VLOOKUP($B67,Store!$B$6:$AG$308,COLUMN()-1,0)","v":"Second Choice"},{"$f":"VLOOKUP($B67,Store!$B$6:$AG$308,COLUMN()-1,0)","v":"100% cotton"},{"$f":"VLOOKUP($B67,Store!$B$6:$AG$308,COLUMN()-1,0)","v":"100% cotton"},{"$f":"VLOOKUP($B67,Store!$B$6:$AG$308,COLUMN()-1,0)","v":"24/2 - 16/1"},{"$f":"VLOOKUP($B67,Store!$B$6:$AG$308,COLUMN()-1,0)","v":"24/2 - 16/1"},{"$f":"VLOOKUP($B67,Store!$B$6:$AG$308,COLUMN()-1,0)","v":"Fresh"},{"$f":"VLOOKUP($B67,Store!$B$6:$AG$308,COLUMN()-1,0)","v":"Fresh"},{"$f":"VLOOKUP($B67,Store!$B$6:$AG$308,COLUMN()-1,0)","v":0},{"$f":"VLOOKUP($B67,Store!$B$6:$AG$308,COLUMN()-1,0)","v":"محمود"},{"$f":"VLOOKUP($B67,Store!$B$6:$AG$308,COLUMN()-1,0)","v":32.553366174055832},{"$f":"VLOOKUP($B67,Store!$B$6:$AG$308,COLUMN()-1,0)","v":500},{"$f":"VLOOKUP($B67,Store!$B$6:$AG$308,COLUMN()-1,0)","v":32.5},{"$f":"VLOOKUP($B67,Store!$B$6:$AG$308,COLUMN()-1,0)","v":"Jacquard"},{"$f":"VLOOKUP($B67,Store!$B$6:$AG$308,COLUMN()-1,0)","v":"Normal"},null,null,{"$f":"SUMIFS(Store!$AD$6:$AD$308,Store!$B$6:$B$308,Rassed!B67,Store!$AH$6:$AH$308,\"اضافه\")","v":555},{"$f":"SUMIFS(Store!$AD$6:$AD$308,Store!$B$6:$B$308,Rassed!B67,Store!$AN$6:$AN$308,\"صرف\")","v":555},0]
[null,"0009 - 75",{"$f":"VLOOKUP($B68,Store!$B$6:$AG$308,COLUMN()-1,0)","v":"dfgdfg"},{"$f":"VLOOKUP($B68,Store!$B$6:$AG$308,COLUMN()-1,0)","v":9114000009},{"$f":"VLOOKUP($B68,Store!$B$6:$AG$308,COLUMN()-1,0)","v":"بيبل"},{"$f":"VLOOKUP($B68,Store!$B$6:$AG$308,COLUMN()-1,0)","v":75},{"$f":"VLOOKUP($B68,Store!$B$6:$AG$308,COLUMN()-1,0)","v":7015},{"$f":"VLOOKUP($B68,Store!$B$6:$AG$308,COLUMN()-1,0)","v":7015},{"$f":"VLOOKUP($B68,Store!$B$6:$AG$308,COLUMN()-1,0)","v":"Kitchen Towel"},{"$f":"VLOOKUP($B68,Store!$B$6:$AG$308,COLUMN()-1,0)","v":"Kitchen Towel"},{"$f":"VLOOKUP($B68,Store!$B$6:$AG$308,COLUMN()-1,0)","v":"Flat"},{"$f":"VLOOKUP($B68,Store!$B$6:$AG$308,COLUMN()-1,0)","v":"Flat"},{"$f":"VLOOKUP($B68,Store!$B$6:$AG$308,COLUMN()-1,0)","v":"50 x 65"},{"$f":"VLOOKUP($B68,Store!$B$6:$AG$308,COLUMN()-1,0)","v":"50 x 65"},{"$f":"VLOOKUP($B68,Store!$B$6:$AG$308,COLUMN()-1,0)","v":65.000000000000014},{"$f":"VLOOKUP($B68,Store!$B$6:$AG$308,COLUMN()-1,0)","v":65},{"$f":"VLOOKUP($B68,Store!$B$6:$AG$308,COLUMN()-1,0)","v":200},{"$f":"VLOOKUP($B68,Store!$B$6:$AG$308,COLUMN()-1,0)","v":"Very Light weight"},{"$f":"VLOOKUP($B68,Store!$B$6:$AG$308,COLUMN()-1,0)","v":"dark"},{"$f":"VLOOKUP($B68,Store!$B$6:$AG$308,COLUMN()-1,0)","v":"Second Choice"},{"$f":"VLOOKUP($B68,Store!$B$6:$AG$308,COLUMN()-1,0)","v":"100% cotton"},{"$f":"VLOOKUP($B68,Store!$B$6:$AG$308,COLUMN()-1,0)","v":"100% cotton"},{"$f":"VLOOKUP($B68,Store!$B$6:$AG$308,COLUMN()-1,0)","v":"24/2 - 16/1"},{"$f":"VLOOKUP($B68,Store!$B$6:$AG$308,COLUMN()-1,0)","v":"24/2 - 16/1"},{"$f":"VLOOKUP($B68,Store!$B$6:$AG$308,COLUMN()-1,0)","v":"Fresh"},{"$f":"VLOOKUP($B68,Store!$B$6:$AG$308,COLUMN()-1,0)","v":"Fresh"},{"$f":"VLOOKUP($B68,Store!$B$6:$AG$308,COLUMN()-1,0)","v":0},{"$f":"VLOOKUP($B68,Store!$B$6:$AG$308,COLUMN()-1,0)","v":"بل"},{"$f":"VLOOKUP($B68,Store!$B$6:$AG$308,COLUMN()-1,0)","v":1.3793103448275861},{"$f":"VLOOKUP($B68,Store!$B$6:$AG$308,COLUMN()-1,0)","v":20},{"$f":"VLOOKUP($B68,Store!$B$6:$AG$308,COLUMN()-1,0)","v":1.3},{"$f":"VLOOKUP($B68,Store!$B$6:$AG$308,COLUMN()-1,0)","v":"Jacquard"},{"$f":"VLOOKUP($B68,Store!$B$6:$AG$308,COLUMN()-1,0)","v":"Normal"},null,null,{"$f":"SUMIFS(Store!$AD$6:$AD$308,Store!$B$6:$B$308,Rassed!B68,Store!$AH$6:$AH$308,\"اضافه\")","v":50},{"$f":"SUMIFS(Store!$AD$6:$AD$308,Store!$B$6:$B$308,Rassed!B68,Store!$AN$6:$AN$308,\"صرف\")","v":50},0]
[null,"0005 - 75",{"$f":"VLOOKUP($B69,Store!$B$6:$AG$308,COLUMN()-1,0)","v":"dfgdfg"},{"$f":"VLOOKUP($B69,Store!$B$6:$AG$308,COLUMN()-1,0)","v":9114000005},{"$f":"VLOOKUP($B69,Store!$B$6:$AG$308,COLUMN()-1,0)","v":"بيبل"},{"$f":"VLOOKUP($B69,Store!$B$6:$AG$308,COLUMN()-1,0)","v":75},{"$f":"VLOOKUP($B69,Store!$B$6:$AG$308,COLUMN()-1,0)","v":7015},{"$f":"VLOOKUP($B69,Store!$B$6:$AG$308,COLUMN()-1,0)","v":7015},{"$f":"VLOOKUP($B69,Store!$B$6:$AG$308,COLUMN()-1,0)","v":"Kitchen Towel"},{"$f":"VLOOKUP($B69,Store!$B$6:$AG$308,COLUMN()-1,0)","v":"Kitchen Towel"},{"$f":"VLOOKUP($B69,Store!$B$6:$AG$308,COLUMN()-1,0)","v":"Flat"},{"$f":"VLOOKUP($B69,Store!$B$6:$AG$308,COLUMN()-1,0)","v":"Flat"},{"$f":"VLOOKUP($B69,Store!$B$6:$AG$308,COLUMN()-1,0)","v":"50 x 65"},{"$f":"VLOOKUP($B69,Store!$B$6:$AG$308,COLUMN()-1,0)","v":"50 x 65"},{"$f":"VLOOKUP($B69,Store!$B$6:$AG$308,COLUMN()-1,0)","v":65.000000000000014},{"$f":"VLOOKUP($B69,Store!$B$6:$AG$308,COLUMN()-1,0)","v":65},{"$f":"VLOOKUP($B69,Store!$B$6:$AG$308,COLUMN()-1,0)","v":200},{"$f":"VLOOKUP($B69,Store!$B$6:$AG$308,COLUMN()-1,0)","v":"Very Light weight"},{"$f":"VLOOKUP($B69,Store!$B$6:$AG$308,COLUMN()-1,0)","v":"dark"},{"$f":"VLOOKUP($B69,Store!$B$6:$AG$308,COLUMN()-1,0)","v":"Second Choice"},{"$f":"VLOOKUP($B69,Store!$B$6:$AG$308,COLUMN()-1,0)","v":"100% cotton"},{"$f":"VLOOKUP($B69,Store!$B$6:$AG$308,COLUMN()-1,0)","v":"100% cotton"},{"$f":"VLOOKUP($B69,Store!$B$6:$AG$308,COLUMN()-1,0)","v":"24/2 - 16/1"},{"$f":"VLOOKUP($B69,Store!$B$6:$AG$308,COLUMN()-1,0)","v":"24/2 - 16/1"},{"$f":"VLOOKUP($B69,Store!$B$6:$AG$308,COLUMN()-1,0)","v":"Fresh"},{"$f":"VLOOKUP($B69,Store!$B$6:$AG$308,COLUMN()-1,0)","v":"Fresh"},{"$f":"VLOOKUP($B69,Store!$B$6:$AG$308,COLUMN()-1,0)","v":0},{"$f":"VLOOKUP($B69,Store!$B$6:$AG$308,COLUMN()-1,0)","v":"بل"},{"$f":"VLOOKUP($B69,Store!$B$6:$AG$308,COLUMN()-1,0)","v":0.82758620689655171},{"$f":"VLOOKUP($B69,Store!$B$6:$AG$308,COLUMN()-1,0)","v":12},{"$f":"VLOOKUP($B69,Store!$B$6:$AG$308,COLUMN()-1,0)","v":0.78},{"$f":"VLOOKUP($B69,Store!$B$6:$AG$308,COLUMN()-1,0)","v":"Jacquard"},{"$f":"VLOOKUP($B69,Store!$B$6:$AG$308,COLUMN()-1,0)","v":"Normal"},null,null,{"$f":"SUMIFS(Store!$AD$6:$AD$308,Store!$B$6:$B$308,Rassed!B69,Store!$AH$6:$AH$308,\"اضافه\")","v":29},{"$f":"SUMIFS(Store!$AD$6:$AD$308,Store!$B$6:$B$308,Rassed!B69,Store!$AN$6:$AN$308,\"صرف\")","v":29},0]
[null,"0008 - 75",{"$f":"VLOOKUP($B70,Store!$B$6:$AG$308,COLUMN()-1,0)","v":"dfgdfg"},{"$f":"VLOOKUP($B70,Store!$B$6:$AG$308,COLUMN()-1,0)","v":9114000008},{"$f":"VLOOKUP($B70,Store!$B$6:$AG$308,COLUMN()-1,0)","v":"بيبل"},{"$f":"VLOOKUP($B70,Store!$B$6:$AG$308,COLUMN()-1,0)","v":75},{"$f":"VLOOKUP($B70,Store!$B$6:$AG$308,COLUMN()-1,0)","v":7015},{"$f":"VLOOKUP($B70,Store!$B$6:$AG$308,COLUMN()-1,0)","v":7015},{"$f":"VLOOKUP($B70,Store!$B$6:$AG$308,COLUMN()-1,0)","v":"Kitchen Towel"},{"$f":"VLOOKUP($B70,Store!$B$6:$AG$308,COLUMN()-1,0)","v":"Kitchen Towel"},{"$f":"VLOOKUP($B70,Store!$B$6:$AG$308,COLUMN()-1,0)","v":"Flat"},{"$f":"VLOOKUP($B70,Store!$B$6:$AG$308,COLUMN()-1,0)","v":"Flat"},{"$f":"VLOOKUP($B70,Store!$B$6:$AG$308,COLUMN()-1,0)","v":"50 x 65"},{"$f":"VLOOKUP($B70,Store!$B$6:$AG$308,COLUMN()-1,0)","v":"50 x 65"},{"$f":"VLOOKUP($B70,Store!$B$6:$AG$308,COLUMN()-1,0)","v":65.000000000000014},{"$f":"VLOOKUP($B70,Store!$B$6:$AG$308,COLUMN()-1,0)","v":65},{"$f":"VLOOKUP($B70,Store!$B$6:$AG$308,COLUMN()-1,0)","v":200},{"$f":"VLOOKUP($B70,Store!$B$6:$AG$308,COLUMN()-1,0)","v":"Very Light weight"},{"$f":"VLOOKUP($B70,Store!$B$6:$AG$308,COLUMN()-1,0)","v":"dark"},{"$f":"VLOOKUP($B70,Store!$B$6:$AG$308,COLUMN()-1,0)","v":"Second Choice"},{"$f":"VLOOKUP($B70,Store!$B$6:$AG$308,COLUMN()-1,0)","v":"100% cotton"},{"$f":"VLOOKUP($B70,Store!$B$6:$AG$308,COLUMN()-1,0)","v":"100% cotton"},{"$f":"VLOOKUP($B70,Store!$B$6:$AG$308,COLUMN()-1,0)","v":"24/2 - 16/1"},{"$f":"VLOOKUP($B70,Store!$B$6:$AG$308,COLUMN()-1,0)","v":"24/2 - 16/1"},{"$f":"VLOOKUP($B70,Store!$B$6:$AG$308,COLUMN()-1,0)","v":"Fresh"},{"$f":"VLOOKUP($B70,Store!$B$6:$AG$308,COLUMN()-1,0)","v":"Fresh"},{"$f":"VLOOKUP($B70,Store!$B$6:$AG$308,COLUMN()-1,0)","v":0},{"$f":"VLOOKUP($B70,Store!$B$6:$AG$308,COLUMN()-1,0)","v":"بل"},{"$f":"VLOOKUP($B70,Store!$B$6:$AG$308,COLUMN()-1,0)","v":0.55172413793103448},{"$f":"VLOOKUP($B70,Store!$B$6:$AG$308,COLUMN()-1,0)","v":8},{"$f":"VLOOKUP($B70,Store!$B$6:$AG$308,COLUMN()-1,0)","v":0.52},{"$f":"VLOOKUP($B70,Store!$B$6:$AG$308,COLUMN()-1,0)","v":"Jacquard"},{"$f":"VLOOKUP($B70,Store!$B$6:$AG$308,COLUMN()-1,0)","v":"Normal"},null,null,{"$f":"SUMIFS(Store!$AD$6:$AD$308,Store!$B$6:$B$308,Rassed!B70,Store!$AH$6:$AH$308,\"اضافه\")","v":8},{"$f":"SUMIFS(Store!$AD$6:$AD$308,Store!$B$6:$B$308,Rassed!B70,Store!$AN$6:$AN$308,\"صرف\")","v":8},0]
[null,"0006 - 75",{"$f":"VLOOKUP($B71,Store!$B$6:$AG$308,COLUMN()-1,0)","v":"dfgdfg"},{"$f":"VLOOKUP($B71,Store!$B$6:$AG$308,COLUMN()-1,0)","v":9114000006},{"$f":"VLOOKUP($B71,Store!$B$6:$AG$308,COLUMN()-1,0)","v":"بيبل"},{"$f":"VLOOKUP($B71,Store!$B$6:$AG$308,COLUMN()-1,0)","v":75},{"$f":"VLOOKUP($B71,Store!$B$6:$AG$308,COLUMN()-1,0)","v":7015},{"$f":"VLOOKUP($B71,Store!$B$6:$AG$308,COLUMN()-1,0)","v":7015},{"$f":"VLOOKUP($B71,Store!$B$6:$AG$308,COLUMN()-1,0)","v":"Kitchen Towel"},{"$f":"VLOOKUP($B71,Store!$B$6:$AG$308,COLUMN()-1,0)","v":"Kitchen Towel"},{"$f":"VLOOKUP($B71,Store!$B$6:$AG$308,COLUMN()-1,0)","v":"Flat"},{"$f":"VLOOKUP($B71,Store!$B$6:$AG$308,COLUMN()-1,0)","v":"Flat"},{"$f":"VLOOKUP($B71,Store!$B$6:$AG$308,COLUMN()-1,0)","v":"50 x 65"},{"$f":"VLOOKUP($B71,Store!$B$6:$AG$308,COLUMN()-1,0)","v":"50 x 65"},{"$f":"VLOOKUP($B71,Store!$B$6:$AG$308,COLUMN()-1,0)","v":65.000000000000014},{"$f":"VLOOKUP($B71,Store!$B$6:$AG$308,COLUMN()-1,0)","v":65},{"$f":"VLOOKUP($B71,Store!$B$6:$AG$308,COLUMN()-1,0)","v":200},{"$f":"VLOOKUP($B71,Store!$B$6:$AG$308,COLUMN()-1,0)","v":"Very Light weight"},{"$f":"VLOOKUP($B71,Store!$B$6:$AG$308,COLUMN()-1,0)","v":"dark"},{"$f":"VLOOKUP($B71,Store!$B$6:$AG$308,COLUMN()-1,0)","v":"Second Choice"},{"$f":"VLOOKUP($B71,Store!$B$6:$AG$308,COLUMN()-1,0)","v":"100% cotton"},{"$f":"VLOOKUP($B71,Store!$B$6:$AG$308,COLUMN()-1,0)","v":"100% cotton"},{"$f":"VLOOKUP($B71,Store!$B$6:$AG$308,COLUMN()-1,0)","v":"24/2 - 16/1"},{"$f":"VLOOKUP($B71,Store!$B$6:$AG$308,COLUMN()-1,0)","v":"24/2 - 16/1"},{"$f":"VLOOKUP($B71,Store!$B$6:$AG$308,COLUMN()-1,0)","v":"Fresh"},{"$f":"VLOOKUP($B71,Store!$B$6:$AG$308,COLUMN()-1,0)","v":"Fresh"},{"$f":"VLOOKUP($B71,Store!$B$6:$AG$308,COLUMN()-1,0)","v":0},{"$f":"VLOOKUP($B71,Store!$B$6:$AG$308,COLUMN()-1,0)","v":"بل"},{"$f":"VLOOKUP($B71,Store!$B$6:$AG$308,COLUMN()-1,0)","v":0.48275862068965514},{"$f":"VLOOKUP($B71,Store!$B$6:$AG$308,COLUMN()-1,0)","v":7},{"$f":"VLOOKUP($B71,Store!$B$6:$AG$308,COLUMN()-1,0)","v":0.45500000000000002},{"$f":"VLOOKUP($B71,Store!$B$6:$AG$308,COLUMN()-1,0)","v":"Jacquard"},{"$f":"VLOOKUP($B71,Store!$B$6:$AG$308,COLUMN()-1,0)","v":"Normal"},null,null,{"$f":"SUMIFS(Store!$AD$6:$AD$308,Store!$B$6:$B$308,Rassed!B71,Store!$AH$6:$AH$308,\"اضافه\")","v":7},{"$f":"SUMIFS(Store!$AD$6:$AD$308,Store!$B$6:$B$308,Rassed!B71,Store!$AN$6:$AN$308,\"صرف\")","v":7},0]
[null,"0001 - 44",{"$f":"VLOOKUP($B72,Store!$B$6:$AG$308,COLUMN()-1,0)","v":"Elephnt"},{"$f":"VLOOKUP($B72,Store!$B$6:$AG$308,COLUMN()-1,0)","v":9114000018},{"$f":"VLOOKUP($B72,Store!$B$6:$AG$308,COLUMN()-1,0)","v":"مشكل عميل 44 اوردر 7008"},{"$f":"VLOOKUP($B72,Store!$B$6:$AG$308,COLUMN()-1,0)","v":44},{"$f":"VLOOKUP($B72,Store!$B$6:$AG$308,COLUMN()-1,0)","v":7008},{"$f":"VLOOKUP($B72,Store!$B$6:$AG$308,COLUMN()-1,0)","v":7008},{"$f":"VLOOKUP($B72,Store!$B$6:$AG$308,COLUMN()-1,0)","v":"Kitchen Towel"},{"$f":"VLOOKUP($B72,Store!$B$6:$AG$308,COLUMN()-1,0)","v":"Kitchen Towel"},{"$f":"VLOOKUP($B72,Store!$B$6:$AG$308,COLUMN()-1,0)","v":"Flat"},{"$f":"VLOOKUP($B72,Store!$B$6:$AG$308,COLUMN()-1,0)","v":"Flat"},{"$f":"VLOOKUP($B72,Store!$B$6:$AG$308,COLUMN()-1,0)","v":"50 X 70"},{"$f":"VLOOKUP($B72,Store!$B$6:$AG$308,COLUMN()-1,0)","v":"50 X 70"},{"$f":"VLOOKUP($B72,Store!$B$6:$AG$308,COLUMN()-1,0)","v":70},{"$f":"VLOOKUP($B72,Store!$B$6:$AG$308,COLUMN()-1,0)","v":70},{"$f":"VLOOKUP($B72,Store!$B$6:$AG$308,COLUMN()-1,0)","v":200},{"$f":"VLOOKUP($B72,Store!$B$6:$AG$308,COLUMN()-1,0)","v":"Very Light weight"},{"$f":"VLOOKUP($B72,Store!$B$6:$AG$308,COLUMN()-1,0)","v":"dark"},{"$f":"VLOOKUP($B72,Store!$B$6:$AG$308,COLUMN()-1,0)","v":"Second Choice"},{"$f":"VLOOKUP($B72,Store!$B$6:$AG$308,COLUMN()-1,0)","v":"100% cotton"},{"$f":"VLOOKUP($B72,Store!$B$6:$AG$308,COLUMN()-1,0)","v":"100% cotton"},{"$f":"VLOOKUP($B72,Store!$B$6:$AG$308,COLUMN()-1,0)","v":"24/2 - 16/1"},{"$f":"VLOOKUP($B72,Store!$B$6:$AG$308,COLUMN()-1,0)","v":"24/2 - 16/1"},{"$f":"VLOOKUP($B72,Store!$B$6:$AG$308,COLUMN()-1,0)","v":"Fresh"},{"$f":"VLOOKUP($B72,Store!$B$6:$AG$308,COLUMN()-1,0)","v":"Fresh"},{"$f":"VLOOKUP($B72,Store!$B$6:$AG$308,COLUMN()-1,0)","v":0},{"$f":"VLOOKUP($B72,Store!$B$6:$AG$308,COLUMN()-1,0)","v":"محمود"},{"$f":"VLOOKUP($B72,Store!$B$6:$AG$308,COLUMN()-1,0)","v":7.2727272727272716},{"$f":"VLOOKUP($B72,Store!$B$6:$AG$308,COLUMN()-1,0)","v":100},{"$f":"VLOOKUP($B72,Store!$B$6:$AG$308,COLUMN()-1,0)","v":7},{"$f":"VLOOKUP($B72,Store!$B$6:$AG$308,COLUMN()-1,0)","v":"Dobby"},{"$f":"VLOOKUP($B72,Store!$B$6:$AG$308,COLUMN()-1,0)","v":"Normal"},null,null,{"$f":"SUMIFS(Store!$AD$6:$AD$308,Store!$B$6:$B$308,Rassed!B72,Store!$AH$6:$AH$308,\"اضافه\")","v":1550},{"$f":"SUMIFS(Store!$AD$6:$AD$308,Store!$B$6:$B$308,Rassed!B72,Store!$AN$6:$AN$308,\"صرف\")","v":2050},-500]
[null,"0002 - 44",{"$f":"VLOOKUP($B73,Store!$B$6:$AG$308,COLUMN()-1,0)","v":"BroB"},{"$f":"VLOOKUP($B73,Store!$B$6:$AG$308,COLUMN()-1,0)","v":9114000019},{"$f":"VLOOKUP($B73,Store!$B$6:$AG$308,COLUMN()-1,0)","v":"مشكل عميل 44 اوردر 7008"},{"$f":"VLOOKUP($B73,Store!$B$6:$AG$308,COLUMN()-1,0)","v":44},{"$f":"VLOOKUP($B73,Store!$B$6:$AG$308,COLUMN()-1,0)","v":7008},{"$f":"VLOOKUP($B73,Store!$B$6:$AG$308,COLUMN()-1,0)","v":7008},{"$f":"VLOOKUP($B73,Store!$B$6:$AG$308,COLUMN()-1,0)","v":"Kitchen Towel"},{"$f":"VLOOKUP($B73,Store!$B$6:$AG$308,COLUMN()-1,0)","v":"Kitchen Towel"},{"$f":"VLOOKUP($B73,Store!$B$6:$AG$308,COLUMN()-1,0)","v":"Flat"},{"$f":"VLOOKUP($B73,Store!$B$6:$AG$308,COLUMN()-1,0)","v":"Flat"},{"$f":"VLOOKUP($B73,Store!$B$6:$AG$308,COLUMN()-1,0)","v":"50 X 70"},{"$f":"VLOOKUP($B73,Store!$B$6:$AG$308,COLUMN()-1,0)","v":"50 X 70"},{"$f":"VLOOKUP($B73,Store!$B$6:$AG$308,COLUMN()-1,0)","v":70},{"$f":"VLOOKUP($B73,Store!$B$6:$AG$308,COLUMN()-1,0)","v":70},{"$f":"VLOOKUP($B73,Store!$B$6:$AG$308,COLUMN()-1,0)","v":200},{"$f":"VLOOKUP($B73,Store!$B$6:$AG$308,COLUMN()-1,0)","v":"Very Light weight"},{"$f":"VLOOKUP($B73,Store!$B$6:$AG$308,COLUMN()-1,0)","v":"dark"},{"$f":"VLOOKUP($B73,Store!$B$6:$AG$308,COLUMN()-1,0)","v":"Second Choice"},{"$f":"VLOOKUP($B73,Store!$B$6:$AG$308,COLUMN()-1,0)","v":"100% cotton"},{"$f":"VLOOKUP($B73,Store!$B$6:$AG$308,COLUMN()-1,0)","v":"100% cotton"},{"$f":"VLOOKUP($B73,Store!$B$6:$AG$308,COLUMN()-1,0)","v":"24/2 - 16/1"},{"$f":"VLOOKUP($B73,Store!$B$6:$AG$308,COLUMN()-1,0)","v":"24/2 - 16/1"},{"$f":"VLOOKUP($B73,Store!$B$6:$AG$308,COLUMN()-1,0)","v":"Fresh"},{"$f":"VLOOKUP($B73,Store!$B$6:$AG$308,COLUMN()-1,0)","v":"Fresh"},{"$f":"VLOOKUP($B73,Store!$B$6:$AG$308,COLUMN()-1,0)","v":0},{"$f":"VLOOKUP($B73,Store!$B$6:$AG$308,COLUMN()-1,0)","v":"محمود"},{"$f":"VLOOKUP($B73,Store!$B$6:$AG$308,COLUMN()-1,0)","v":10.909090909090908},{"$f":"VLOOKUP($B73,Store!$B$6:$AG$308,COLUMN()-1,0)","v":150},{"$f":"VLOOKUP($B73,Store!$B$6:$AG$308,COLUMN()-1,0)","v":10.5},{"$f":"VLOOKUP($B73,Store!$B$6:$AG$308,COLUMN()-1,0)","v":"Dobby"},{"$f":"VLOOKUP($B73,Store!$B$6:$AG$308,COLUMN()-1,0)","v":"Normal"},null,null,{"$f":"SUMIFS(Store!$AD$6:$AD$308,Store!$B$6:$B$308,Rassed!B73,Store!$AH$6:$AH$308,\"اضافه\")","v":150},{"$f":"SUMIFS(Store!$AD$6:$AD$308,Store!$B$6:$B$308,Rassed!B73,Store!$AN$6:$AN$308,\"صرف\")","v":300},{"$f":"AJ73-AK73","v":-150}]
[null,"0003 - 44",{"$f":"VLOOKUP($B74,Store!$B$6:$AG$308,COLUMN()-1,0)","v":"hgh"},{"$f":"VLOOKUP($B74,Store!$B$6:$AG$308,COLUMN()-1,0)","v":9114000020},{"$f":"VLOOKUP($B74,Store!$B$6:$AG$308,COLUMN()-1,0)","v":"مشكل عميل 44 اوردر 7008"},{"$f":"VLOOKUP($B74,Store!$B$6:$AG$308,COLUMN()-1,0)","v":44},{"$f":"VLOOKUP($B74,Store!$B$6:$AG$308,COLUMN()-1,0)","v":7008},{"$f":"VLOOKUP($B74,Store!$B$6:$AG$308,COLUMN()-1,0)","v":7008},{"$f":"VLOOKUP($B74,Store!$B$6:$AG$308,COLUMN()-1,0)","v":"Kitchen Towel"},{"$f":"VLOOKUP($B74,Store!$B$6:$AG$308,COLUMN()-1,0)","v":"Kitchen Towel"},{"$f":"VLOOKUP($B74,Store!$B$6:$AG$308,COLUMN()-1,0)","v":"Flat"},{"$f":"VLOOKUP($B74,Store!$B$6:$AG$308,COLUMN()-1,0)","v":"Flat"},{"$f":"VLOOKUP($B74,Store!$B$6:$AG$308,COLUMN()-1,0)","v":"50 X 70"},{"$f":"VLOOKUP($B74,Store!$B$6:$AG$308,COLUMN()-1,0)","v":"50 X 70"},{"$f":"VLOOKUP($B74,Store!$B$6:$AG$308,COLUMN()-1,0)","v":70},{"$f":"VLOOKUP($B74,Store!$B$6:$AG$308,COLUMN()-1,0)","v":70},{"$f":"VLOOKUP($B74,Store!$B$6:$AG$308,COLUMN()-1,0)","v":200},{"$f":"VLOOKUP($B74,Store!$B$6:$AG$308,COLUMN()-1,0)","v":"Very Light weight"},{"$f":"VLOOKUP($B74,Store!$B$6:$AG$308,COLUMN()-1,0)","v":"dark"},{"$f":"VLOOKUP($B74,Store!$B$6:$AG$308,COLUMN()-1,0)","v":"Second Choice"},{"$f":"VLOOKUP($B74,Store!$B$6:$AG$308,COLUMN()-1,0)","v":"100% cotton"},{"$f":"VLOOKUP($B74,Store!$B$6:$AG$308,COLUMN()-1,0)","v":"100% cotton"},{"$f":"VLOOKUP($B74,Store!$B$6:$AG$308,COLUMN()-1,0)","v":"24/2 - 16/1"},{"$f":"VLOOKUP($B74,Store!$B$6:$AG$308,COLUMN()-1,0)","v":"24/2 - 16/2"},{"$f":"VLOOKUP($B74,Store!$B$6:$AG$308,COLUMN()-1,0)","v":"Fresh"},{"$f":"VLOOKUP($B74,Store!$B$6:$AG$308,COLUMN()-1,0)","v":"Fresh"},{"$f":"VLOOKUP($B74,Store!$B$6:$AG$308,COLUMN()-1,0)","v":0},{"$f":"VLOOKUP($B74,Store!$B$6:$AG$308,COLUMN()-1,0)","v":"محمود"},{"$f":"VLOOKUP($B74,Store!$B$6:$AG$308,COLUMN()-1,0)","v":14.545454545454543},{"$f":"VLOOKUP($B74,Store!$B$6:$AG$308,COLUMN()-1,0)","v":200},{"$f":"VLOOKUP($B74,Store!$B$6:$AG$308,COLUMN()-1,0)","v":14},{"$f":"VLOOKUP($B74,Store!$B$6:$AG$308,COLUMN()-1,0)","v":"Jacquard"},{"$f":"VLOOKUP($B74,Store!$B$6:$AG$308,COLUMN()-1,0)","v":"Normal"},null,null,{"$f":"SUMIFS(Store!$AD$6:$AD$308,Store!$B$6:$B$308,Rassed!B74,Store!$AH$6:$AH$308,\"اضافه\")","v":200},{"$f":"SUMIFS(Store!$AD$6:$AD$308,Store!$B$6:$B$308,Rassed!B74,Store!$AN$6:$AN$308,\"صرف\")","v":400},-200]
[null,"0004 - 44",{"$f":"VLOOKUP($B75,Store!$B$6:$AG$308,COLUMN()-1,0)","v":"yurturhy"},{"$f":"VLOOKUP($B75,Store!$B$6:$AG$308,COLUMN()-1,0)","v":9114000021},{"$f":"VLOOKUP($B75,Store!$B$6:$AG$308,COLUMN()-1,0)","v":"مشكل عميل 44 اوردر 7008"},{"$f":"VLOOKUP($B75,Store!$B$6:$AG$308,COLUMN()-1,0)","v":44},{"$f":"VLOOKUP($B75,Store!$B$6:$AG$308,COLUMN()-1,0)","v":7008},{"$f":"VLOOKUP($B75,Store!$B$6:$AG$308,COLUMN()-1,0)","v":7008},{"$f":"VLOOKUP($B75,Store!$B$6:$AG$308,COLUMN()-1,0)","v":"Kitchen Towel"},{"$f":"VLOOKUP($B75,Store!$B$6:$AG$308,COLUMN()-1,0)","v":"Kitchen Towel"},{"$f":"VLOOKUP($B75,Store!$B$6:$AG$308,COLUMN()-1,0)","v":"Flat"},{"$f":"VLOOKUP($B75,Store!$B$6:$AG$308,COLUMN()-1,0)","v":"Flat"},{"$f":"VLOOKUP($B75,Store!$B$6:$AG$308,COLUMN()-1,0)","v":"50 X 70"},{"$f":"VLOOKUP($B75,Store!$B$6:$AG$308,COLUMN()-1,0)","v":"50 X 70"},{"$f":"VLOOKUP($B75,Store!$B$6:$AG$308,COLUMN()-1,0)","v":70},{"$f":"VLOOKUP($B75,Store!$B$6:$AG$308,COLUMN()-1,0)","v":70},{"$f":"VLOOKUP($B75,Store!$B$6:$AG$308,COLUMN()-1,0)","v":200},{"$f":"VLOOKUP($B75,Store!$B$6:$AG$308,COLUMN()-1,0)","v":"Very Light weight"},{"$f":"VLOOKUP($B75,Store!$B$6:$AG$308,COLUMN()-1,0)","v":"dark"},{"$f":"VLOOKUP($B75,Store!$B$6:$AG$308,COLUMN()-1,0)","v":"Second Choice"},{"$f":"VLOOKUP($B75,Store!$B$6:$AG$308,COLUMN()-1,0)","v":"100% cotton"},{"$f":"VLOOKUP($B75,Store!$B$6:$AG$308,COLUMN()-1,0)","v":"100% cotton"},{"$f":"VLOOKUP($B75,Store!$B$6:$AG$308,COLUMN()-1,0)","v":"24/2 - 16/1"},{"$f":"VLOOKUP($B75,Store!$B$6:$AG$308,COLUMN()-1,0)","v":"24/2 - 16/3"},{"$f":"VLOOKUP($B75,Store!$B$6:$AG$308,COLUMN()-1,0)","v":"Fresh"},{"$f":"VLOOKUP($B75,Store!$B$6:$AG$308,COLUMN()-1,0)","v":"Fresh"},{"$f":"VLOOKUP($B75,Store!$B$6:$AG$308,COLUMN()-1,0)","v":0},{"$f":"VLOOKUP($B75,Store!$B$6:$AG$308,COLUMN()-1,0)","v":"محمود"},{"$f":"VLOOKUP($B75,Store!$B$6:$AG$308,COLUMN()-1,0)","v":21.818181818181817},{"$f":"VLOOKUP($B75,Store!$B$6:$AG$308,COLUMN()-1,0)","v":300},{"$f":"VLOOKUP($B75,Store!$B$6:$AG$308,COLUMN()-1,0)","v":21},{"$f":"VLOOKUP($B75,Store!$B$6:$AG$308,COLUMN()-1,0)","v":"Jacquard"},{"$f":"VLOOKUP($B75,Store!$B$6:$AG$308,COLUMN()-1,0)","v":"Normal"},null,null,{"$f":"SUMIFS(Store!$AD$6:$AD$308,Store!$B$6:$B$308,Rassed!B75,Store!$AH$6:$AH$308,\"اضافه\")","v":300},{"$f":"SUMIFS(Store!$AD$6:$AD$308,Store!$B$6:$B$308,Rassed!B75,Store!$AN$6:$AN$308,\"صرف\")","v":600},-300]
[null,"0005 - 44",{"$f":"VLOOKUP($B76,Store!$B$6:$AG$308,COLUMN()-1,0)","v":"dytrto"},{"$f":"VLOOKUP($B76,Store!$B$6:$AG$308,COLUMN()-1,0)","v":9114000022},{"$f":"VLOOKUP($B76,Store!$B$6:$AG$308,COLUMN()-1,0)","v":"مشكل عميل 44 اوردر 7008"},{"$f":"VLOOKUP($B76,Store!$B$6:$AG$308,COLUMN()-1,0)","v":44},{"$f":"VLOOKUP($B76,Store!$B$6:$AG$308,COLUMN()-1,0)","v":7008},{"$f":"VLOOKUP($B76,Store!$B$6:$AG$308,COLUMN()-1,0)","v":7008},{"$f":"VLOOKUP($B76,Store!$B$6:$AG$308,COLUMN()-1,0)","v":"Kitchen Towel"},{"$f":"VLOOKUP($B76,Store!$B$6:$AG$308,COLUMN()-1,0)","v":"Kitchen Towel"},{"$f":"VLOOKUP($B76,Store!$B$6:$AG$308,COLUMN()-1,0)","v":"Flat"},{"$f":"VLOOKUP($B76,Store!$B$6:$AG$308,COLUMN()-1,0)","v":"Flat"},{"$f":"VLOOKUP($B76,Store!$B$6:$AG$308,COLUMN()-1,0)","v":"50 X 70"},{"$f":"VLOOKUP($B76,Store!$B$6:$AG$308,COLUMN()-1,0)","v":"50 X 70"},{"$f":"VLOOKUP($B76,Store!$B$6:$AG$308,COLUMN()-1,0)","v":70},{"$f":"VLOOKUP($B76,Store!$B$6:$AG$308,COLUMN()-1,0)","v":70},{"$f":"VLOOKUP($B76,Store!$B$6:$AG$308,COLUMN()-1,0)","v":200},{"$f":"VLOOKUP($B76,Store!$B$6:$AG$308,COLUMN()-1,0)","v":"Very Light weight"},{"$f":"VLOOKUP($B76,Store!$B$6:$AG$308,COLUMN()-1,0)","v":"dark"},{"$f":"VLOOKUP($B76,Store!$B$6:$AG$308,COLUMN()-1,0)","v":"Second Choice"},{"$f":"VLOOKUP($B76,Store!$B$6:$AG$308,COLUMN()-1,0)","v":"100% cotton"},{"$f":"VLOOKUP($B76,Store!$B$6:$AG$308,COLUMN()-1,0)","v":"100% cotton"},{"$f":"VLOOKUP($B76,Store!$B$6:$AG$308,COLUMN()-1,0)","v":"24/2 - 16/1"},{"$f":"VLOOKUP($B76,Store!$B$6:$AG$308,COLUMN()-1,0)","v":"24/2 - 16/4"},{"$f":"VLOOKUP($B76,Store!$B$6:$AG$308,COLUMN()-1,0)","v":"Fresh"},{"$f":"VLOOKUP($B76,Store!$B$6:$AG$308,COLUMN()-1,0)","v":"Fresh"},{"$f":"VLOOKUP($B76,Store!$B$6:$AG$308,COLUMN()-1,0)","v":0},{"$f":"VLOOKUP($B76,Store!$B$6:$AG$308,COLUMN()-1,0)","v":"محمود"},{"$f":"VLOOKUP($B76,Store!$B$6:$AG$308,COLUMN()-1,0)","v":29.090909090909086},{"$f":"VLOOKUP($B76,Store!$B$6:$AG$308,COLUMN()-1,0)","v":400},{"$f":"VLOOKUP($B76,Store!$B$6:$AG$308,COLUMN()-1,0)","v":28},{"$f":"VLOOKUP($B76,Store!$B$6:$AG$308,COLUMN()-1,0)","v":"Jacquard"},{"$f":"VLOOKUP($B76,Store!$B$6:$AG$308,COLUMN()-1,0)","v":"Normal"},null,null,{"$f":"SUMIFS(Store!$AD$6:$AD$308,Store!$B$6:$B$308,Rassed!B76,Store!$AH$6:$AH$308,\"اضافه\")","v":400},{"$f":"SUMIFS(Store!$AD$6:$AD$308,Store!$B$6:$B$308,Rassed!B76,Store!$AN$6:$AN$308,\"صرف\")","v":800},-400]
[null,"0006 - 44",{"$f":"VLOOKUP($B77,Store!$B$6:$AG$308,COLUMN()-1,0)","v":"srttLLLLl"},{"$f":"VLOOKUP($B77,Store!$B$6:$AG$308,COLUMN()-1,0)","v":9114000023},{"$f":"VLOOKUP($B77,Store!$B$6:$AG$308,COLUMN()-1,0)","v":"مشكل عميل 44 اوردر 7008"},{"$f":"VLOOKUP($B77,Store!$B$6:$AG$308,COLUMN()-1,0)","v":44},{"$f":"VLOOKUP($B77,Store!$B$6:$AG$308,COLUMN()-1,0)","v":7008},{"$f":"VLOOKUP($B77,Store!$B$6:$AG$308,COLUMN()-1,0)","v":7008},{"$f":"VLOOKUP($B77,Store!$B$6:$AG$308,COLUMN()-1,0)","v":"Kitchen Towel"},{"$f":"VLOOKUP($B77,Store!$B$6:$AG$308,COLUMN()-1,0)","v":"Kitchen Towel"},{"$f":"VLOOKUP($B77,Store!$B$6:$AG$308,COLUMN()-1,0)","v":"Flat"},{"$f":"VLOOKUP($B77,Store!$B$6:$AG$308,COLUMN()-1,0)","v":"Flat"},{"$f":"VLOOKUP($B77,Store!$B$6:$AG$308,COLUMN()-1,0)","v":"50 X 70"},{"$f":"VLOOKUP($B77,Store!$B$6:$AG$308,COLUMN()-1,0)","v":"50 X 70"},{"$f":"VLOOKUP($B77,Store!$B$6:$AG$308,COLUMN()-1,0)","v":70},{"$f":"VLOOKUP($B77,Store!$B$6:$AG$308,COLUMN()-1,0)","v":70},{"$f":"VLOOKUP($B77,Store!$B$6:$AG$308,COLUMN()-1,0)","v":200},{"$f":"VLOOKUP($B77,Store!$B$6:$AG$308,COLUMN()-1,0)","v":"Very Light weight"},{"$f":"VLOOKUP($B77,Store!$B$6:$AG$308,COLUMN()-1,0)","v":"dark"},{"$f":"VLOOKUP($B77,Store!$B$6:$AG$308,COLUMN()-1,0)","v":"Second Choice"},{"$f":"VLOOKUP($B77,Store!$B$6:$AG$308,COLUMN()-1,0)","v":"100% cotton"},{"$f":"VLOOKUP($B77,Store!$B$6:$AG$308,COLUMN()-1,0)","v":"100% cotton"},{"$f":"VLOOKUP($B77,Store!$B$6:$AG$308,COLUMN()-1,0)","v":"24/2 - 16/1"},{"$f":"VLOOKUP($B77,Store!$B$6:$AG$308,COLUMN()-1,0)","v":"24/2 - 16/5"},{"$f":"VLOOKUP($B77,Store!$B$6:$AG$308,COLUMN()-1,0)","v":"Fresh"},{"$f":"VLOOKUP($B77,Store!$B$6:$AG$308,COLUMN()-1,0)","v":"Fresh"},{"$f":"VLOOKUP($B77,Store!$B$6:$AG$308,COLUMN()-1,0)","v":0},{"$f":"VLOOKUP($B77,Store!$B$6:$AG$308,COLUMN()-1,0)","v":"محمود"},{"$f":"VLOOKUP($B77,Store!$B$6:$AG$308,COLUMN()-1,0)","v":36.36363636363636},{"$f":"VLOOKUP($B77,Store!$B$6:$AG$308,COLUMN()-1,0)","v":500},{"$f":"VLOOKUP($B77,Store!$B$6:$AG$308,COLUMN()-1,0)","v":35},{"$f":"VLOOKUP($B77,Store!$B$6:$AG$308,COLUMN()-1,0)","v":"Jacquard"},{"$f":"VLOOKUP($B77,Store!$B$6:$AG$308,COLUMN()-1,0)","v":"Normal"},null,null,{"$f":"SUMIFS(Store!$AD$6:$AD$308,Store!$B$6:$B$308,Rassed!B77,Store!$AH$6:$AH$308,\"اضافه\")","v":500},{"$f":"SUMIFS(Store!$AD$6:$AD$308,Store!$B$6:$B$308,Rassed!B77,Store!$AN$6:$AN$308,\"صرف\")","v":1000},-500]
[null,"0001 - 55",{"$f":"VLOOKUP($B78,Store!$B$6:$AG$308,COLUMN()-1,0)","v":"palm blue"},{"$f":"VLOOKUP($B78,Store!$B$6:$AG$308,COLUMN()-1,0)","v":9114000024},{"$f":"VLOOKUP($B78,Store!$B$6:$AG$308,COLUMN()-1,0)","v":"مشكل عميل 55 اوردر 7009"},{"$f":"VLOOKUP($B78,Store!$B$6:$AG$308,COLUMN()-1,0)","v":55},{"$f":"VLOOKUP($B78,Store!$B$6:$AG$308,COLUMN()-1,0)","v":7009},{"$f":"VLOOKUP($B78,Store!$B$6:$AG$308,COLUMN()-1,0)","v":7009},{"$f":"VLOOKUP($B78,Store!$B$6:$AG$308,COLUMN()-1,0)","v":"Kitchen Towel"},{"$f":"VLOOKUP($B78,Store!$B$6:$AG$308,COLUMN()-1,0)","v":"Kitchen Towel"},{"$f":"VLOOKUP($B78,Store!$B$6:$AG$308,COLUMN()-1,0)","v":"Flat"},{"$f":"VLOOKUP($B78,Store!$B$6:$AG$308,COLUMN()-1,0)","v":"Flat"},{"$f":"VLOOKUP($B78,Store!$B$6:$AG$308,COLUMN()-1,0)","v":"50 X 70"},{"$f":"VLOOKUP($B78,Store!$B$6:$AG$308,COLUMN()-1,0)","v":"50 X 70"},{"$f":"VLOOKUP($B78,Store!$B$6:$AG$308,COLUMN()-1,0)","v":70},{"$f":"VLOOKUP($B78,Store!$B$6:$AG$308,COLUMN()-1,0)","v":70},{"$f":"VLOOKUP($B78,Store!$B$6:$AG$308,COLUMN()-1,0)","v":200},{"$f":"VLOOKUP($B78,Store!$B$6:$AG$308,COLUMN()-1,0)","v":"Very Light weight"},{"$f":"VLOOKUP($B78,Store!$B$6:$AG$308,COLUMN()-1,0)","v":"dark"},{"$f":"VLOOKUP($B78,Store!$B$6:$AG$308,COLUMN()-1,0)","v":"Second Choice"},{"$f":"VLOOKUP($B78,Store!$B$6:$AG$308,COLUMN()-1,0)","v":"100% cotton"},{"$f":"VLOOKUP($B78,Store!$B$6:$AG$308,COLUMN()-1,0)","v":"100% cotton"},{"$f":"VLOOKUP($B78,Store!$B$6:$AG$308,COLUMN()-1,0)","v":"24/2 - 16/1"},{"$f":"VLOOKUP($B78,Store!$B$6:$AG$308,COLUMN()-1,0)","v":"24/2 - 16/1"},{"$f":"VLOOKUP($B78,Store!$B$6:$AG$308,COLUMN()-1,0)","v":"Fresh"},{"$f":"VLOOKUP($B78,Store!$B$6:$AG$308,COLUMN()-1,0)","v":"Fresh"},{"$f":"VLOOKUP($B78,Store!$B$6:$AG$308,COLUMN()-1,0)","v":0},{"$f":"VLOOKUP($B78,Store!$B$6:$AG$308,COLUMN()-1,0)","v":"محمود"},{"$f":"VLOOKUP($B78,Store!$B$6:$AG$308,COLUMN()-1,0)","v":14},{"$f":"VLOOKUP($B78,Store!$B$6:$AG$308,COLUMN()-1,0)","v":200},{"$f":"VLOOKUP($B78,Store!$B$6:$AG$308,COLUMN()-1,0)","v":14},{"$f":"VLOOKUP($B78,Store!$B$6:$AG$308,COLUMN()-1,0)","v":"Dobby"},{"$f":"VLOOKUP($B78,Store!$B$6:$AG$308,COLUMN()-1,0)","v":"Normal"},null,null,{"$f":"SUMIFS(Store!$AD$6:$AD$308,Store!$B$6:$B$308,Rassed!B78,Store!$AH$6:$AH$308,\"اضافه\")","v":600},{"$f":"SUMIFS(Store!$AD$6:$AD$308,Store!$B$6:$B$308,Rassed!B78,Store!$AN$6:$AN$308,\"صرف\")","v":1000},-400]
[null,"0002 - 55",{"$f":"VLOOKUP($B79,Store!$B$6:$AG$308,COLUMN()-1,0)","v":"palm nel"},{"$f":"VLOOKUP($B79,Store!$B$6:$AG$308,COLUMN()-1,0)","v":9114000025},{"$f":"VLOOKUP($B79,Store!$B$6:$AG$308,COLUMN()-1,0)","v":"مشكل عميل 55 اوردر 7009"},{"$f":"VLOOKUP($B79,Store!$B$6:$AG$308,COLUMN()-1,0)","v":55},{"$f":"VLOOKUP($B79,Store!$B$6:$AG$308,COLUMN()-1,0)","v":7009},{"$f":"VLOOKUP($B79,Store!$B$6:$AG$308,COLUMN()-1,0)","v":7009},{"$f":"VLOOKUP($B79,Store!$B$6:$AG$308,COLUMN()-1,0)","v":"Kitchen Towel"},{"$f":"VLOOKUP($B79,Store!$B$6:$AG$308,COLUMN()-1,0)","v":"Kitchen Towel"},{"$f":"VLOOKUP($B79,Store!$B$6:$AG$308,COLUMN()-1,0)","v":"Flat"},{"$f":"VLOOKUP($B79,Store!$B$6:$AG$308,COLUMN()-1,0)","v":"Flat"},{"$f":"VLOOKUP($B79,Store!$B$6:$AG$308,COLUMN()-1,0)","v":"50 X 70"},{"$f":"VLOOKUP($B79,Store!$B$6:$AG$308,COLUMN()-1,0)","v":"50 X 70"},{"$f":"VLOOKUP($B79,Store!$B$6:$AG$308,COLUMN()-1,0)","v":70},{"$f":"VLOOKUP($B79,Store!$B$6:$AG$308,COLUMN()-1,0)","v":70},{"$f":"VLOOKUP($B79,Store!$B$6:$AG$308,COLUMN()-1,0)","v":200},{"$f":"VLOOKUP($B79,Store!$B$6:$AG$308,COLUMN()-1,0)","v":"Very Light weight"},{"$f":"VLOOKUP($B79,Store!$B$6:$AG$308,COLUMN()-1,0)","v":"dark"},{"$f":"VLOOKUP($B79,Store!$B$6:$AG$308,COLUMN()-1,0)","v":"Second Choice"},{"$f":"VLOOKUP($B79,Store!$B$6:$AG$308,COLUMN()-1,0)","v":"100% cotton"},{"$f":"VLOOKUP($B79,Store!$B$6:$AG$308,COLUMN()-1,0)","v":"100% cotton"},{"$f":"VLOOKUP($B79,Store!$B$6:$AG$308,COLUMN()-1,0)","v":"24/2 - 16/1"},{"$f":"VLOOKUP($B79,Store!$B$6:$AG$308,COLUMN()-1,0)","v":"24/2 - 16/1"},{"$f":"VLOOKUP($B79,Store!$B$6:$AG$308,COLUMN()-1,0)","v":"Fresh"},{"$f":"VLOOKUP($B79,Store!$B$6:$AG$308,COLUMN()-1,0)","v":"Fresh"},{"$f":"VLOOKUP($B79,Store!$B$6:$AG$308,COLUMN()-1,0)","v":0},{"$f":"VLOOKUP($B79,Store!$B$6:$AG$308,COLUMN()-1,0)","v":"محمود"},{"$f":"VLOOKUP($B79,Store!$B$6:$AG$308,COLUMN()-1,0)","v":3.5},{"$f":"VLOOKUP($B79,Store!$B$6:$AG$308,COLUMN()-1,0)","v":50},{"$f":"VLOOKUP($B79,Store!$B$6:$AG$308,COLUMN()-1,0)","v":3.5},{"$f":"VLOOKUP($B79,Store!$B$6:$AG$308,COLUMN()-1,0)","v":"Dobby"},{"$f":"VLOOKUP($B79,Store!$B$6:$AG$308,COLUMN()-1,0)","v":"Normal"},null,null,{"$f":"SUMIFS(Store!$AD$6:$AD$308,Store!$B$6:$B$308,Rassed!B79,Store!$AH$6:$AH$308,\"اضافه\")","v":170},{"$f":"SUMIFS(Store!$AD$6:$AD$308,Store!$B$6:$B$308,Rassed!B79,Store!$AN$6:$AN$308,\"صرف\")","v":290},-120]
[null,"0003 - 55",{"$f":"VLOOKUP($B80,Store!$B$6:$AG$308,COLUMN()-1,0)","v":"palm Turq"},{"$f":"VLOOKUP($B80,Store!$B$6:$AG$308,COLUMN()-1,0)","v":9114000026},{"$f":"VLOOKUP($B80,Store!$B$6:$AG$308,COLUMN()-1,0)","v":"مشكل عميل 55 اوردر 7009"},{"$f":"VLOOKUP($B80,Store!$B$6:$AG$308,COLUMN()-1,0)","v":55},{"$f":"VLOOKUP($B80,Store!$B$6:$AG$308,COLUMN()-1,0)","v":7009},{"$f":"VLOOKUP($B80,Store!$B$6:$AG$308,COLUMN()-1,0)","v":7009},{"$f":"VLOOKUP($B80,Store!$B$6:$AG$308,COLUMN()-1,0)","v":"Kitchen Towel"},{"$f":"VLOOKUP($B80,Store!$B$6:$AG$308,COLUMN()-1,0)","v":"Kitchen Towel"},{"$f":"VLOOKUP($B80,Store!$B$6:$AG$308,COLUMN()-1,0)","v":"Flat"},{"$f":"VLOOKUP($B80,Store!$B$6:$AG$308,COLUMN()-1,0)","v":"Flat"},{"$f":"VLOOKUP($B80,Store!$B$6:$AG$308,COLUMN()-1,0)","v":"50 X 70"},{"$f":"VLOOKUP($B80,Store!$B$6:$AG$308,COLUMN()-1,0)","v":"50 X 70"},{"$f":"VLOOKUP($B80,Store!$B$6:$AG$308,COLUMN()-1,0)","v":70},{"$f":"VLOOKUP($B80,Store!$B$6:$AG$308,COLUMN()-1,0)","v":70},{"$f":"VLOOKUP($B80,Store!$B$6:$AG$308,COLUMN()-1,0)","v":200},{"$f":"VLOOKUP($B80,Store!$B$6:$AG$308,COLUMN()-1,0)","v":"Very Light weight"},{"$f":"VLOOKUP($B80,Store!$B$6:$AG$308,COLUMN()-1,0)","v":"dark"},{"$f":"VLOOKUP($B80,Store!$B$6:$AG$308,COLUMN()-1,0)","v":"Second Choice"},{"$f":"VLOOKUP($B80,Store!$B$6:$AG$308,COLUMN()-1,0)","v":"100% cotton"},{"$f":"VLOOKUP($B80,Store!$B$6:$AG$308,COLUMN()-1,0)","v":"100% cotton"},{"$f":"VLOOKUP($B80,Store!$B$6:$AG$308,COLUMN()-1,0)","v":"24/2 - 16/1"},{"$f":"VLOOKUP($B80,Store!$B$6:$AG$308,COLUMN()-1,0)","v":"24/2 - 16/1"},{"$f":"VLOOKUP($B80,Store!$B$6:$AG$308,COLUMN()-1,0)","v":"Fresh"},{"$f":"VLOOKUP($B80,Store!$B$6:$AG$308,COLUMN()-1,0)","v":"Fresh"},{"$f":"VLOOKUP($B80,Store!$B$6:$AG$308,COLUMN()-1,0)","v":0},{"$f":"VLOOKUP($B80,Store!$B$6:$AG$308,COLUMN()-1,0)","v":"محمود"},{"$f":"VLOOKUP($B80,Store!$B$6:$AG$308,COLUMN()-1,0)","v":1.75},{"$f":"VLOOKUP($B80,Store!$B$6:$AG$308,COLUMN()-1,0)","v":25},{"$f":"VLOOKUP($B80,Store!$B$6:$AG$308,COLUMN()-1,0)","v":1.75},{"$f":"VLOOKUP($B80,Store!$B$6:$AG$308,COLUMN()-1,0)","v":"Dobby"},{"$f":"VLOOKUP($B80,Store!$B$6:$AG$308,COLUMN()-1,0)","v":"Normal"},null,null,{"$f":"SUMIFS(Store!$AD$6:$AD$308,Store!$B$6:$B$308,Rassed!B80,Store!$AH$6:$AH$308,\"اضافه\")","v":33},{"$f":"SUMIFS(Store!$AD$6:$AD$308,Store!$B$6:$B$308,Rassed!B80,Store!$AN$6:$AN$308,\"صرف\")","v":41},-8]
[null,"0004 - 55",{"$f":"VLOOKUP($B81,Store!$B$6:$AG$308,COLUMN()-1,0)","v":"palm orange"},{"$f":"VLOOKUP($B81,Store!$B$6:$AG$308,COLUMN()-1,0)","v":9114000027},{"$f":"VLOOKUP($B81,Store!$B$6:$AG$308,COLUMN()-1,0)","v":"مشكل عميل 55 اوردر 7009"},{"$f":"VLOOKUP($B81,Store!$B$6:$AG$308,COLUMN()-1,0)","v":55},{"$f":"VLOOKUP($B81,Store!$B$6:$AG$308,COLUMN()-1,0)","v":7009},{"$f":"VLOOKUP($B81,Store!$B$6:$AG$308,COLUMN()-1,0)","v":7009},{"$f":"VLOOKUP($B81,Store!$B$6:$AG$308,COLUMN()-1,0)","v":"Kitchen Towel"},{"$f":"VLOOKUP($B81,Store!$B$6:$AG$308,COLUMN()-1,0)","v":"Kitchen Towel"},{"$f":"VLOOKUP($B81,Store!$B$6:$AG$308,COLUMN()-1,0)","v":"Flat"},{"$f":"VLOOKUP($B81,Store!$B$6:$AG$308,COLUMN()-1,0)","v":"Flat"},{"$f":"VLOOKUP($B81,Store!$B$6:$AG$308,COLUMN()-1,0)","v":"50 X 70"},{"$f":"VLOOKUP($B81,Store!$B$6:$AG$308,COLUMN()-1,0)","v":"50 X 70"},{"$f":"VLOOKUP($B81,Store!$B$6:$AG$308,COLUMN()-1,0)","v":70},{"$f":"VLOOKUP($B81,Store!$B$6:$AG$308,COLUMN()-1,0)","v":70},{"$f":"VLOOKUP($B81,Store!$B$6:$AG$308,COLUMN()-1,0)","v":200},{"$f":"VLOOKUP($B81,Store!$B$6:$AG$308,COLUMN()-1,0)","v":"Very Light weight"},{"$f":"VLOOKUP($B81,Store!$B$6:$AG$308,COLUMN()-1,0)","v":"dark"},{"$f":"VLOOKUP($B81,Store!$B$6:$AG$308,COLUMN()-1,0)","v":"Second Choice"},{"$f":"VLOOKUP($B81,Store!$B$6:$AG$308,COLUMN()-1,0)","v":"100% cotton"},{"$f":"VLOOKUP($B81,Store!$B$6:$AG$308,COLUMN()-1,0)","v":"100% cotton"},{"$f":"VLOOKUP($B81,Store!$B$6:$AG$308,COLUMN()-1,0)","v":"24/2 - 16/1"},{"$f":"VLOOKUP($B81,Store!$B$6:$AG$308,COLUMN()-1,0)","v":"24/2 - 16/1"},{"$f":"VLOOKUP($B81,Store!$B$6:$AG$308,COLUMN()-1,0)","v":"Fresh"},{"$f":"VLOOKUP($B81,Store!$B$6:$AG$308,COLUMN()-1,0)","v":"Fresh"},{"$f":"VLOOKUP($B81,Store!$B$6:$AG$308,COLUMN()-1,0)","v":0},{"$f":"VLOOKUP($B81,Store!$B$6:$AG$308,COLUMN()-1,0)","v":"محمود"},{"$f":"VLOOKUP($B81,Store!$B$6:$AG$308,COLUMN()-1,0)","v":2.1},{"$f":"VLOOKUP($B81,Store!$B$6:$AG$308,COLUMN()-1,0)","v":30},{"$f":"VLOOKUP($B81,Store!$B$6:$AG$308,COLUMN()-1,0)","v":2.1},{"$f":"VLOOKUP($B81,Store!$B$6:$AG$308,COLUMN()-1,0)","v":"Dobby"},{"$f":"VLOOKUP($B81,Store!$B$6:$AG$308,COLUMN()-1,0)","v":"Normal"},null,null,{"$f":"SUMIFS(Store!$AD$6:$AD$308,Store!$B$6:$B$308,Rassed!B81,Store!$AH$6:$AH$308,\"اضافه\")","v":42},{"$f":"SUMIFS(Store!$AD$6:$AD$308,Store!$B$6:$B$308,Rassed!B81,Store!$AN$6:$AN$308,\"صرف\")","v":54},-12]
[null,"0005 - 55",{"$f":"VLOOKUP($B82,Store!$B$6:$AG$308,COLUMN()-1,0)","v":"palm red"},{"$f":"VLOOKUP($B82,Store!$B$6:$AG$308,COLUMN()-1,0)","v":9114000028},{"$f":"VLOOKUP($B82,Store!$B$6:$AG$308,COLUMN()-1,0)","v":"مشكل عميل 55 اوردر 7009"},{"$f":"VLOOKUP($B82,Store!$B$6:$AG$308,COLUMN()-1,0)","v":55},{"$f":"VLOOKUP($B82,Store!$B$6:$AG$308,COLUMN()-1,0)","v":7009},{"$f":"VLOOKUP($B82,Store!$B$6:$AG$308,COLUMN()-1,0)","v":7009},{"$f":"VLOOKUP($B82,Store!$B$6:$AG$308,COLUMN()-1,0)","v":"Kitchen Towel"},{"$f":"VLOOKUP($B82,Store!$B$6:$AG$308,COLUMN()-1,0)","v":"Kitchen Towel"},{"$f":"VLOOKUP($B82,Store!$B$6:$AG$308,COLUMN()-1,0)","v":"Flat"},{"$f":"VLOOKUP($B82,Store!$B$6:$AG$308,COLUMN()-1,0)","v":"Flat"},{"$f":"VLOOKUP($B82,Store!$B$6:$AG$308,COLUMN()-1,0)","v":"50 X 70"},{"$f":"VLOOKUP($B82,Store!$B$6:$AG$308,COLUMN()-1,0)","v":"50 X 70"},{"$f":"VLOOKUP($B82,Store!$B$6:$AG$308,COLUMN()-1,0)","v":70},{"$f":"VLOOKUP($B82,Store!$B$6:$AG$308,COLUMN()-1,0)","v":70},{"$f":"VLOOKUP($B82,Store!$B$6:$AG$308,COLUMN()-1,0)","v":200},{"$f":"VLOOKUP($B82,Store!$B$6:$AG$308,COLUMN()-1,0)","v":"Very Light weight"},{"$f":"VLOOKUP($B82,Store!$B$6:$AG$308,COLUMN()-1,0)","v":"dark"},{"$f":"VLOOKUP($B82,Store!$B$6:$AG$308,COLUMN()-1,0)","v":"Second Choice"},{"$f":"VLOOKUP($B82,Store!$B$6:$AG$308,COLUMN()-1,0)","v":"100% cotton"},{"$f":"VLOOKUP($B82,Store!$B$6:$AG$308,COLUMN()-1,0)","v":"100% cotton"},{"$f":"VLOOKUP($B82,Store!$B$6:$AG$308,COLUMN()-1,0)","v":"24/2 - 16/1"},{"$f":"VLOOKUP($B82,Store!$B$6:$AG$308,COLUMN()-1,0)","v":"24/2 - 16/1"},{"$f":"VLOOKUP($B82,Store!$B$6:$AG$308,COLUMN()-1,0)","v":"Fresh"},{"$f":"VLOOKUP($B82,Store!$B$6:$AG$308,COLUMN()-1,0)","v":"Fresh"},{"$f":"VLOOKUP($B82,Store!$B$6:$AG$308,COLUMN()-1,0)","v":0},{"$f":"VLOOKUP($B82,Store!$B$6:$AG$308,COLUMN()-1,0)","v":"محمود"},{"$f":"VLOOKUP($B82,Store!$B$6:$AG$308,COLUMN()-1,0)","v":0.84},{"$f":"VLOOKUP($B82,Store!$B$6:$AG$308,COLUMN()-1,0)","v":12},{"$f":"VLOOKUP($B82,Store!$B$6:$AG$308,COLUMN()-1,0)","v":0.84},{"$f":"VLOOKUP($B82,Store!$B$6:$AG$308,COLUMN()-1,0)","v":"Dobby"},{"$f":"VLOOKUP($B82,Store!$B$6:$AG$308,COLUMN()-1,0)","v":"Normal"},null,null,{"$f":"SUMIFS(Store!$AD$6:$AD$308,Store!$B$6:$B$308,Rassed!B82,Store!$AH$6:$AH$308,\"اضافه\")","v":42},{"$f":"SUMIFS(Store!$AD$6:$AD$308,Store!$B$6:$B$308,Rassed!B82,Store!$AN$6:$AN$308,\"صرف\")","v":72},-30]
[null,"0006 - 55",{"$f":"VLOOKUP($B83,Store!$B$6:$AG$308,COLUMN()-1,0)","v":"palm Brown"},{"$f":"VLOOKUP($B83,Store!$B$6:$AG$308,COLUMN()-1,0)","v":9114000029},{"$f":"VLOOKUP($B83,Store!$B$6:$AG$308,COLUMN()-1,0)","v":"مشكل عميل 55 اوردر 7009"},{"$f":"VLOOKUP($B83,Store!$B$6:$AG$308,COLUMN()-1,0)","v":55},{"$f":"VLOOKUP($B83,Store!$B$6:$AG$308,COLUMN()-1,0)","v":7009},{"$f":"VLOOKUP($B83,Store!$B$6:$AG$308,COLUMN()-1,0)","v":7009},{"$f":"VLOOKUP($B83,Store!$B$6:$AG$308,COLUMN()-1,0)","v":"Kitchen Towel"},{"$f":"VLOOKUP($B83,Store!$B$6:$AG$308,COLUMN()-1,0)","v":"Kitchen Towel"},{"$f":"VLOOKUP($B83,Store!$B$6:$AG$308,COLUMN()-1,0)","v":"Flat"},{"$f":"VLOOKUP($B83,Store!$B$6:$AG$308,COLUMN()-1,0)","v":"Flat"},{"$f":"VLOOKUP($B83,Store!$B$6:$AG$308,COLUMN()-1,0)","v":"50 X 70"},{"$f":"VLOOKUP($B83,Store!$B$6:$AG$308,COLUMN()-1,0)","v":"50 X 70"},{"$f":"VLOOKUP($B83,Store!$B$6:$AG$308,COLUMN()-1,0)","v":70},{"$f":"VLOOKUP($B83,Store!$B$6:$AG$308,COLUMN()-1,0)","v":70},{"$f":"VLOOKUP($B83,Store!$B$6:$AG$308,COLUMN()-1,0)","v":200},{"$f":"VLOOKUP($B83,Store!$B$6:$AG$308,COLUMN()-1,0)","v":"Very Light weight"},{"$f":"VLOOKUP($B83,Store!$B$6:$AG$308,COLUMN()-1,0)","v":"dark"},{"$f":"VLOOKUP($B83,Store!$B$6:$AG$308,COLUMN()-1,0)","v":"Second Choice"},{"$f":"VLOOKUP($B83,Store!$B$6:$AG$308,COLUMN()-1,0)","v":"100% cotton"},{"$f":"VLOOKUP($B83,Store!$B$6:$AG$308,COLUMN()-1,0)","v":"100% cotton"},{"$f":"VLOOKUP($B83,Store!$B$6:$AG$308,COLUMN()-1,0)","v":"24/2 - 16/1"},{"$f":"VLOOKUP($B83,Store!$B$6:$AG$308,COLUMN()-1,0)","v":"24/2 - 16/1"},{"$f":"VLOOKUP($B83,Store!$B$6:$AG$308,COLUMN()-1,0)","v":"Fresh"},{"$f":"VLOOKUP($B83,Store!$B$6:$AG$308,COLUMN()-1,0)","v":"Fresh"},{"$f":"VLOOKUP($B83,Store!$B$6:$AG$308,COLUMN()-1,0)","v":0},{"$f":"VLOOKUP($B83,Store!$B$6:$AG$308,COLUMN()-1,0)","v":"محمود"},{"$f":"VLOOKUP($B83,Store!$B$6:$AG$308,COLUMN()-1,0)","v":0.56000000000000005},{"$f":"VLOOKUP($B83,Store!$B$6:$AG$308,COLUMN()-1,0)","v":8},{"$f":"VLOOKUP($B83,Store!$B$6:$AG$308,COLUMN()-1,0)","v":0.56000000000000005},{"$f":"VLOOKUP($B83,Store!$B$6:$AG$308,COLUMN()-1,0)","v":"Dobby"},{"$f":"VLOOKUP($B83,Store!$B$6:$AG$308,COLUMN()-1,0)","v":"Normal"},null,null,{"$f":"SUMIFS(Store!$AD$6:$AD$308,Store!$B$6:$B$308,Rassed!B83,Store!$AH$6:$AH$308,\"اضافه\")","v":30},{"$f":"SUMIFS(Store!$AD$6:$AD$308,Store!$B$6:$B$308,Rassed!B83,Store!$AN$6:$AN$308,\"صرف\")","v":52},-22]
[null,"0008 - 55",{"$f":"VLOOKUP($B84,Store!$B$6:$AG$308,COLUMN()-1,0)","v":"Moon - Red"},{"$f":"VLOOKUP($B84,Store!$B$6:$AG$308,COLUMN()-1,0)","v":9114000031},{"$f":"VLOOKUP($B84,Store!$B$6:$AG$308,COLUMN()-1,0)","v":"مشكل عميل 55 اوردر 7010"},{"$f":"VLOOKUP($B84,Store!$B$6:$AG$308,COLUMN()-1,0)","v":55},{"$f":"VLOOKUP($B84,Store!$B$6:$AG$308,COLUMN()-1,0)","v":7010},{"$f":"VLOOKUP($B84,Store!$B$6:$AG$308,COLUMN()-1,0)","v":7010},{"$f":"VLOOKUP($B84,Store!$B$6:$AG$308,COLUMN()-1,0)","v":"Kitchen Towel"},{"$f":"VLOOKUP($B84,Store!$B$6:$AG$308,COLUMN()-1,0)","v":"Kitchen Towel"},{"$f":"VLOOKUP($B84,Store!$B$6:$AG$308,COLUMN()-1,0)","v":"Flat"},{"$f":"VLOOKUP($B84,Store!$B$6:$AG$308,COLUMN()-1,0)","v":"Flat"},{"$f":"VLOOKUP($B84,Store!$B$6:$AG$308,COLUMN()-1,0)","v":"50 X 70"},{"$f":"VLOOKUP($B84,Store!$B$6:$AG$308,COLUMN()-1,0)","v":"50 X 70"},{"$f":"VLOOKUP($B84,Store!$B$6:$AG$308,COLUMN()-1,0)","v":70},{"$f":"VLOOKUP($B84,Store!$B$6:$AG$308,COLUMN()-1,0)","v":70},{"$f":"VLOOKUP($B84,Store!$B$6:$AG$308,COLUMN()-1,0)","v":200},{"$f":"VLOOKUP($B84,Store!$B$6:$AG$308,COLUMN()-1,0)","v":"Very Light weight"},{"$f":"VLOOKUP($B84,Store!$B$6:$AG$308,COLUMN()-1,0)","v":"dark"},{"$f":"VLOOKUP($B84,Store!$B$6:$AG$308,COLUMN()-1,0)","v":"Second Choice"},{"$f":"VLOOKUP($B84,Store!$B$6:$AG$308,COLUMN()-1,0)","v":"100% cotton"},{"$f":"VLOOKUP($B84,Store!$B$6:$AG$308,COLUMN()-1,0)","v":"100% cotton"},{"$f":"VLOOKUP($B84,Store!$B$6:$AG$308,COLUMN()-1,0)","v":"24/2 - 16/1"},{"$f":"VLOOKUP($B84,Store!$B$6:$AG$308,COLUMN()-1,0)","v":"24/2 - 16/1"},{"$f":"VLOOKUP($B84,Store!$B$6:$AG$308,COLUMN()-1,0)","v":"Fresh"},{"$f":"VLOOKUP($B84,Store!$B$6:$AG$308,COLUMN()-1,0)","v":"Fresh"},{"$f":"VLOOKUP($B84,Store!$B$6:$AG$308,COLUMN()-1,0)","v":0},{"$f":"VLOOKUP($B84,Store!$B$6:$AG$308,COLUMN()-1,0)","v":"محمود"},{"$f":"VLOOKUP($B84,Store!$B$6:$AG$308,COLUMN()-1,0)","v":8.4},{"$f":"VLOOKUP($B84,Store!$B$6:$AG$308,COLUMN()-1,0)","v":120},{"$f":"VLOOKUP($B84,Store!$B$6:$AG$308,COLUMN()-1,0)","v":8.4},{"$f":"VLOOKUP($B84,Store!$B$6:$AG$308,COLUMN()-1,0)","v":"Jacquard"},{"$f":"VLOOKUP($B84,Store!$B$6:$AG$308,COLUMN()-1,0)","v":"Normal"},null,null,{"$f":"SUMIFS(Store!$AD$6:$AD$308,Store!$B$6:$B$308,Rassed!B84,Store!$AH$6:$AH$308,\"اضافه\")","v":120},{"$f":"SUMIFS(Store!$AD$6:$AD$308,Store!$B$6:$B$308,Rassed!B84,Store!$AN$6:$AN$308,\"صرف\")","v":240},-120]
[null,"0003 - 40",{"$f":"VLOOKUP($B85,Store!$B$6:$AG$308,COLUMN()-1,0)","v":"dfsg"},{"$f":"VLOOKUP($B85,Store!$B$6:$AG$308,COLUMN()-1,0)","v":9111000001},{"$f":"VLOOKUP($B85,Store!$B$6:$AG$308,COLUMN()-1,0)","v":"jfghj"},{"$f":"VLOOKUP($B85,Store!$B$6:$AG$308,COLUMN()-1,0)","v":40},{"$f":"VLOOKUP($B85,Store!$B$6:$AG$308,COLUMN()-1,0)","v":7017},{"$f":"VLOOKUP($B85,Store!$B$6:$AG$308,COLUMN()-1,0)","v":7017},{"$f":"VLOOKUP($B85,Store!$B$6:$AG$308,COLUMN()-1,0)","v":"Bath towel"},{"$f":"VLOOKUP($B85,Store!$B$6:$AG$308,COLUMN()-1,0)","v":"Bath towel"},{"$f":"VLOOKUP($B85,Store!$B$6:$AG$308,COLUMN()-1,0)","v":"Terry"},{"$f":"VLOOKUP($B85,Store!$B$6:$AG$308,COLUMN()-1,0)","v":"Terry"},{"$f":"VLOOKUP($B85,Store!$B$6:$AG$308,COLUMN()-1,0)","v":"90 x 160"},{"$f":"VLOOKUP($B85,Store!$B$6:$AG$308,COLUMN()-1,0)","v":"90 x 160"},{"$f":"VLOOKUP($B85,Store!$B$6:$AG$308,COLUMN()-1,0)","v":720.00000000000011},{"$f":"VLOOKUP($B85,Store!$B$6:$AG$308,COLUMN()-1,0)","v":720},{"$f":"VLOOKUP($B85,Store!$B$6:$AG$308,COLUMN()-1,0)","v":500},{"$f":"VLOOKUP($B85,Store!$B$6:$AG$308,COLUMN()-1,0)","v":"Heavy"},{"$f":"VLOOKUP($B85,Store!$B$6:$AG$308,COLUMN()-1,0)","v":"dark"},{"$f":"VLOOKUP($B85,Store!$B$6:$AG$308,COLUMN()-1,0)","v":"Second Choice"},{"$f":"VLOOKUP($B85,Store!$B$6:$AG$308,COLUMN()-1,0)","v":"100% cotton"},{"$f":"VLOOKUP($B85,Store!$B$6:$AG$308,COLUMN()-1,0)","v":"100% cotton"},{"$f":"VLOOKUP($B85,Store!$B$6:$AG$308,COLUMN()-1,0)","v":"24/2 - 24/2 - 16/1"},{"$f":"VLOOKUP($B85,Store!$B$6:$AG$308,COLUMN()-1,0)","v":"24/2 - 24/2 - 16/1"},{"$f":"VLOOKUP($B85,Store!$B$6:$AG$308,COLUMN()-1,0)","v":"Fresh"},{"$f":"VLOOKUP($B85,Store!$B$6:$AG$308,COLUMN()-1,0)","v":"Fresh"},{"$f":"VLOOKUP($B85,Store!$B$6:$AG$308,COLUMN()-1,0)","v":0},{"$f":"VLOOKUP($B85,Store!$B$6:$AG$308,COLUMN()-1,0)","v":"yt"},{"$f":"VLOOKUP($B85,Store!$B$6:$AG$308,COLUMN()-1,0)","v":1.4999999999999998},{"$f":"VLOOKUP($B85,Store!$B$6:$AG$308,COLUMN()-1,0)","v":2},{"$f":"VLOOKUP($B85,Store!$B$6:$AG$308,COLUMN()-1,0)","v":1.44},{"$f":"VLOOKUP($B85,Store!$B$6:$AG$308,COLUMN()-1,0)","v":"Jacquard"},{"$f":"VLOOKUP($B85,Store!$B$6:$AG$308,COLUMN()-1,0)","v":"Promotional"},null,null,{"$f":"SUMIFS(Store!$AD$6:$AD$308,Store!$B$6:$B$308,Rassed!B85,Store!$AH$6:$AH$308,\"اضافه\")","v":2},{"$f":"SUMIFS(Store!$AD$6:$AD$308,Store!$B$6:$B$308,Rassed!B85,Store!$AN$6:$AN$308,\"صرف\")","v":2},0]
[null,"0004 - 40",{"$f":"VLOOKUP($B86,Store!$B$6:$AG$308,COLUMN()-1,0)","v":"cvsde"},{"$f":"VLOOKUP($B86,Store!$B$6:$AG$308,COLUMN()-1,0)","v":9111000002},{"$f":"VLOOKUP($B86,Store!$B$6:$AG$308,COLUMN()-1,0)","v":"jfghj"},{"$f":"VLOOKUP($B86,Store!$B$6:$AG$308,COLUMN()-1,0)","v":40},{"$f":"VLOOKUP($B86,Store!$B$6:$AG$308,COLUMN()-1,0)","v":7017},{"$f":"VLOOKUP($B86,Store!$B$6:$AG$308,COLUMN()-1,0)","v":7017},{"$f":"VLOOKUP($B86,Store!$B$6:$AG$308,COLUMN()-1,0)","v":"Bath towel"},{"$f":"VLOOKUP($B86,Store!$B$6:$AG$308,COLUMN()-1,0)","v":"Bath towel"},{"$f":"VLOOKUP($B86,Store!$B$6:$AG$308,COLUMN()-1,0)","v":"Terry"},{"$f":"VLOOKUP($B86,Store!$B$6:$AG$308,COLUMN()-1,0)","v":"Terry"},{"$f":"VLOOKUP($B86,Store!$B$6:$AG$308,COLUMN()-1,0)","v":"90 x 160"},{"$f":"VLOOKUP($B86,Store!$B$6:$AG$308,COLUMN()-1,0)","v":"90 x 160"},{"$f":"VLOOKUP($B86,Store!$B$6:$AG$308,COLUMN()-1,0)","v":720.00000000000011},{"$f":"VLOOKUP($B86,Store!$B$6:$AG$308,COLUMN()-1,0)","v":720},{"$f":"VLOOKUP($B86,Store!$B$6:$AG$308,COLUMN()-1,0)","v":500},{"$f":"VLOOKUP($B86,Store!$B$6:$AG$308,COLUMN()-1,0)","v":"Heavy"},{"$f":"VLOOKUP($B86,Store!$B$6:$AG$308,COLUMN()-1,0)","v":"dark"},{"$f":"VLOOKUP($B86,Store!$B$6:$AG$308,COLUMN()-1,0)","v":"Second Choice"},{"$f":"VLOOKUP($B86,Store!$B$6:$AG$308,COLUMN()-1,0)","v":"100% cotton"},{"$f":"VLOOKUP($B86,Store!$B$6:$AG$308,COLUMN()-1,0)","v":"100% cotton"},{"$f":"VLOOKUP($B86,Store!$B$6:$AG$308,COLUMN()-1,0)","v":"24/2 - 24/2 - 16/1"},{"$f":"VLOOKUP($B86,Store!$B$6:$AG$308,COLUMN()-1,0)","v":"24/2 - 24/2 - 16/1"},{"$f":"VLOOKUP($B86,Store!$B$6:$AG$308,COLUMN()-1,0)","v":"Fresh"},{"$f":"VLOOKUP($B86,Store!$B$6:$AG$308,COLUMN()-1,0)","v":"Fresh"},{"$f":"VLOOKUP($B86,Store!$B$6:$AG$308,COLUMN()-1,0)","v":0},{"$f":"VLOOKUP($B86,Store!$B$6:$AG$308,COLUMN()-1,0)","v":"yt"},{"$f":"VLOOKUP($B86,Store!$B$6:$AG$308,COLUMN()-1,0)","v":3.7499999999999996},{"$f":"VLOOKUP($B86,Store!$B$6:$AG$308,COLUMN()-1,0)","v":5},{"$f":"VLOOKUP($B86,Store!$B$6:$AG$308,COLUMN()-1,0)","v":3.6},{"$f":"VLOOKUP($B86,Store!$B$6:$AG$308,COLUMN()-1,0)","v":"Jacquard"},{"$f":"VLOOKUP($B86,Store!$B$6:$AG$308,COLUMN()-1,0)","v":"Promotional"},null,null,{"$f":"SUMIFS(Store!$AD$6:$AD$308,Store!$B$6:$B$308,Rassed!B86,Store!$AH$6:$AH$308,\"اضافه\")","v":73},{"$f":"SUMIFS(Store!$AD$6:$AD$308,Store!$B$6:$B$308,Rassed!B86,Store!$AN$6:$AN$308,\"صرف\")","v":73},0]
[null,"0005 - 40",{"$f":"VLOOKUP($B87,Store!$B$6:$AG$308,COLUMN()-1,0)","v":"setv"},{"$f":"VLOOKUP($B87,Store!$B$6:$AG$308,COLUMN()-1,0)","v":9111000003},{"$f":"VLOOKUP($B87,Store!$B$6:$AG$308,COLUMN()-1,0)","v":"jfghj"},{"$f":"VLOOKUP($B87,Store!$B$6:$AG$308,COLUMN()-1,0)","v":40},{"$f":"VLOOKUP($B87,Store!$B$6:$AG$308,COLUMN()-1,0)","v":7017},{"$f":"VLOOKUP($B87,Store!$B$6:$AG$308,COLUMN()-1,0)","v":7017},{"$f":"VLOOKUP($B87,Store!$B$6:$AG$308,COLUMN()-1,0)","v":"Bath towel"},{"$f":"VLOOKUP($B87,Store!$B$6:$AG$308,COLUMN()-1,0)","v":"Bath towel"},{"$f":"VLOOKUP($B87,Store!$B$6:$AG$308,COLUMN()-1,0)","v":"Terry"},{"$f":"VLOOKUP($B87,Store!$B$6:$AG$308,COLUMN()-1,0)","v":"Terry"},{"$f":"VLOOKUP($B87,Store!$B$6:$AG$308,COLUMN()-1,0)","v":"90 x 160"},{"$f":"VLOOKUP($B87,Store!$B$6:$AG$308,COLUMN()-1,0)","v":"90 x 160"},{"$f":"VLOOKUP($B87,Store!$B$6:$AG$308,COLUMN()-1,0)","v":720.00000000000011},{"$f":"VLOOKUP($B87,Store!$B$6:$AG$308,COLUMN()-1,0)","v":720},{"$f":"VLOOKUP($B87,Store!$B$6:$AG$308,COLUMN()-1,0)","v":500},{"$f":"VLOOKUP($B87,Store!$B$6:$AG$308,COLUMN()-1,0)","v":"Heavy"},{"$f":"VLOOKUP($B87,Store!$B$6:$AG$308,COLUMN()-1,0)","v":"dark"},{"$f":"VLOOKUP($B87,Store!$B$6:$AG$308,COLUMN()-1,0)","v":"Second Choice"},{"$f":"VLOOKUP($B87,Store!$B$6:$AG$308,COLUMN()-1,0)","v":"100% cotton"},{"$f":"VLOOKUP($B87,Store!$B$6:$AG$308,COLUMN()-1,0)","v":"100% cotton"},{"$f":"VLOOKUP($B87,Store!$B$6:$AG$308,COLUMN()-1,0)","v":"24/2 - 24/2 - 16/1"},{"$f":"VLOOKUP($B87,Store!$B$6:$AG$308,COLUMN()-1,0)","v":"24/2 - 24/2 - 16/1"},{"$f":"VLOOKUP($B87,Store!$B$6:$AG$308,COLUMN()-1,0)","v":"Fresh"},{"$f":"VLOOKUP($B87,Store!$B$6:$AG$308,COLUMN()-1,0)","v":"Fresh"},{"$f":"VLOOKUP($B87,Store!$B$6:$AG$308,COLUMN()-1,0)","v":0},{"$f":"VLOOKUP($B87,Store!$B$6:$AG$308,COLUMN()-1,0)","v":"yt"},{"$f":"VLOOKUP($B87,Store!$B$6:$AG$308,COLUMN()-1,0)","v":1.4999999999999998},{"$f":"VLOOKUP($B87,Store!$B$6:$AG$308,COLUMN()-1,0)","v":2},{"$f":"VLOOKUP($B87,Store!$B$6:$AG$308,COLUMN()-1,0)","v":1.44},{"$f":"VLOOKUP($B87,Store!$B$6:$AG$308,COLUMN()-1,0)","v":"Jacquard"},{"$f":"VLOOKUP($B87,Store!$B$6:$AG$308,COLUMN()-1,0)","v":"Promotional"},null,null,{"$f":"SUMIFS(Store!$AD$6:$AD$308,Store!$B$6:$B$308,Rassed!B87,Store!$AH$6:$AH$308,\"اضافه\")","v":2},{"$f":"SUMIFS(Store!$AD$6:$AD$308,Store!$B$6:$B$308,Rassed!B87,Store!$AN$6:$AN$308,\"صرف\")","v":2},0]
[null,"0006 - 40",{"$f":"VLOOKUP($B88,Store!$B$6:$AG$308,COLUMN()-1,0)","v":"fbdg5yf"},{"$f":"VLOOKUP($B88,Store!$B$6:$AG$308,COLUMN()-1,0)","v":9111000004},{"$f":"VLOOKUP($B88,Store!$B$6:$AG$308,COLUMN()-1,0)","v":"jfghj"},{"$f":"VLOOKUP($B88,Store!$B$6:$AG$308,COLUMN()-1,0)","v":40},{"$f":"VLOOKUP($B88,Store!$B$6:$AG$308,COLUMN()-1,0)","v":7017},{"$f":"VLOOKUP($B88,Store!$B$6:$AG$308,COLUMN()-1,0)","v":7017},{"$f":"VLOOKUP($B88,Store!$B$6:$AG$308,COLUMN()-1,0)","v":"Bath towel"},{"$f":"VLOOKUP($B88,Store!$B$6:$AG$308,COLUMN()-1,0)","v":"Bath towel"},{"$f":"VLOOKUP($B88,Store!$B$6:$AG$308,COLUMN()-1,0)","v":"Terry"},{"$f":"VLOOKUP($B88,Store!$B$6:$AG$308,COLUMN()-1,0)","v":"Terry"},{"$f":"VLOOKUP($B88,Store!$B$6:$AG$308,COLUMN()-1,0)","v":"90 x 160"},{"$f":"VLOOKUP($B88,Store!$B$6:$AG$308,COLUMN()-1,0)","v":"90 x 160"},{"$f":"VLOOKUP($B88,Store!$B$6:$AG$308,COLUMN()-1,0)","v":720.00000000000011},{"$f":"VLOOKUP($B88,Store!$B$6:$AG$308,COLUMN()-1,0)","v":720},{"$f":"VLOOKUP($B88,Store!$B$6:$AG$308,COLUMN()-1,0)","v":500},{"$f":"VLOOKUP($B88,Store!$B$6:$AG$308,COLUMN()-1,0)","v":"Heavy"},{"$f":"VLOOKUP($B88,Store!$B$6:$AG$308,COLUMN()-1,0)","v":"dark"},{"$f":"VLOOKUP($B88,Store!$B$6:$AG$308,COLUMN()-1,0)","v":"Second Choice"},{"$f":"VLOOKUP($B88,Store!$B$6:$AG$308,COLUMN()-1,0)","v":"100% cotton"},{"$f":"VLOOKUP($B88,Store!$B$6:$AG$308,COLUMN()-1,0)","v":"100% cotton"},{"$f":"VLOOKUP($B88,Store!$B$6:$AG$308,COLUMN()-1,0)","v":"24/2 - 24/2 - 16/1"},{"$f":"VLOOKUP($B88,Store!$B$6:$AG$308,COLUMN()-1,0)","v":"24/2 - 24/2 - 16/1"},{"$f":"VLOOKUP($B88,Store!$B$6:$AG$308,COLUMN()-1,0)","v":"Fresh"},{"$f":"VLOOKUP($B88,Store!$B$6:$AG$308,COLUMN()-1,0)","v":"Fresh"},{"$f":"VLOOKUP($B88,Store!$B$6:$AG$308,COLUMN()-1,0)","v":0},{"$f":"VLOOKUP($B88,Store!$B$6:$AG$308,COLUMN()-1,0)","v":"yt"},{"$f":"VLOOKUP($B88,Store!$B$6:$AG$308,COLUMN()-1,0)","v":5.9999999999999991},{"$f":"VLOOKUP($B88,Store!$B$6:$AG$308,COLUMN()-1,0)","v":8},{"$f":"VLOOKUP($B88,Store!$B$6:$AG$308,COLUMN()-1,0)","v":5.76},{"$f":"VLOOKUP($B88,Store!$B$6:$AG$308,COLUMN()-1,0)","v":"Jacquard"},{"$f":"VLOOKUP($B88,Store!$B$6:$AG$308,COLUMN()-1,0)","v":"Promotional"},null,null,{"$f":"SUMIFS(Store!$AD$6:$AD$308,Store!$B$6:$B$308,Rassed!B88,Store!$AH$6:$AH$308,\"اضافه\")","v":8},{"$f":"SUMIFS(Store!$AD$6:$AD$308,Store!$B$6:$B$308,Rassed!B88,Store!$AN$6:$AN$308,\"صرف\")","v":8},0]
[null,"0007 - 40",{"$f":"VLOOKUP($B89,Store!$B$6:$AG$308,COLUMN()-1,0)","v":"ewtwt ef34"},{"$f":"VLOOKUP($B89,Store!$B$6:$AG$308,COLUMN()-1,0)","v":9111000005},{"$f":"VLOOKUP($B89,Store!$B$6:$AG$308,COLUMN()-1,0)","v":"jfghj"},{"$f":"VLOOKUP($B89,Store!$B$6:$AG$308,COLUMN()-1,0)","v":40},{"$f":"VLOOKUP($B89,Store!$B$6:$AG$308,COLUMN()-1,0)","v":7017},{"$f":"VLOOKUP($B89,Store!$B$6:$AG$308,COLUMN()-1,0)","v":7017},{"$f":"VLOOKUP($B89,Store!$B$6:$AG$308,COLUMN()-1,0)","v":"Bath towel"},{"$f":"VLOOKUP($B89,Store!$B$6:$AG$308,COLUMN()-1,0)","v":"Bath towel"},{"$f":"VLOOKUP($B89,Store!$B$6:$AG$308,COLUMN()-1,0)","v":"Terry"},{"$f":"VLOOKUP($B89,Store!$B$6:$AG$308,COLUMN()-1,0)","v":"Terry"},{"$f":"VLOOKUP($B89,Store!$B$6:$AG$308,COLUMN()-1,0)","v":"90 x 160"},{"$f":"VLOOKUP($B89,Store!$B$6:$AG$308,COLUMN()-1,0)","v":"90 x 160"},{"$f":"VLOOKUP($B89,Store!$B$6:$AG$308,COLUMN()-1,0)","v":720.00000000000011},{"$f":"VLOOKUP($B89,Store!$B$6:$AG$308,COLUMN()-1,0)","v":720},{"$f":"VLOOKUP($B89,Store!$B$6:$AG$308,COLUMN()-1,0)","v":500},{"$f":"VLOOKUP($B89,Store!$B$6:$AG$308,COLUMN()-1,0)","v":"Heavy"},{"$f":"VLOOKUP($B89,Store!$B$6:$AG$308,COLUMN()-1,0)","v":"dark"},{"$f":"VLOOKUP($B89,Store!$B$6:$AG$308,COLUMN()-1,0)","v":"Second Choice"},{"$f":"VLOOKUP($B89,Store!$B$6:$AG$308,COLUMN()-1,0)","v":"100% cotton"},{"$f":"VLOOKUP($B89,Store!$B$6:$AG$308,COLUMN()-1,0)","v":"100% cotton"},{"$f":"VLOOKUP($B89,Store!$B$6:$AG$308,COLUMN()-1,0)","v":"24/2 - 24/2 - 16/1"},{"$f":"VLOOKUP($B89,Store!$B$6:$AG$308,COLUMN()-1,0)","v":"24/2 - 24/2 - 16/1"},{"$f":"VLOOKUP($B89,Store!$B$6:$AG$308,COLUMN()-1,0)","v":"Fresh"},{"$f":"VLOOKUP($B89,Store!$B$6:$AG$308,COLUMN()-1,0)","v":"Fresh"},{"$f":"VLOOKUP($B89,Store!$B$6:$AG$308,COLUMN()-1,0)","v":0},{"$f":"VLOOKUP($B89,Store!$B$6:$AG$308,COLUMN()-1,0)","v":"yt"},{"$f":"VLOOKUP($B89,Store!$B$6:$AG$308,COLUMN()-1,0)","v":0.74999999999999989},{"$f":"VLOOKUP($B89,Store!$B$6:$AG$308,COLUMN()-1,0)","v":1},{"$f":"VLOOKUP($B89,Store!$B$6:$AG$308,COLUMN()-1,0)","v":0.72},{"$f":"VLOOKUP($B89,Store!$B$6:$AG$308,COLUMN()-1,0)","v":"Jacquard"},{"$f":"VLOOKUP($B89,Store!$B$6:$AG$308,COLUMN()-1,0)","v":"Promotional"},null,null,{"$f":"SUMIFS(Store!$AD$6:$AD$308,Store!$B$6:$B$308,Rassed!B89,Store!$AH$6:$AH$308,\"اضافه\")","v":1},{"$f":"SUMIFS(Store!$AD$6:$AD$308,Store!$B$6:$B$308,Rassed!B89,Store!$AN$6:$AN$308,\"صرف\")","v":1},0]
[null,"0008 - 40",{"$f":"VLOOKUP($B90,Store!$B$6:$AG$308,COLUMN()-1,0)","v":"gh54t "},{"$f":"VLOOKUP($B90,Store!$B$6:$AG$308,COLUMN()-1,0)","v":9111000006},{"$f":"VLOOKUP($B90,Store!$B$6:$AG$308,COLUMN()-1,0)","v":"jfghj"},{"$f":"VLOOKUP($B90,Store!$B$6:$AG$308,COLUMN()-1,0)","v":40},{"$f":"VLOOKUP($B90,Store!$B$6:$AG$308,COLUMN()-1,0)","v":7017},{"$f":"VLOOKUP($B90,Store!$B$6:$AG$308,COLUMN()-1,0)","v":7017},{"$f":"VLOOKUP($B90,Store!$B$6:$AG$308,COLUMN()-1,0)","v":"Bath towel"},{"$f":"VLOOKUP($B90,Store!$B$6:$AG$308,COLUMN()-1,0)","v":"Bath towel"},{"$f":"VLOOKUP($B90,Store!$B$6:$AG$308,COLUMN()-1,0)","v":"Terry"},{"$f":"VLOOKUP($B90,Store!$B$6:$AG$308,COLUMN()-1,0)","v":"Terry"},{"$f":"VLOOKUP($B90,Store!$B$6:$AG$308,COLUMN()-1,0)","v":"90 x 160"},{"$f":"VLOOKUP($B90,Store!$B$6:$AG$308,COLUMN()-1,0)","v":"90 x 160"},{"$f":"VLOOKUP($B90,Store!$B$6:$AG$308,COLUMN()-1,0)","v":720.00000000000011},{"$f":"VLOOKUP($B90,Store!$B$6:$AG$308,COLUMN()-1,0)","v":720},{"$f":"VLOOKUP($B90,Store!$B$6:$AG$308,COLUMN()-1,0)","v":500},{"$f":"VLOOKUP($B90,Store!$B$6:$AG$308,COLUMN()-1,0)","v":"Heavy"},{"$f":"VLOOKUP($B90,Store!$B$6:$AG$308,COLUMN()-1,0)","v":"dark"},{"$f":"VLOOKUP($B90,Store!$B$6:$AG$308,COLUMN()-1,0)","v":"Second Choice"},{"$f":"VLOOKUP($B90,Store!$B$6:$AG$308,COLUMN()-1,0)","v":"100% cotton"},{"$f":"VLOOKUP($B90,Store!$B$6:$AG$308,COLUMN()-1,0)","v":"100% cotton"},{"$f":"VLOOKUP($B90,Store!$B$6:$AG$308,COLUMN()-1,0)","v":"24/2 - 24/2 - 16/1"},{"$f":"VLOOKUP($B90,Store!$B$6:$AG$308,COLUMN()-1,0)","v":"24/2 - 24/2 - 16/1"},{"$f":"VLOOKUP($B90,Store!$B$6:$AG$308,COLUMN()-1,0)","v":"Fresh"},{"$f":"VLOOKUP($B90,Store!$B$6:$AG$308,COLUMN()-1,0)","v":"Fresh"},{"$f":"VLOOKUP($B90,Store!$B$6:$AG$308,COLUMN()-1,0)","v":0},{"$f":"VLOOKUP($B90,Store!$B$6:$AG$308,COLUMN()-1,0)","v":"yt"},{"$f":"VLOOKUP($B90,Store!$B$6:$AG$308,COLUMN()-1,0)","v":4.5},{"$f":"VLOOKUP($B90,Store!$B$6:$AG$308,COLUMN()-1,0)","v":6},{"$f":"VLOOKUP($B90,Store!$B$6:$AG$308,COLUMN()-1,0)","v":4.32},{"$f":"VLOOKUP($B90,Store!$B$6:$AG$308,COLUMN()-1,0)","v":"Jacquard"},{"$f":"VLOOKUP($B90,Store!$B$6:$AG$308,COLUMN()-1,0)","v":"Promotional"},null,null,{"$f":"SUMIFS(Store!$AD$6:$AD$308,Store!$B$6:$B$308,Rassed!B90,Store!$AH$6:$AH$308,\"اضافه\")","v":60},{"$f":"SUMIFS(Store!$AD$6:$AD$308,Store!$B$6:$B$308,Rassed!B90,Store!$AN$6:$AN$308,\"صرف\")","v":60},0]
[null,"0009 - 40",{"$f":"VLOOKUP($B91,Store!$B$6:$AG$308,COLUMN()-1,0)","v":"r4yftgwt4"},{"$f":"VLOOKUP($B91,Store!$B$6:$AG$308,COLUMN()-1,0)","v":9111000007},{"$f":"VLOOKUP($B91,Store!$B$6:$AG$308,COLUMN()-1,0)","v":"g"},{"$f":"VLOOKUP($B91,Store!$B$6:$AG$308,COLUMN()-1,0)","v":40},{"$f":"VLOOKUP($B91,Store!$B$6:$AG$308,COLUMN()-1,0)","v":7017},{"$f":"VLOOKUP($B91,Store!$B$6:$AG$308,COLUMN()-1,0)","v":7017},{"$f":"VLOOKUP($B91,Store!$B$6:$AG$308,COLUMN()-1,0)","v":"Bath towel"},{"$f":"VLOOKUP($B91,Store!$B$6:$AG$308,COLUMN()-1,0)","v":"Bath towel"},{"$f":"VLOOKUP($B91,Store!$B$6:$AG$308,COLUMN()-1,0)","v":"Terry"},{"$f":"VLOOKUP($B91,Store!$B$6:$AG$308,COLUMN()-1,0)","v":"Terry"},{"$f":"VLOOKUP($B91,Store!$B$6:$AG$308,COLUMN()-1,0)","v":"90 x 160"},{"$f":"VLOOKUP($B91,Store!$B$6:$AG$308,COLUMN()-1,0)","v":"90 x 160"},{"$f":"VLOOKUP($B91,Store!$B$6:$AG$308,COLUMN()-1,0)","v":720.00000000000011},{"$f":"VLOOKUP($B91,Store!$B$6:$AG$308,COLUMN()-1,0)","v":720},{"$f":"VLOOKUP($B91,Store!$B$6:$AG$308,COLUMN()-1,0)","v":500},{"$f":"VLOOKUP($B91,Store!$B$6:$AG$308,COLUMN()-1,0)","v":"Heavy"},{"$f":"VLOOKUP($B91,Store!$B$6:$AG$308,COLUMN()-1,0)","v":"dark"},{"$f":"VLOOKUP($B91,Store!$B$6:$AG$308,COLUMN()-1,0)","v":"Second Choice"},{"$f":"VLOOKUP($B91,Store!$B$6:$AG$308,COLUMN()-1,0)","v":"100% cotton"},{"$f":"VLOOKUP($B91,Store!$B$6:$AG$308,COLUMN()-1,0)","v":"100% cotton"},{"$f":"VLOOKUP($B91,Store!$B$6:$AG$308,COLUMN()-1,0)","v":"24/2 - 24/2 - 16/1"},{"$f":"VLOOKUP($B91,Store!$B$6:$AG$308,COLUMN()-1,0)","v":"24/2 - 24/2 - 16/1"},{"$f":"VLOOKUP($B91,Store!$B$6:$AG$308,COLUMN()-1,0)","v":"Fresh"},{"$f":"VLOOKUP($B91,Store!$B$6:$AG$308,COLUMN()-1,0)","v":"Fresh"},{"$f":"VLOOKUP($B91,Store!$B$6:$AG$308,COLUMN()-1,0)","v":0},{"$f":"VLOOKUP($B91,Store!$B$6:$AG$308,COLUMN()-1,0)","v":"g"},{"$f":"VLOOKUP($B91,Store!$B$6:$AG$308,COLUMN()-1,0)","v":1.4999999999999998},{"$f":"VLOOKUP($B91,Store!$B$6:$AG$308,COLUMN()-1,0)","v":2},{"$f":"VLOOKUP($B91,Store!$B$6:$AG$308,COLUMN()-1,0)","v":1.44},{"$f":"VLOOKUP($B91,Store!$B$6:$AG$308,COLUMN()-1,0)","v":"Jacquard"},{"$f":"VLOOKUP($B91,Store!$B$6:$AG$308,COLUMN()-1,0)","v":"Promotional"},null,null,{"$f":"SUMIFS(Store!$AD$6:$AD$308,Store!$B$6:$B$308,Rassed!B91,Store!$AH$6:$AH$308,\"اضافه\")","v":2},{"$f":"SUMIFS(Store!$AD$6:$AD$308,Store!$B$6:$B$308,Rassed!B91,Store!$AN$6:$AN$308,\"صرف\")","v":2},0]
[null,"0010 - 40",{"$f":"VLOOKUP($B92,Store!$B$6:$AG$308,COLUMN()-1,0)","v":"dsty5r"},{"$f":"VLOOKUP($B92,Store!$B$6:$AG$308,COLUMN()-1,0)","v":9111000008},{"$f":"VLOOKUP($B92,Store!$B$6:$AG$308,COLUMN()-1,0)","v":"g"},{"$f":"VLOOKUP($B92,Store!$B$6:$AG$308,COLUMN()-1,0)","v":40},{"$f":"VLOOKUP($B92,Store!$B$6:$AG$308,COLUMN()-1,0)","v":7017},{"$f":"VLOOKUP($B92,Store!$B$6:$AG$308,COLUMN()-1,0)","v":7017},{"$f":"VLOOKUP($B92,Store!$B$6:$AG$308,COLUMN()-1,0)","v":"Bath towel"},{"$f":"VLOOKUP($B92,Store!$B$6:$AG$308,COLUMN()-1,0)","v":"Bath towel"},{"$f":"VLOOKUP($B92,Store!$B$6:$AG$308,COLUMN()-1,0)","v":"Terry"},{"$f":"VLOOKUP($B92,Store!$B$6:$AG$308,COLUMN()-1,0)","v":"Terry"},{"$f":"VLOOKUP($B92,Store!$B$6:$AG$308,COLUMN()-1,0)","v":"90 x 160"},{"$f":"VLOOKUP($B92,Store!$B$6:$AG$308,COLUMN()-1,0)","v":"90 x 160"},{"$f":"VLOOKUP($B92,Store!$B$6:$AG$308,COLUMN()-1,0)","v":720.00000000000011},{"$f":"VLOOKUP($B92,Store!$B$6:$AG$308,COLUMN()-1,0)","v":720},{"$f":"VLOOKUP($B92,Store!$B$6:$AG$308,COLUMN()-1,0)","v":500},{"$f":"VLOOKUP($B92,Store!$B$6:$AG$308,COLUMN()-1,0)","v":"Heavy"},{"$f":"VLOOKUP($B92,Store!$B$6:$AG$308,COLUMN()-1,0)","v":"dark"},{"$f":"VLOOKUP($B92,Store!$B$6:$AG$308,COLUMN()-1,0)","v":"Second Choice"},{"$f":"VLOOKUP($B92,Store!$B$6:$AG$308,COLUMN()-1,0)","v":"100% cotton"},{"$f":"VLOOKUP($B92,Store!$B$6:$AG$308,COLUMN()-1,0)","v":"100% cotton"},{"$f":"VLOOKUP($B92,Store!$B$6:$AG$308,COLUMN()-1,0)","v":"24/2 - 24/2 - 16/1"},{"$f":"VLOOKUP($B92,Store!$B$6:$AG$308,COLUMN()-1,0)","v":"24/2 - 24/2 - 16/1"},{"$f":"VLOOKUP($B92,Store!$B$6:$AG$308,COLUMN()-1,0)","v":"Fresh"},{"$f":"VLOOKUP($B92,Store!$B$6:$AG$308,COLUMN()-1,0)","v":"Fresh"},{"$f":"VLOOKUP($B92,Store!$B$6:$AG$308,COLUMN()-1,0)","v":0},{"$f":"VLOOKUP($B92,Store!$B$6:$AG$308,COLUMN()-1,0)","v":"g"},{"$f":"VLOOKUP($B92,Store!$B$6:$AG$308,COLUMN()-1,0)","v":1.4999999999999998},{"$f":"VLOOKUP($B92,Store!$B$6:$AG$308,COLUMN()-1,0)","v":2},{"$f":"VLOOKUP($B92,Store!$B$6:$AG$308,COLUMN()-1,0)","v":1.44},{"$f":"VLOOKUP($B92,Store!$B$6:$AG$308,COLUMN()-1,0)","v":"Jacquard"},{"$f":"VLOOKUP($B92,Store!$B$6:$AG$308,COLUMN()-1,0)","v":"Promotional"},null,null,{"$f":"SUMIFS(Store!$AD$6:$AD$308,Store!$B$6:$B$308,Rassed!B92,Store!$AH$6:$AH$308,\"اضافه\")","v":2},{"$f":"SUMIFS(Store!$AD$6:$AD$308,Store!$B$6:$B$308,Rassed!B92,Store!$AN$6:$AN$308,\"صرف\")","v":2},0]
[null,"0001 - 80",{"$f":"VLOOKUP($B93,Store!$B$6:$AG$308,COLUMN()-1,0)","v":"fgfdbg"},{"$f":"VLOOKUP($B93,Store!$B$6:$AG$308,COLUMN()-1,0)","v":9114000011},{"$f":"VLOOKUP($B93,Store!$B$6:$AG$308,COLUMN()-1,0)","v":"ءبل"},{"$f":"VLOOKUP($B93,Store!$B$6:$AG$308,COLUMN()-1,0)","v":80},{"$f":"VLOOKUP($B93,Store!$B$6:$AG$308,COLUMN()-1,0)","v":7018},{"$f":"VLOOKUP($B93,Store!$B$6:$AG$308,COLUMN()-1,0)","v":7018},{"$f":"VLOOKUP($B93,Store!$B$6:$AG$308,COLUMN()-1,0)","v":"Kitchen Towel"},{"$f":"VLOOKUP($B93,Store!$B$6:$AG$308,COLUMN()-1,0)","v":"Kitchen Towel"},{"$f":"VLOOKUP($B93,Store!$B$6:$AG$308,COLUMN()-1,0)","v":"Flat"},{"$f":"VLOOKUP($B93,Store!$B$6:$AG$308,COLUMN()-1,0)","v":"Flat"},{"$f":"VLOOKUP($B93,Store!$B$6:$AG$308,COLUMN()-1,0)","v":"50 X 70"},{"$f":"VLOOKUP($B93,Store!$B$6:$AG$308,COLUMN()-1,0)","v":"50 X 70"},{"$f":"VLOOKUP($B93,Store!$B$6:$AG$308,COLUMN()-1,0)","v":70},{"$f":"VLOOKUP($B93,Store!$B$6:$AG$308,COLUMN()-1,0)","v":70},{"$f":"VLOOKUP($B93,Store!$B$6:$AG$308,COLUMN()-1,0)","v":200},{"$f":"VLOOKUP($B93,Store!$B$6:$AG$308,COLUMN()-1,0)","v":"Very Light weight"},{"$f":"VLOOKUP($B93,Store!$B$6:$AG$308,COLUMN()-1,0)","v":"dark"},{"$f":"VLOOKUP($B93,Store!$B$6:$AG$308,COLUMN()-1,0)","v":"Second Choice"},{"$f":"VLOOKUP($B93,Store!$B$6:$AG$308,COLUMN()-1,0)","v":"100% cotton"},{"$f":"VLOOKUP($B93,Store!$B$6:$AG$308,COLUMN()-1,0)","v":"100% cotton"},{"$f":"VLOOKUP($B93,Store!$B$6:$AG$308,COLUMN()-1,0)","v":"24/2 - 16/1"},{"$f":"VLOOKUP($B93,Store!$B$6:$AG$308,COLUMN()-1,0)","v":"24/2 - 16/1"},{"$f":"VLOOKUP($B93,Store!$B$6:$AG$308,COLUMN()-1,0)","v":"Fresh"},{"$f":"VLOOKUP($B93,Store!$B$6:$AG$308,COLUMN()-1,0)","v":"Fresh"},{"$f":"VLOOKUP($B93,Store!$B$6:$AG$308,COLUMN()-1,0)","v":0},{"$f":"VLOOKUP($B93,Store!$B$6:$AG$308,COLUMN()-1,0)","v":"بلييب"},{"$f":"VLOOKUP($B93,Store!$B$6:$AG$308,COLUMN()-1,0)","v":2.0999999999999996},{"$f":"VLOOKUP($B93,Store!$B$6:$AG$308,COLUMN()-1,0)","v":30},{"$f":"VLOOKUP($B93,Store!$B$6:$AG$308,COLUMN()-1,0)","v":2.1},{"$f":"VLOOKUP($B93,Store!$B$6:$AG$308,COLUMN()-1,0)","v":"Dobby"},{"$f":"VLOOKUP($B93,Store!$B$6:$AG$308,COLUMN()-1,0)","v":"Normal"},null,null,{"$f":"SUMIFS(Store!$AD$6:$AD$308,Store!$B$6:$B$308,Rassed!B93,Store!$AH$6:$AH$308,\"اضافه\")","v":430},{"$f":"SUMIFS(Store!$AD$6:$AD$308,Store!$B$6:$B$308,Rassed!B93,Store!$AN$6:$AN$308,\"صرف\")","v":30},400]
[null,"0002 - 80",{"$f":"VLOOKUP($B94,Store!$B$6:$AG$308,COLUMN()-1,0)","v":"sag"},{"$f":"VLOOKUP($B94,Store!$B$6:$AG$308,COLUMN()-1,0)","v":9114000012},{"$f":"VLOOKUP($B94,Store!$B$6:$AG$308,COLUMN()-1,0)","v":"ءبل"},{"$f":"VLOOKUP($B94,Store!$B$6:$AG$308,COLUMN()-1,0)","v":80},{"$f":"VLOOKUP($B94,Store!$B$6:$AG$308,COLUMN()-1,0)","v":7018},{"$f":"VLOOKUP($B94,Store!$B$6:$AG$308,COLUMN()-1,0)","v":7018},{"$f":"VLOOKUP($B94,Store!$B$6:$AG$308,COLUMN()-1,0)","v":"Kitchen Towel"},{"$f":"VLOOKUP($B94,Store!$B$6:$AG$308,COLUMN()-1,0)","v":"Kitchen Towel"},{"$f":"VLOOKUP($B94,Store!$B$6:$AG$308,COLUMN()-1,0)","v":"Flat"},{"$f":"VLOOKUP($B94,Store!$B$6:$AG$308,COLUMN()-1,0)","v":"Flat"},{"$f":"VLOOKUP($B94,Store!$B$6:$AG$308,COLUMN()-1,0)","v":"50 X 70"},{"$f":"VLOOKUP($B94,Store!$B$6:$AG$308,COLUMN()-1,0)","v":"50 X 70"},{"$f":"VLOOKUP($B94,Store!$B$6:$AG$308,COLUMN()-1,0)","v":70},{"$f":"VLOOKUP($B94,Store!$B$6:$AG$308,COLUMN()-1,0)","v":70},{"$f":"VLOOKUP($B94,Store!$B$6:$AG$308,COLUMN()-1,0)","v":200},{"$f":"VLOOKUP($B94,Store!$B$6:$AG$308,COLUMN()-1,0)","v":"Very Light weight"},{"$f":"VLOOKUP($B94,Store!$B$6:$AG$308,COLUMN()-1,0)","v":"dark"},{"$f":"VLOOKUP($B94,Store!$B$6:$AG$308,COLUMN()-1,0)","v":"Second Choice"},{"$f":"VLOOKUP($B94,Store!$B$6:$AG$308,COLUMN()-1,0)","v":"100% cotton"},{"$f":"VLOOKUP($B94,Store!$B$6:$AG$308,COLUMN()-1,0)","v":"100% cotton"},{"$f":"VLOOKUP($B94,Store!$B$6:$AG$308,COLUMN()-1,0)","v":"24/2 - 16/1"},{"$f":"VLOOKUP($B94,Store!$B$6:$AG$308,COLUMN()-1,0)","v":"24/2 - 16/1"},{"$f":"VLOOKUP($B94,Store!$B$6:$AG$308,COLUMN()-1,0)","v":"Fresh"},{"$f":"VLOOKUP($B94,Store!$B$6:$AG$308,COLUMN()-1,0)","v":"Fresh"},{"$f":"VLOOKUP($B94,Store!$B$6:$AG$308,COLUMN()-1,0)","v":0},{"$f":"VLOOKUP($B94,Store!$B$6:$AG$308,COLUMN()-1,0)","v":"بلييب"},{"$f":"VLOOKUP($B94,Store!$B$6:$AG$308,COLUMN()-1,0)","v":2.7999999999999994},{"$f":"VLOOKUP($B94,Store!$B$6:$AG$308,COLUMN()-1,0)","v":40},{"$f":"VLOOKUP($B94,Store!$B$6:$AG$308,COLUMN()-1,0)","v":2.8},{"$f":"VLOOKUP($B94,Store!$B$6:$AG$308,COLUMN()-1,0)","v":"Jacquard"},{"$f":"VLOOKUP($B94,Store!$B$6:$AG$308,COLUMN()-1,0)","v":"Promotional"},null,null,{"$f":"SUMIFS(Store!$AD$6:$AD$308,Store!$B$6:$B$308,Rassed!B94,Store!$AH$6:$AH$308,\"اضافه\")","v":40},{"$f":"SUMIFS(Store!$AD$6:$AD$308,Store!$B$6:$B$308,Rassed!B94,Store!$AN$6:$AN$308,\"صرف\")","v":40},0]
[null,"0003 - 80",{"$f":"VLOOKUP($B95,Store!$B$6:$AG$308,COLUMN()-1,0)","v":"sdfsdfs"},{"$f":"VLOOKUP($B95,Store!$B$6:$AG$308,COLUMN()-1,0)","v":9114000013},{"$f":"VLOOKUP($B95,Store!$B$6:$AG$308,COLUMN()-1,0)","v":"ءبل"},{"$f":"VLOOKUP($B95,Store!$B$6:$AG$308,COLUMN()-1,0)","v":80},{"$f":"VLOOKUP($B95,Store!$B$6:$AG$308,COLUMN()-1,0)","v":7018},{"$f":"VLOOKUP($B95,Store!$B$6:$AG$308,COLUMN()-1,0)","v":7018},{"$f":"VLOOKUP($B95,Store!$B$6:$AG$308,COLUMN()-1,0)","v":"Kitchen Towel"},{"$f":"VLOOKUP($B95,Store!$B$6:$AG$308,COLUMN()-1,0)","v":"Kitchen Towel"},{"$f":"VLOOKUP($B95,Store!$B$6:$AG$308,COLUMN()-1,0)","v":"Flat"},{"$f":"VLOOKUP($B95,Store!$B$6:$AG$308,COLUMN()-1,0)","v":"Flat"},{"$f":"VLOOKUP($B95,Store!$B$6:$AG$308,COLUMN()-1,0)","v":"50 X 70"},{"$f":"VLOOKUP($B95,Store!$B$6:$AG$308,COLUMN()-1,0)","v":"50 X 70"},{"$f":"VLOOKUP($B95,Store!$B$6:$AG$308,COLUMN()-1,0)","v":70},{"$f":"VLOOKUP($B95,Store!$B$6:$AG$308,COLUMN()-1,0)","v":70},{"$f":"VLOOKUP($B95,Store!$B$6:$AG$308,COLUMN()-1,0)","v":200},{"$f":"VLOOKUP($B95,Store!$B$6:$AG$308,COLUMN()-1,0)","v":"Very Light weight"},{"$f":"VLOOKUP($B95,Store!$B$6:$AG$308,COLUMN()-1,0)","v":"dark"},{"$f":"VLOOKUP($B95,Store!$B$6:$AG$308,COLUMN()-1,0)","v":"Second Choice"},{"$f":"VLOOKUP($B95,Store!$B$6:$AG$308,COLUMN()-1,0)","v":"100% cotton"},{"$f":"VLOOKUP($B95,Store!$B$6:$AG$308,COLUMN()-1,0)","v":"100% cotton"},{"$f":"VLOOKUP($B95,Store!$B$6:$AG$308,COLUMN()-1,0)","v":"24/2 - 16/1"},{"$f":"VLOOKUP($B95,Store!$B$6:$AG$308,COLUMN()-1,0)","v":"24/2 - 16/1"},{"$f":"VLOOKUP($B95,Store!$B$6:$AG$308,COLUMN()-1,0)","v":"Fresh"},{"$f":"VLOOKUP($B95,Store!$B$6:$AG$308,COLUMN()-1,0)","v":"Fresh"},{"$f":"VLOOKUP($B95,Store!$B$6:$AG$308,COLUMN()-1,0)","v":0},{"$f":"VLOOKUP($B95,Store!$B$6:$AG$308,COLUMN()-1,0)","v":"بلييب"},{"$f":"VLOOKUP($B95,Store!$B$6:$AG$308,COLUMN()-1,0)","v":3.4999999999999996},{"$f":"VLOOKUP($B95,Store!$B$6:$AG$308,COLUMN()-1,0)","v":50},{"$f":"VLOOKUP($B95,Store!$B$6:$AG$308,COLUMN()-1,0)","v":3.5},{"$f":"VLOOKUP($B95,Store!$B$6:$AG$308,COLUMN()-1,0)","v":"Jacquard"},{"$f":"VLOOKUP($B95,Store!$B$6:$AG$308,COLUMN()-1,0)","v":"Normal"},null,null,{"$f":"SUMIFS(Store!$AD$6:$AD$308,Store!$B$6:$B$308,Rassed!B95,Store!$AH$6:$AH$308,\"اضافه\")","v":50},{"$f":"SUMIFS(Store!$AD$6:$AD$308,Store!$B$6:$B$308,Rassed!B95,Store!$AN$6:$AN$308,\"صرف\")","v":50},0]
[null,"0004 - 80",{"$f":"VLOOKUP($B96,Store!$B$6:$AG$308,COLUMN()-1,0)","v":"sdfgsd"},{"$f":"VLOOKUP($B96,Store!$B$6:$AG$308,COLUMN()-1,0)","v":9114000014},{"$f":"VLOOKUP($B96,Store!$B$6:$AG$308,COLUMN()-1,0)","v":"ءبل"},{"$f":"VLOOKUP($B96,Store!$B$6:$AG$308,COLUMN()-1,0)","v":80},{"$f":"VLOOKUP($B96,Store!$B$6:$AG$308,COLUMN()-1,0)","v":7018},{"$f":"VLOOKUP($B96,Store!$B$6:$AG$308,COLUMN()-1,0)","v":7018},{"$f":"VLOOKUP($B96,Store!$B$6:$AG$308,COLUMN()-1,0)","v":"Kitchen Towel"},{"$f":"VLOOKUP($B96,Store!$B$6:$AG$308,COLUMN()-1,0)","v":"Kitchen Towel"},{"$f":"VLOOKUP($B96,Store!$B$6:$AG$308,COLUMN()-1,0)","v":"Flat"},{"$f":"VLOOKUP($B96,Store!$B$6:$AG$308,COLUMN()-1,0)","v":"Flat"},{"$f":"VLOOKUP($B96,Store!$B$6:$AG$308,COLUMN()-1,0)","v":"50 X 70"},{"$f":"VLOOKUP($B96,Store!$B$6:$AG$308,COLUMN()-1,0)","v":"50 X 70"},{"$f":"VLOOKUP($B96,Store!$B$6:$AG$308,COLUMN()-1,0)","v":70},{"$f":"VLOOKUP($B96,Store!$B$6:$AG$308,COLUMN()-1,0)","v":70},{"$f":"VLOOKUP($B96,Store!$B$6:$AG$308,COLUMN()-1,0)","v":200},{"$f":"VLOOKUP($B96,Store!$B$6:$AG$308,COLUMN()-1,0)","v":"Very Light weight"},{"$f":"VLOOKUP($B96,Store!$B$6:$AG$308,COLUMN()-1,0)","v":"dark"},{"$f":"VLOOKUP($B96,Store!$B$6:$AG$308,COLUMN()-1,0)","v":"Second Choice"},{"$f":"VLOOKUP($B96,Store!$B$6:$AG$308,COLUMN()-1,0)","v":"100% cotton"},{"$f":"VLOOKUP($B96,Store!$B$6:$AG$308,COLUMN()-1,0)","v":"100% cotton"},{"$f":"VLOOKUP($B96,Store!$B$6:$AG$308,COLUMN()-1,0)","v":"24/2 - 16/1"},{"$f":"VLOOKUP($B96,Store!$B$6:$AG$308,COLUMN()-1,0)","v":"24/2 - 16/1"},{"$f":"VLOOKUP($B96,Store!$B$6:$AG$308,COLUMN()-1,0)","v":"Fresh"},{"$f":"VLOOKUP($B96,Store!$B$6:$AG$308,COLUMN()-1,0)","v":"Fresh"},{"$f":"VLOOKUP($B96,Store!$B$6:$AG$308,COLUMN()-1,0)","v":0},{"$f":"VLOOKUP($B96,Store!$B$6:$AG$308,COLUMN()-1,0)","v":"بلييب"},{"$f":"VLOOKUP($B96,Store!$B$6:$AG$308,COLUMN()-1,0)","v":1.3999999999999997},{"$f":"VLOOKUP($B96,Store!$B$6:$AG$308,COLUMN()-1,0)","v":20},{"$f":"VLOOKUP($B96,Store!$B$6:$AG$308,COLUMN()-1,0)","v":1.4},{"$f":"VLOOKUP($B96,Store!$B$6:$AG$308,COLUMN()-1,0)","v":"Jacquard"},{"$f":"VLOOKUP($B96,Store!$B$6:$AG$308,COLUMN()-1,0)","v":"Normal"},null,null,{"$f":"SUMIFS(Store!$AD$6:$AD$308,Store!$B$6:$B$308,Rassed!B96,Store!$AH$6:$AH$308,\"اضافه\")","v":20},{"$f":"SUMIFS(Store!$AD$6:$AD$308,Store!$B$6:$B$308,Rassed!B96,Store!$AN$6:$AN$308,\"صرف\")","v":20},0]
[null,"0005 - 80",{"$f":"VLOOKUP($B97,Store!$B$6:$AG$308,COLUMN()-1,0)","v":"sdfsf"},{"$f":"VLOOKUP($B97,Store!$B$6:$AG$308,COLUMN()-1,0)","v":9114000015},{"$f":"VLOOKUP($B97,Store!$B$6:$AG$308,COLUMN()-1,0)","v":"ءبل"},{"$f":"VLOOKUP($B97,Store!$B$6:$AG$308,COLUMN()-1,0)","v":80},{"$f":"VLOOKUP($B97,Store!$B$6:$AG$308,COLUMN()-1,0)","v":7018},{"$f":"VLOOKUP($B97,Store!$B$6:$AG$308,COLUMN()-1,0)","v":7018},{"$f":"VLOOKUP($B97,Store!$B$6:$AG$308,COLUMN()-1,0)","v":"Kitchen Towel"},{"$f":"VLOOKUP($B97,Store!$B$6:$AG$308,COLUMN()-1,0)","v":"Kitchen Towel"},{"$f":"VLOOKUP($B97,Store!$B$6:$AG$308,COLUMN()-1,0)","v":"Flat"},{"$f":"VLOOKUP($B97,Store!$B$6:$AG$308,COLUMN()-1,0)","v":"Flat"},{"$f":"VLOOKUP($B97,Store!$B$6:$AG$308,COLUMN()-1,0)","v":"50 X 70"},{"$f":"VLOOKUP($B97,Store!$B$6:$AG$308,COLUMN()-1,0)","v":"50 X 70"},{"$f":"VLOOKUP($B97,Store!$B$6:$AG$308,COLUMN()-1,0)","v":70},{"$f":"VLOOKUP($B97,Store!$B$6:$AG$308,COLUMN()-1,0)","v":70},{"$f":"VLOOKUP($B97,Store!$B$6:$AG$308,COLUMN()-1,0)","v":200},{"$f":"VLOOKUP($B97,Store!$B$6:$AG$308,COLUMN()-1,0)","v":"Very Light weight"},{"$f":"VLOOKUP($B97,Store!$B$6:$AG$308,COLUMN()-1,0)","v":"dark"},{"$f":"VLOOKUP($B97,Store!$B$6:$AG$308,COLUMN()-1,0)","v":"Second Choice"},{"$f":"VLOOKUP($B97,Store!$B$6:$AG$308,COLUMN()-1,0)","v":"100% cotton"},{"$f":"VLOOKUP($B97,Store!$B$6:$AG$308,COLUMN()-1,0)","v":"100% cotton"},{"$f":"VLOOKUP($B97,Store!$B$6:$AG$308,COLUMN()-1,0)","v":"24/2 - 16/1"},{"$f":"VLOOKUP($B97,Store!$B$6:$AG$308,COLUMN()-1,0)","v":"24/2 - 16/1"},{"$f":"VLOOKUP($B97,Store!$B$6:$AG$308,COLUMN()-1,0)","v":"Fresh"},{"$f":"VLOOKUP($B97,Store!$B$6:$AG$308,COLUMN()-1,0)","v":"Fresh"},{"$f":"VLOOKUP($B97,Store!$B$6:$AG$308,COLUMN()-1,0)","v":0},{"$f":"VLOOKUP($B97,Store!$B$6:$AG$308,COLUMN()-1,0)","v":"بلييب"},{"$f":"VLOOKUP($B97,Store!$B$6:$AG$308,COLUMN()-1,0)","v":2.7999999999999994},{"$f":"VLOOKUP($B97,Store!$B$6:$AG$308,COLUMN()-1,0)","v":40},{"$f":"VLOOKUP($B97,Store!$B$6:$AG$308,COLUMN()-1,0)","v":2.8},{"$f":"VLOOKUP($B97,Store!$B$6:$AG$308,COLUMN()-1,0)","v":"Jacquard"},{"$f":"VLOOKUP($B97,Store!$B$6:$AG$308,COLUMN()-1,0)","v":"Normal"},null,null,{"$f":"SUMIFS(Store!$AD$6:$AD$308,Store!$B$6:$B$308,Rassed!B97,Store!$AH$6:$AH$308,\"اضافه\")","v":40},{"$f":"SUMIFS(Store!$AD$6:$AD$308,Store!$B$6:$B$308,Rassed!B97,Store!$AN$6:$AN$308,\"صرف\")","v":40},0]
[null,"0006 - 80",{"$f":"VLOOKUP($B98,Store!$B$6:$AG$308,COLUMN()-1,0)","v":"sdfdsfew"},{"$f":"VLOOKUP($B98,Store!$B$6:$AG$308,COLUMN()-1,0)","v":9114000016},{"$f":"VLOOKUP($B98,Store!$B$6:$AG$308,COLUMN()-1,0)","v":"ءبل"},{"$f":"VLOOKUP($B98,Store!$B$6:$AG$308,COLUMN()-1,0)","v":80},{"$f":"VLOOKUP($B98,Store!$B$6:$AG$308,COLUMN()-1,0)","v":7018},{"$f":"VLOOKUP($B98,Store!$B$6:$AG$308,COLUMN()-1,0)","v":7018},{"$f":"VLOOKUP($B98,Store!$B$6:$AG$308,COLUMN()-1,0)","v":"Kitchen Towel"},{"$f":"VLOOKUP($B98,Store!$B$6:$AG$308,COLUMN()-1,0)","v":"Kitchen Towel"},{"$f":"VLOOKUP($B98,Store!$B$6:$AG$308,COLUMN()-1,0)","v":"Flat"},{"$f":"VLOOKUP($B98,Store!$B$6:$AG$308,COLUMN()-1,0)","v":"Flat"},{"$f":"VLOOKUP($B98,Store!$B$6:$AG$308,COLUMN()-1,0)","v":"50 X 70"},{"$f":"VLOOKUP($B98,Store!$B$6:$AG$308,COLUMN()-1,0)","v":"50 X 70"},{"$f":"VLOOKUP($B98,Store!$B$6:$AG$308,COLUMN()-1,0)","v":70},{"$f":"VLOOKUP($B98,Store!$B$6:$AG$308,COLUMN()-1,0)","v":70},{"$f":"VLOOKUP($B98,Store!$B$6:$AG$308,COLUMN()-1,0)","v":200},{"$f":"VLOOKUP($B98,Store!$B$6:$AG$308,COLUMN()-1,0)","v":"Very Light weight"},{"$f":"VLOOKUP($B98,Store!$B$6:$AG$308,COLUMN()-1,0)","v":"dark"},{"$f":"VLOOKUP($B98,Store!$B$6:$AG$308,COLUMN()-1,0)","v":"Second Choice"},{"$f":"VLOOKUP($B98,Store!$B$6:$AG$308,COLUMN()-1,0)","v":"100% cotton"},{"$f":"VLOOKUP($B98,Store!$B$6:$AG$308,COLUMN()-1,0)","v":"100% cotton"},{"$f":"VLOOKUP($B98,Store!$B$6:$AG$308,COLUMN()-1,0)","v":"24/2 - 16/1"},{"$f":"VLOOKUP($B98,Store!$B$6:$AG$308,COLUMN()-1,0)","v":"24/2 - 16/1"},{"$f":"VLOOKUP($B98,Store!$B$6:$AG$308,COLUMN()-1,0)","v":"Fresh"},{"$f":"VLOOKUP($B98,Store!$B$6:$AG$308,COLUMN()-1,0)","v":"Fresh"},{"$f":"VLOOKUP($B98,Store!$B$6:$AG$308,COLUMN()-1,0)","v":0},{"$f":"VLOOKUP($B98,Store!$B$6:$AG$308,COLUMN()-1,0)","v":"بلييب"},{"$f":"VLOOKUP($B98,Store!$B$6:$AG$308,COLUMN()-1,0)","v":1.3999999999999997},{"$f":"VLOOKUP($B98,Store!$B$6:$AG$308,COLUMN()-1,0)","v":20},{"$f":"VLOOKUP($B98,Store!$B$6:$AG$308,COLUMN()-1,0)","v":1.4},{"$f":"VLOOKUP($B98,Store!$B$6:$AG$308,COLUMN()-1,0)","v":"Jacquard"},{"$f":"VLOOKUP($B98,Store!$B$6:$AG$308,COLUMN()-1,0)","v":"Normal"},null,null,{"$f":"SUMIFS(Store!$AD$6:$AD$308,Store!$B$6:$B$308,Rassed!B98,Store!$AH$6:$AH$308,\"اضافه\")","v":20},{"$f":"SUMIFS(Store!$AD$6:$AD$308,Store!$B$6:$B$308,Rassed!B98,Store!$AN$6:$AN$308,\"صرف\")","v":20},0]

{"sheet":"بطاقه حركه صنف","index":2,"n_rows":8,"n_cols":7,"rows_kept":8,"cut":false,"hidden":false,"merged":[[6,3,6,4],[6,5,7,5],[6,6,7,6]]}
[]
[]
[null,null,"كود الصنف"]
[]
[null,null,"عميل"]
[]
[null,null,null,"الحركه",null,"الرصيد","اسم العميل"]
[null,null,"تاريخ","اضافه","صرف"]