{"text_format":"1","workbook":"xlsx","n_sheets":3,"sheets":["Store","Rassed","بطاقه حركه صنف"],"not_rendered":{"charts":0,"images":0,"macros":0,"external_links":0,"defined_names":2,"comments":0,"pivot_tables":0},"unopened":[],"bounds":{"document_bytes":16777216,"sheet_cells":100000,"rows_first":2000,"rows_last":500,"rows_between":2000,"halvings":0,"cell_chars":16384,"cell_head_chars":4096},"cells_cut":0,"cells_raw":0,"read":"whole","date_system":"1900"}

{"sheet":"Store","index":0,"n_rows":308,"n_cols":44,"rows_kept":308,"cut":false,"hidden":false,"merged":[]}
[]
[]
[]
[]
[null,"Des. Code","Des. Name","System Code","وصف","عميل","امر رقم","رقم الامر من واقع بيانات الاصناف","التصنيف","التصنيف من واقع بيانات الاصناف","النوع","النوع من واقع بيانات الاصناف","مقاس","المقاس من واقع بيانات الاصناف","وزن / قطعه","الوزن من واقع بيانات الاصناف","GSM","Discreption of weight","Color","الدرجه","نوع الغزل","نوع الغزل من واقع بيانات الاصناف","نمره الغزل","نمره الغزل من واقع بيانات الاصناف","درجه الغزل","درجه الغزل من واقع بيانات الاصناف","free4","امين المخزن","الوزن القائم للشيكاره","العدد","الوزن اجمالى كجم","Pattern","Design Type","حركه الاضافه","اسم حركه الاضافه","تاريخ الاضافه","free1","free2","free3","حركه الصرف","اسم حركه الصرفه","تاريخ حركه الصرف","اسم العميل المصروف اليه","رقم فاتوره الصرف"]
[null,"0002 - 34","lion - Blue",9114000002,"مشكل عميل 34 اوردر 7002",34,7002,7001,"Kitchen Towel","Kitchen Towel","Flat","Flat","50 X 70","50 X 70",75,8.7999999999999995E-2,250,"Light weight","dark","Second Choice","100% cotton","100% cotton - Organic","24/2 - 16/1","24/2 - 16/1","Fresh","Fresh",null,"محمود",16,20,1.5,0,"Normal","اضافه","اضافه من المشغل","2021/08/09"]
[null,"0001 - 34","lion - Brown","9114000001","مشكل عميل 34 اوردر 7002",34,7002,7001,"Kitchen Towel","Kitchen Towel","Flat","Flat","50 X 70","50 X 70",75,8.7999999999999995E-2,250,"Light weight","dark","Second Choice","100% cotton","100% cotton - Organic","24/2 - 16/1","24/2 - 16/1","Fresh","Fresh",null,"محمود",16,20,1.5,0,"Normal","اضافه","اضافه من المشغل","2021/08/09"]
[null,"0003 - 34","tiger - yellow","9112000001","مشكل عميل 34 اوردر 7002",34,7002,7001,"Kitchen Towel","Beach Towel","Flat","Velour","50 X 70","100 x 170",75,0.71399999999999997,420,"Medium weight","dark","Second Choice","100% cotton","100% cotton - Organic","24/2 - 16/1","24/2 - 24/2 - 16/1","Fresh","Fresh",null,"محمود",16,30,2.25,0,"Normal","اضافه","اضافه من المشغل","2021/08/09"]
[null,"0004 - 34","tiger - Orange",9112000002,"مشكل عميل 34 اوردر 7002",34,7002,7001,"Kitchen Towel","Beach Towel","Flat","Velour","50 X 70","100 x 170",75,0.71399999999999997,420,"Medium weight","dark","Second Choice","100% cotton","100% cotton - Organic","24/2 - 16/1","24/2 - 24/2 - 16/1","Fresh","Fresh",null,"محمود",16,50,3.75,0,"Normal","اضافه","اضافه من المشغل","2021/08/09"]
[null,"0005 - 34","sun - red",9112000003,"مشكل عميل 34 اوردر 7002",34,7002,7002,"Kitchen Towel","Beach Towel","Flat","Velour","50 X 70","90 x 160",75,0.57599999999999996,400,"Medium weight","dark","Second Choice","100% cotton","100% cotton","24/2 - 16/1","24/2 - 24/2 - 16/1","Fresh","Fresh",null,"محمود",16,10,0.75,0,"Normal","اضافه","اضافه من المشغل","2021/08/09"]
[null,"0006 - 34","sun - orange",9112000004,"مشكل عميل 34 اوردر 7002",34,7002,7002,"Kitchen Towel","Beach Towel","Flat","Velour","50 X 70","90 x 160",75,0.57599999999999996,400,"Medium weight","dark","Second Choice","100% cotton","100% cotton","24/2 - 16/1","24/2 - 24/2 - 16/1","Fresh","Fresh",null,"محمود",16,25,1.875,"DOBBY","Normal","اضافه","اضافه من المشغل","2021/08/09"]
[null,"0007 - 34","LOO",9114000003,"مشكل عميل 34 اوردر 7002",34,7002,7003,"Kitchen Towel","Kitchen Towel","Flat","Flat","50 X 70","50 X 70",75,7.0000000000000007E-2,200,"Very Light weight","dark","Second Choice","100% cotton","100% cotton","24/2 - 16/1","24/2 - 16/1","Fresh","Fresh",null,"محمود",16,25,1.875,"Jacquard","Normal","اضافه","اضافه من المشغل","2021/08/09"]
[null,"0008 - 34","TOO",9114000004,"مشكل عميل 34 اوردر 7002",34,7002,7003,"Kitchen Towel","Kitchen Towel","Flat","Flat","50 X 70","50 X 70",75,7.0000000000000007E-2,200,"Very Light weight","dark","Second Choice","100% cotton","100% cotton","24/2 - 16/1","24/2 - 16/1","Fresh","Fresh",null,"محمود",16,10,0.75,"Jacquard","Normal","اضافه","اضافه من المشغل","2021/08/09"]
[null,"0010 - 34","BOO",9114000006,"مشكل عميل 34 اوردر 7002",34,7002,7003,"Kitchen Towel","Kitchen Towel","Flat","Flat","50 X 70","50 X 70",75,7.0000000000000007E-2,200,"Very Light weight","dark","Second Choice","100% cotton","100% cotton","24/2 - 16/1","24/2 - 16/1","Fresh","Fresh",null,"محمود",16,10,0.75,"Jacquard","Normal","اضافه","اضافه من المشغل","2021/08/09"]
[null,"0002 - 34","lion - Blue",9114000002,"مشكل عميل 34 اوردر 7002",34,7002,7001,"Kitchen Towel","Kitchen Towel","Flat","Flat","50 X 70","50 X 70",75,8.7999999999999995E-2,250,"Light weight","dark","Second Choice","100% cotton","100% cotton - Organic","24/2 - 16/1","24/2 - 16/1","Fresh","Fresh",null,"محمود",16,20,1.5,0,"Normal","اضافه","اضافه من المشغل","2021/08/09"]
{"$rows_left_out":294}
{"sheet":"Rassed","index":1,"n_rows":98,"n_cols":38,"rows_kept":98,"cut":false,"hidden":false,"merged":[]}
[]
[]
[]
[null,null,"last one"]
[]
[]
[null,"Des. Code","Des. Name","System Code","وصف","عميل","امر رقم","رقم الامر من واقع بيانات الاصناف","التصنيف","التصنيف من واقع بيانات الاصناف","النوع","النوع من واقع بيانات الاصناف","مقاس","المقاس من واقع بيانات الاصناف","وزن / قطعه","الوزن من واقع بيانات الاصناف","GSM","Discreption of weight","Color","الدرجه","نوع الغزل","نوع الغزل من واقع بيانات الاصناف","نمره الغزل","نمره الغزل من واقع بيانات الاصناف","درجه الغزل","درجه الغزل من واقع بيانات الاصناف","free4","امين المخزن","الوزن القائم للشيكاره","العدد","الوزن اجمالى كجم","Pattern","Design Type",null,null,"اضافه","صرف","الرصيد"]
[null,"0002 - 34",{"$f":"VLOOKUP($B8,Store!$B$6:$AG$308,COLUMN()-1,0)","v":"lion - Blue"},{"$f":"VLOOKUP($B8,Store!$B$6:$AG$308,COLUMN()-1,0)","v":9114000002},{"$f":"VLOOKUP($B8,Store!$B$6:$AG$308,COLUMN()-1,0)","v":"مشكل عميل 34 اوردر 7002"},{"$f":"VLOOKUP($B8,Store!$B$6:$AG$308,COLUMN()-1,0)","v":34},{"$f":"VLOOKUP($B8,Store!$B$6:$AG$308,COLUMN()-1,0)","v":7002},{"$f":"VLOOKUP($B8,Store!$B$6:$AG$308,COLUMN()-1,0)","v":7001},{"$f":"VLOOKUP($B8,Store!$B$6:$AG$308,COLUMN()-1,0)","v":"Kitchen Towel"},{"$f":"VLOOKUP($B8,Store!$B$6:$AG$308,COLUMN()-1,0)","v":"Kitchen Towel"},{"$f":"VLOOKUP($B8,Store!$B$6:$AG$308,COLUMN()-1,0)","v":"Flat"},{"$f":"VLOOKUP($B8,Store!$B$6:$AG$308,COLUMN()-1,0)","v":"Flat"},{"$f":"VLOOKUP($B8,Store!$B$6:$AG$308,COLUMN()-1,0)","v":"50 X 70"},{"$f":"VLOOKUP($B8,Store!$B$6:$AG$308,COLUMN()-1,0)","v":"50 X 70"},{"$f":"VLOOKUP($B8,Store!$B$6:$AG$308,COLUMN()-1,0)","v":75},{"$f":"VLOOKUP($B8,Store!$B$6:$AG$308,COLUMN()-1,0)","v":8.7999999999999995E-2},{"$f":"VLOOKUP($B8,Store!$B$6:$AG$308,COLUMN()-1,0)","v":250},{"$f":"VLOOKUP($B8,Store!$B$6:$AG$308,COLUMN()-1,0)","v":"Light weight"},{"$f":"VLOOKUP($B8,Store!$B$6:$AG$308,COLUMN()-1,0)","v":"dark"},{"$f":"VLOOKUP($B8,Store!$B$6:$AG$308,COLUMN()-1,0)","v":"Second Choice"},{"$f":"VLOOKUP($B8,Store!$B$6:$AG$308,COLUMN()-1,0)","v":"100% cotton"},{"$f":"VLOOKUP($B8,Store!$B$6:$AG$308,COLUMN()-1,0)","v":"100% cotton - Organic"},{"$f":"VLOOKUP($B8,Store!$B$6:$AG$308,COLUMN()-1,0)","v":"24/2 - 16/1"},{"$f":"VLOOKUP($B8,Store!$B$6:$AG$308,COLUMN()-1,0)","v":"24/2 - 16/1"},{"$f":"VLOOKUP($B8,Store!$B$6:$AG$308,COLUMN()-1,0)","v":"Fresh"},{"$f":"VLOOKUP($B8,Store!$B$6:$AG$308,COLUMN()-1,0)","v":"Fresh"},{"$f":"VLOOKUP($B8,Store!$B$6:$AG$308,COLUMN()-1,0)","v":0},{"$f":"VLOOKUP($B8,Store!$B$6:$AG$308,COLUMN()-1,0)","v":"محمود"},{"$f":"VLOOKUP($B8,Store!$B$6:$AG$308,COLUMN()-1,0)","v":16},{"$f":"VLOOKUP($B8,Store!$B$6:$AG$308,COLUMN()-1,0)","v":20},{"$f":"VLOOKUP($B8,Store!$B$6:$AG$308,COLUMN()-1,0)","v":1.5},{"$f":"VLOOKUP($B8,Store!$B$6:$AG$308,COLUMN()-1,0)","v":0},{"$f":"VLOOKUP($B8,Store!$B$6:$AG$308,COLUMN()-1,0)","v":"Normal"},null,null,{"$f":"SUMIFS(Store!$AD$6:$AD$308,Store!$B$6:$B$308,Rassed!B8,Store!$AH$6:$AH$308,\"اضافه\")","v":60},{"$f":"SUMIFS(Store!$AD$6:$AD$308,Store!$B$6:$B$308,Rassed!B8,Store!$AN$6:$AN$308,\"صرف\")","v":60},{"$f":"AJ8-AK8","v":0}]
[null,"0001 - 34",{"$f":"VLOOKUP($B9,Store!$B$6:$AG$308,COLUMN()-1,0)","v":"lion - Brown"},{"$f":"VLOOKUP($B9,Store!$B$6:$AG$308,COLUMN()-1,0)","v":"9114000001"},{"$f":"VLOOKUP($B9,Store!$B$6:$AG$308,COLUMN()-1,0)","v":"مشكل عميل 34 اوردر 7002"},{"$f":"VLOOKUP($B9,Store!$B$6:$AG$308,COLUMN()-1,0)","v":34},{"$f":"VLOOKUP($B9,Store!$B$6:$AG$308,COLUMN()-1,0)","v":7002},{"$f":"VLOOKUP($B9,Store!$B$6:$AG$308,COLUMN()-1,0)","v":7001},{"$f":"VLOOKUP($B9,Store!$B$6:$AG$308,COLUMN()-1,0)","v":"Kitchen Towel"},{"$f":"VLOOKUP($B9,Store!$B$6:$AG$308,COLUMN()-1,0)","v":"Kitchen Towel"},{"$f":"VLOOKUP($B9,Store!$B$6:$AG$308,COLUMN()-1,0)","v":"Flat"},{"$f":"VLOOKUP($B9,Store!$B$6:$AG$308,COLUMN()-1,0)","v":"Flat"},{"$f":"VLOOKUP($B9,Store!$B$6:$AG$308,COLUMN()-1,0)","v":"50 X 70"},{"$f":"VLOOKUP($B9,Store!$B$6:$AG$308,COLUMN()-1,0)","v":"50 X 70"},{"$f":"VLOOKUP($B9,Store!$B$6:$AG$308,COLUMN()-1,0)","v":75},{"$f":"VLOOKUP($B9,Store!$B$6:$AG$308,COLUMN()-1,0)","v":8.7999999999999995E-2},{"$f":"VLOOKUP($B9,Store!$B$6:$AG$308,COLUMN()-1,0)","v":250},{"$f":"VLOOKUP($B9,Store!$B$6:$AG$308,COLUMN()-1,0)","v":"Light weight"},{"$f":"VLOOKUP($B9,Store!$B$6:$AG$308,COLUMN()-1,0)","v":"dark"},{"$f":"VLOOKUP($B9,Store!$B$6:$AG$308,COLUMN()-1,0)","v":"Second Choice"},{"$f":"VLOOKUP($B9,Store!$B$6:$AG$308,COLUMN()-1,0)","v":"100% cotton"},{"$f":"VLOOKUP($B9,Store!$B$6:$AG$308,COLUMN()-1,0)","v":"100% cotton - Organic"},{"$f":"VLOOKUP($B9,Store!$B$6:$AG$308,COLUMN()-1,0)","v":"24/2 - 16/1"},{"$f":"VLOOKUP($B9,Store!$B$6:$AG$308,COLUMN()-1,0)","v":"24/2 - 16/1"},{"$f":"VLOOKUP($B9,Store!$B$6:$AG$308,COLUMN()-1,0)","v":"Fresh"},{"$f":"VLOOKUP($B9,Store!$B$6:$AG$308,COLUMN()-1,0)","v":"Fresh"},{"$f":"VLOOKUP($B9,Store!$B$6:$AG$308,COLUMN()-1,0)","v":0},{"$f":"VLOOKUP($B9,Store!$B$6:$AG$308,COLUMN()-1,0)","v":"محمود"},{"$f":"VLOOKUP($B9,Store!$B$6:$AG$308,COLUMN()-1,0)","v":16},{"$f":"VLOOKUP($B9,Store!$B$6:$AG$308,COLUMN()-1,0)","v":20},{"$f":"VLOOKUP($B9,Store!$B$6:$AG$308,COLUMN()-1,0)","v":1.5},{"$f":"VLOOKUP($B9,Store!$B$6:$AG$308,COLUMN()-1,0)","v":0},{"$f":"VLOOKUP($B9,Store!$B$6:$AG$308,COLUMN()-1,0)","v":"Normal"},null,null,{"$f":"SUMIFS(Store!$AD$6:$AD$308,Store!$B$6:$B$308,Rassed!B9,Store!$AH$6:$AH$308,\"اضافه\")","v":60},{"$f":"SUMIFS(Store!$AD$6:$AD$308,Store!$B$6:$B$308,Rassed!B9,Store!$AN$6:$AN$308,\"صرف\")","v":60},{"$f":"AJ9-AK9","v":0}]
[null,"0003 - 34",{"$f":"VLOOKUP($B10,Store!$B$6:$AG$308,COLUMN()-1,0)","v":"tiger - yellow"},{"$f":"VLOOKUP($B10,Store!$B$6:$AG$308,COLUMN()-1,0)","v":"9112000001"},{"$f":"VLOOKUP($B10,Store!$B$6:$AG$308,COLUMN()-1,0)","v":"مشكل عميل 34 اوردر 7002"},{"$f":"VLOOKUP($B10,Store!$B$6:$AG$308,COLUMN()-1,0)","v":34},{"$f":"VLOOKUP($B10,Store!$B$6:$AG$308,COLUMN()-1,0)","v":7002},{"$f":"VLOOKUP($B10,Store!$B$6:$AG$308,COLUMN()-1,0)","v":7001},{"$f":"VLOOKUP($B10,Store!$B$6:$AG$308,COLUMN()-1,0)","v":"Kitchen Towel"},{"$f":"VLOOKUP($B10,Store!$B$6:$AG$308,COLUMN()-1,0)","v":"Beach Towel"},{"$f":"VLOOKUP($B10,Store!$B$6:$AG$308,COLUMN()-1,0)","v":"Flat"},{"$f":"VLOOKUP($B10,Store!$B$6:$AG$308,COLUMN()-1,0)","v":"Velour"},{"$f":"VLOOKUP($B10,Store!$B$6:$AG$308,COLUMN()-1,0)","v":"50 X 70"},{"$f":"VLOOKUP($B10,Store!$B$6:$AG$308,COLUMN()-1,0)","v":"100 x 170"},{"$f":"VLOOKUP($B10,Store!$B$6:$AG$308,COLUMN()-1,0)","v":75},{"$f":"VLOOKUP($B10,Store!$B$6:$AG$308,COLUMN()-1,0)","v":0.71399999999999997},{"$f":"VLOOKUP($B10,Store!$B$6:$AG$308,COLUMN()-1,0)","v":420},{"$f":"VLOOKUP($B10,Store!$B$6:$AG$308,COLUMN()-1,0)","v":"Medium weight"},{"$f":"VLOOKUP($B10,Store!$B$6:$AG$308,COLUMN()-1,0)","v":"dark"},{"$f":"VLOOKUP($B10,Store!$B$6:$AG$308,COLUMN()-1,0)","v":"Second Choice"},{"$f":"VLOOKUP($B10,Store!$B$6:$AG$308,COLUMN()-1,0)","v":"100% cotton"},{"$f":"VLOOKUP($B10,Store!$B$6:$AG$308,COLUMN()-1,0)","v":"100% cotton - Organic"},{"$f":"VLOOKUP($B10,Store!$B$6:$AG$308,COLUMN()-1,0)","v":"24/2 - 16/1"},{"$f":"VLOOKUP($B10,Store!$B$6:$AG$308,COLUMN()-1,0)","v":"24/2 - 24/2 - 16/1"},{"$f":"VLOOKUP($B10,Store!$B$6:$AG$308,COLUMN()-1,0)","v":"Fresh"},{"$f":"VLOOKUP($B10,Store!$B$6:$AG$308,COLUMN()-1,0)","v":"Fresh"},{"$f":"VLOOKUP($B10,Store!$B$6:$AG$308,COLUMN()-1,0)","v":0},{"$f":"VLOOKUP($B10,Store!$B$6:$AG$308,COLUMN()-1,0)","v":"محمود"},{"$f":"VLOOKUP($B10,Store!$B$6:$AG$308,COLUMN()-1,0)","v":16},{"$f":"VLOOKUP($B10,Store!$B$6:$AG$308,COLUMN()-1,0)","v":30},{"$f":"VLOOKUP($B10,Store!$B$6:$AG$308,COLUMN()-1,0)","v":2.25},{"$f":"VLOOKUP($B10,Store!$B$6:$AG$308,COLUMN()-1,0)","v":0},{"$f":"VLOOKUP($B10,Store!$B$6:$AG$308,COLUMN()-1,0)","v":"Normal"},null,null,{"$f":"SUMIFS(Store!$AD$6:$AD$308,Store!$B$6:$B$308,Rassed!B10,Store!$AH$6:$AH$308,\"اضافه\")","v":90},{"$f":"SUMIFS(Store!$AD$6:$AD$308,Store!$B$6:$B$308,Rassed!B10,Store!$AN$6:$AN$308,\"صرف\")","v":90},0]
[null,"0004 - 34",{"$f":"VLOOKUP($B11,Store!$B$6:$AG$308,COLUMN()-1,0)","v":"tiger - Orange"},{"$f":"VLOOKUP($B11,Store!$B$6:$AG$308,COLUMN()-1,0)","v":9112000002},{"$f":"VLOOKUP($B11,Store!$B$6:$AG$308,COLUMN()-1,0)","v":"مشكل عميل 34 اوردر 7002"},{"$f":"VLOOKUP($B11,Store!$B$6:$AG$308,COLUMN()-1,0)","v":34},{"$f":"VLOOKUP($B11,Store!$B$6:$AG$308,COLUMN()-1,0)","v":7002},{"$f":"VLOOKUP($B11,Store!$B$6:$AG$308,COLUMN()-1,0)","v":7001},{"$f":"VLOOKUP($B11,Store!$B$6:$AG$308,COLUMN()-1,0)","v":"Kitchen Towel"},{"$f":"VLOOKUP($B11,Store!$B$6:$AG$308,COLUMN()-1,0)","v":"Beach Towel"},{"$f":"VLOOKUP($B11,Store!$B$6:$AG$308,COLUMN()-1,0)","v":"Flat"},{"$f":"VLOOKUP($B11,Store!$B$6:$AG$308,COLUMN()-1,0)","v":"Velour"},{"$f":"VLOOKUP($B11,Store!$B$6:$AG$308,COLUMN()-1,0)","v":"50 X 70"},{"$f":"VLOOKUP($B11,Store!$B$6:$AG$308,COLUMN()-1,0)","v":"100 x 170"},{"$f":"VLOOKUP($B11,Store!$B$6:$AG$308,COLUMN()-1,0)","v":75},{"$f":"VLOOKUP($B11,Store!$B$6:$AG$308,COLUMN()-1,0)","v":0.71399999999999997},{"$f":"VLOOKUP($B11,Store!$B$6:$AG$308,COLUMN()-1,0)","v":420},{"$f":"VLOOKUP($B11,Store!$B$6:$AG$308,COLUMN()-1,0)","v":"Medium weight"},{"$f":"VLOOKUP($B11,Store!$B$6:$AG$308,COLUMN()-1,0)","v":"dark"},{"$f":"VLOOKUP($B11,Store!$B$6:$AG$308,COLUMN()-1,0)","v":"Second Choice"},{"$f":"VLOOKUP($B11,Store!$B$6:$AG$308,COLUMN()-1,0)","v":"100% cotton"},{"$f":"VLOOKUP($B11,Store!$B$6:$AG$308,COLUMN()-1,0)","v":"100% cotton - Organic"},{"$f":"VLOOKUP($B11,Store!$B$6:$AG$308,COLUMN()-1,0)","v":"24/2 - 16/1"},{"$f":"VLOOKUP($B11,Store!$B$6:$AG$308,COLUMN()-1,0)","v":"24/2 - 24/2 - 16/1"},{"$f":"VLOOKUP($B11,Store!$B$6:$AG$308,COLUMN()-1,0)","v":"Fresh"},{"$f":"VLOOKUP($B11,Store!$B$6:$AG$308,COLUMN()-1,0)","v":"Fresh"},{"$f":"VLOOKUP($B11,Store!$B$6:$AG$308,COLUMN()-1,0)","v":0},{"$f":"VLOOKUP($B11,Store!$B$6:$AG$308,COLUMN()-1,0)","v":"محمود"},{"$f":"VLOOKUP($B11,Store!$B$6:$AG$308,COLUMN()-1,0)","v":16},{"$f":"VLOOKUP($B11,Store!$B$6:$AG$308,COLUMN()-1,0)","v":50},{"$f":"VLOOKUP($B11,Store!$B$6:$AG$308,COLUMN()-1,0)","v":3.75},{"$f":"VLOOKUP($B11,Store!$B$6:$AG$308,COLUMN()-1,0)","v":0},{"$f":"VLOOKUP($B11,Store!$B$6:$AG$308,COLUMN()-1,0)","v":"Normal"},null,null,{"$f":"SUMIFS(Store!$AD$6:$AD$308,Store!$B$6:$B$308,Rassed!B11,Store!$AH$6:$AH$308,\"اضافه\")","v":150},{"$f":"SUMIFS(Store!$AD$6:$AD$308,Store!$B$6:$B$308,Rassed!B11,Store!$AN$6:$AN$308,\"صرف\")","v":150},0]
[null,"0005 - 34",{"$f":"VLOOKUP($B12,Store!$B$6:$AG$308,COLUMN()-1,0)","v":"sun - red"},{"$f":"VLOOKUP($B12,Store!$B$6:$AG$308,COLUMN()-1,0)","v":9112000003},{"$f":"VLOOKUP($B12,Store!$B$6:$AG$308,COLUMN()-1,0)","v":"مشكل عميل 34 اوردر 7002"},{"$f":"VLOOKUP($B12,Store!$B$6:$AG$308,COLUMN()-1,0)","v":34},{"$f":"VLOOKUP($B12,Store!$B$6:$AG$308,COLUMN()-1,0)","v":7002},{"$f":"VLOOKUP($B12,Store!$B$6:$AG$308,COLUMN()-1,0)","v":7002},{"$f":"VLOOKUP($B12,Store!$B$6:$AG$308,COLUMN()-1,0)","v":"Kitchen Towel"},{"$f":"VLOOKUP($B12,Store!$B$6:$AG$308,COLUMN()-1,0)","v":"Beach Towel"},{"$f":"VLOOKUP($B12,Store!$B$6:$AG$308,COLUMN()-1,0)","v":"Flat"},{"$f":"VLOOKUP($B12,Store!$B$6:$AG$308,COLUMN()-1,0)","v":"Velour"},{"$f":"VLOOKUP($B12,Store!$B$6:$AG$308,COLUMN()-1,0)","v":"50 X 70"},{"$f":"VLOOKUP($B12,Store!$B$6:$AG$308,COLUMN()-1,0)","v":"90 x 160"},{"$f":"VLOOKUP($B12,Store!$B$6:$AG$308,COLUMN()-1,0)","v":75},{"$f":"VLOOKUP($B12,Store!$B$6:$AG$308,COLUMN()-1,0)","v":0.57599999999999996},{"$f":"VLOOKUP($B12,Store!$B$6:$AG$308,COLUMN()-1,0)","v":400},{"$f":"VLOOKUP($B12,Store!$B$6:$AG$308,COLUMN()-1,0)","v":"Medium weight"},{"$f":"VLOOKUP($B12,Store!$B$6:$AG$308,COLUMN()-1,0)","v":"dark"},{"$f":"VLOOKUP($B12,Store!$B$6:$AG$308,COLUMN()-1,0)","v":"Second Choice"},{"$f":"VLOOKUP($B12,Store!$B$6:$AG$308,COLUMN()-1,0)","v":"100% cotton"},{"$f":"VLOOKUP($B12,Store!$B$6:$AG$308,COLUMN()-1,0)","v":"100% cotton"},{"$f":"VLOOKUP($B12,Store!$B$6:$AG$308,COLUMN()-1,0)","v":"24/2 - 16/1"},{"$f":"VLOOKUP($B12,Store!$B$6:$AG$308,COLUMN()-1,0)","v":"24/2 - 24/2 - 16/1"},{"$f":"VLOOKUP($B12,Store!$B$6:$AG$308,COLUMN()-1,0)","v":"Fresh"},{"$f":"VLOOKUP($B12,Store!$B$6:$AG$308,COLUMN()-1,0)","v":"Fresh"},{"$f":"VLOOKUP($B12,Store!$B$6:$AG$308,COLUMN()-1,0)","v":0},{"$f":"VLOOKUP($B12,Store!$B$6:$AG$308,COLUMN()-1,0)","v":"محمود"},{"$f":"VLOOKUP($B12,Store!$B$6:$AG$308,COLUMN()-1,0)","v":16},{"$f":"VLOOKUP($B12,Store!$B$6:$AG$308,COLUMN()-1,0)","v":10},{"$f":"VLOOKUP($B12,Store!$B$6:$AG$308,COLUMN()-1,0)","v":0.75},{"$f":"VLOOKUP($B12,Store!$B$6:$AG$308,COLUMN()-1,0)","v":0},{"$f":"VLOOKUP($B12,Store!$B$6:$AG$308,COLUMN()-1,0)","v":"Normal"},null,null,{"$f":"SUMIFS(Store!$AD$6:$AD$308,Store!$B$6:$B$308,Rassed!B12,Store!$AH$6:$AH$308,\"اضافه\")","v":30},{"$f":"SUMIFS(Store!$AD$6:$AD$308,Store!$B$6:$B$308,Rassed!B12,Store!$AN$6:$AN$308,\"صرف\")","v":30},0]
[null,"0006 - 34",{"$f":"VLOOKUP($B13,Store!$B$6:$AG$308,COLUMN()-1,0)","v":"sun - orange"},{"$f":"VLOOKUP($B13,Store!$B$6:$AG$308,COLUMN()-1,0)","v":9112000004},{"$f":"VLOOKUP($B13,Store!$B$6:$AG$308,COLUMN()-1,0)","v":"مشكل عميل 34 اوردر 7002"},{"$f":"VLOOKUP($B13,Store!$B$6:$AG$308,COLUMN()-1,0)","v":34},{"$f":"VLOOKUP($B13,Store!$B$6:$AG$308,COLUMN()-1,0)","v":7002},{"$f":"VLOOKUP($B13,Store!$B$6:$AG$308,COLUMN()-1,0)","v":7002},{"$f":"VLOOKUP($B13,Store!$B$6:$AG$308,COLUMN()-1,0)","v":"Kitchen Towel"},{"$f":"VLOOKUP($B13,Store!$B$6:$AG$308,COLUMN()-1,0)","v":"Beach Towel"},{"$f":"VLOOKUP($B13,Store!$B$6:$AG$308,COLUMN()-1,0)","v":"Flat"},{"$f":"VLOOKUP($B13,Store!$B$6:$AG$308,COLUMN()-1,0)","v":"Velour"},{"$f":"VLOOKUP($B13,Store!$B$6:$AG$308,COLUMN()-1,0)","v":"50 X 70"},{"$f":"VLOOKUP($B13,Store!$B$6:$AG$308,COLUMN()-1,0)","v":"90 x 160"},{"$f":"VLOOKUP($B13,Store!$B$6:$AG$308,COLUMN()-1,0)","v":75},{"$f":"VLOOKUP($B13,Store!$B$6:$AG$308,COLUMN()-1,0)","v":0.57599999999999996},{"$f":"VLOOKUP($B13,Store!$B$6:$AG$308,COLUMN()-1,0)","v":400},{"$f":"VLOOKUP($B13,Store!$B$6:$AG$308,COLUMN()-1,0)","v":"Medium weight"},{"$f":"VLOOKUP($B13,Store!$B$6:$AG$308,COLUMN()-1,0)","v":"dark"},{"$f":"VLOOKUP($B13,Store!$B$6:$AG$308,COLUMN()-1,0)","v":"Second Choice"},{"$f":"VLOOKUP($B13,Store!$B$6:$AG$308,COLUMN()-1,0)","v":"100% cotton"},{"$f":"VLOOKUP($B13,Store!$B$6:$AG$308,COLUMN()-1,0)","v":"100% cotton"},{"$f":"VLOOKUP($B13,Store!$B$6:$AG$308,COLUMN()-1,0)","v":"24/2 - 16/1"},{"$f":"VLOOKUP($B13,Store!$B$6:$AG$308,COLUMN()-1,0)","v":"24/2 - 24/2 - 16/1"},{"$f":"VLOOKUP($B13,Store!$B$6:$AG$308,COLUMN()-1,0)","v":"Fresh"},{"$f":"VLOOKUP($B13,Store!$B$6:$AG$308,COLUMN()-1,0)","v":"Fresh"},{"$f":"VLOOKUP($B13,Store!$B$6:$AG$308,COLUMN()-1,0)","v":0},{"$f":"VLOOKUP($B13,Store!$B$6:$AG$308,COLUMN()-1,0)","v":"محمود"},{"$f":"VLOOKUP($B13,Store!$B$6:$AG$308,COLUMN()-1,0)","v":16},{"$f":"VLOOKUP($B13,Store!$B$6:$AG$308,COLUMN()-1,0)","v":25},{"$f":"VLOOKUP($B13,Store!$B$6:$AG$308,COLUMN()-1,0)","v":1.875},{"$f":"VLOOKUP($B13,Store!$B$6:$AG$308,COLUMN()-1,0)","v":"DOBBY"},{"$f":"VLOOKUP($B13,Store!$B$6:$AG$308,COLUMN()-1,0)","v":"Normal"},null,null,{"$f":"SUMIFS(Store!$AD$6:$AD$308,Store!$B$6:$B$308,Rassed!B13,Store!$AH$6:$AH$308,\"اضافه\")","v":75},{"$f":"SUMIFS(Store!$AD$6:$AD$308,Store!$B$6:$B$308,Rassed!B13,Store!$AN$6:$AN$308,\"صرف\")","v":75},0]
[null,"0007 - 34",{"$f":"VLOOKUP($B14,Store!$B$6:$AG$308,COLUMN()-1,0)","v":"LOO"},{"$f":"VLOOKUP($B14,Store!$B$6:$AG$308,COLUMN()-1,0)","v":9114000003},{"$f":"VLOOKUP($B14,Store!$B$6:$AG$308,COLUMN()-1,0)","v":"مشكل عميل 34 اوردر 7002"},{"$f":"VLOOKUP($B14,Store!$B$6:$AG$308,COLUMN()-1,0)","v":34},{"$f":"VLOOKUP($B14,Store!$B$6:$AG$308,COLUMN()-1,0)","v":7002},{"$f":"VLOOKUP($B14,Store!$B$6:$AG$308,COLUMN()-1,0)","v":7003},{"$f":"VLOOKUP($B14,Store!$B$6:$AG$308,COLUMN()-1,0)","v":"Kitchen Towel"},{"$f":"VLOOKUP($B14,Store!$B$6:$AG$308,COLUMN()-1,0)","v":"Kitchen Towel"},{"$f":"VLOOKUP($B14,Store!$B$6:$AG$308,COLUMN()-1,0)","v":"Flat"},{"$f":"VLOOKUP($B14,Store!$B$6:$AG$308,COLUMN()-1,0)","v":"Flat"},{"$f":"VLOOKUP($B14,Store!$B$6:$AG$308,COLUMN()-1,0)","v":"50 X 70"},{"$f":"VLOOKUP($B14,Store!$B$6:$AG$308,COLUMN()-1,0)","v":"50 X 70"},{"$f":"VLOOKUP($B14,Store!$B$6:$AG$308,COLUMN()-1,0)","v":75},{"$f":"VLOOKUP($B14,Store!$B$6:$AG$308,COLUMN()-1,0)","v":7.0000000000000007E-2},{"$f":"VLOOKUP($B14,Store!$B$6:$AG$308,COLUMN()-1,0)","v":200},{"$f":"VLOOKUP($B14,Store!$B$6:$AG$308,COLUMN()-1,0)","v":"Very Light weight"},{"$f":"VLOOKUP($B14,Store!$B$6:$AG$308,COLUMN()-1,0)","v":"dark"},{"$f":"VLOOKUP($B14,Store!$B$6:$AG$308,COLUMN()-1,0)","v":"Second Choice"},{"$f":"VLOOKUP($B14,Store!$B$6:$AG$308,COLUMN()-1,0)","v":"100% cotton"},{"$f":"VLOOKUP($B14,Store!$B$6:$AG$308,COLUMN()-1,0)","v":"100% cotton"},{"$f":"VLOOKUP($B14,Store!$B$6:$AG$308,COLUMN()-1,0)","v":"24/2 - 16/1"},{"$f":"VLOOKUP($B14,Store!$B$6:$AG$308,COLUMN()-1,0)","v":"24/2 - 16/1"},{"$f":"VLOOKUP($B14,Store!$B$6:$AG$308,COLUMN()-1,0)","v":"Fresh"},{"$f":"VLOOKUP($B14,Store!$B$6:$AG$308,COLUMN()-1,0)","v":"Fresh"},{"$f":"VLOOKUP($B14,Store!$B$6:$AG$308,COLUMN()-1,0)","v":0},{"$f":"VLOOKUP($B14,Store!$B$6:$AG$308,COLUMN()-1,0)","v":"محمود"},{"$f":"VLOOKUP($B14,Store!$B$6:$AG$308,COLUMN()-1,0)","v":16},{"$f":"VLOOKUP($B14,Store!$B$6:$AG$308,COLUMN()-1,0)","v":25},{"$f":"VLOOKUP($B14,Store!$B$6:$AG$308,COLUMN()-1,0)","v":1.875},{"$f":"VLOOKUP($B14,Store!$B$6:$AG$308,COLUMN()-1,0)","v":"Jacquard"},{"$f":"VLOOKUP($B14,Store!$B$6:$AG$308,COLUMN()-1,0)","v":"Normal"},null,null,{"$f":"SUMIFS(Store!$AD$6:$AD$308,Store!$B$6:$B$308,Rassed!B14,Store!$AH$6:$AH$308,\"اضافه\")","v":75},{"$f":"SUMIFS(Store!$AD$6:$AD$308,Store!$B$6:$B$308,Rassed!B14,Store!$AN$6:$AN$308,\"صرف\")","v":75},0]
[null,"0008 - 34",{"$f":"VLOOKUP($B15,Store!$B$6:$AG$308,COLUMN()-1,0)","v":"TOO"},{"$f":"VLOOKUP($B15,Store!$B$6:$AG$308,COLUMN()-1,0)","v":9114000004},{"$f":"VLOOKUP($B15,Store!$B$6:$AG$308,COLUMN()-1,0)","v":"مشكل عميل 34 اوردر 7002"},{"$f":"VLOOKUP($B15,Store!$B$6:$AG$308,COLUMN()-1,0)","v":34},{"$f":"VLOOKUP($B15,Store!$B$6:$AG$308,COLUMN()-1,0)","v":7002},{"$f":"VLOOKUP($B15,Store!$B$6:$AG$308,COLUMN()-1,0)","v":7003},{"$f":"VLOOKUP($B15,Store!$B$6:$AG$308,COLUMN()-1,0)","v":"Kitchen Towel"},{"$f":"VLOOKUP($B15,Store!$B$6:$AG$308,COLUMN()-1,0)","v":"Kitchen Towel"},{"$f":"VLOOKUP($B15,Store!$B$6:$AG$308,COLUMN()-1,0)","v":"Flat"},{"$f":"VLOOKUP($B15,Store!$B$6:$AG$308,COLUMN()-1,0)","v":"Flat"},{"$f":"VLOOKUP($B15,Store!$B$6:$AG$308,COLUMN()-1,0)","v":"50 X 70"},{"$f":"VLOOKUP($B15,Store!$B$6:$AG$308,COLUMN()-1,0)","v":"50 X 70"},{"$f":"VLOOKUP($B15,Store!$B$6:$AG$308,COLUMN()-1,0)","v":75},{"$f":"VLOOKUP($B15,Store!$B$6:$AG$308,COLUMN()-1,0)","v":7.0000000000000007E-2},{"$f":"VLOOKUP($B15,Store!$B$6:$AG$308,COLUMN()-1,0)","v":200},{"$f":"VLOOKUP($B15,Store!$B$6:$AG$308,COLUMN()-1,0)","v":"Very Light weight"},{"$f":"VLOOKUP($B15,Store!$B$6:$AG$308,COLUMN()-1,0)","v":"dark"},{"$f":"VLOOKUP($B15,Store!$B$6:$AG$308,COLUMN()-1,0)","v":"Second Choice"},{"$f":"VLOOKUP($B15,Store!$B$6:$AG$308,COLUMN()-1,0)","v":"100% cotton"},{"$f":"VLOOKUP($B15,Store!$B$6:$AG$308,COLUMN()-1,0)","v":"100% cotton"},{"$f":"VLOOKUP($B15,Store!$B$6:$AG$308,COLUMN()-1,0)","v":"24/2 - 16/1"},{"$f":"VLOOKUP($B15,Store!$B$6:$AG$308,COLUMN()-1,0)","v":"24/2 - 16/1"},{"$f":"VLOOKUP($B15,Store!$B$6:$AG$308,COLUMN()-1,0)","v":"Fresh"},{"$f":"VLOOKUP($B15,Store!$B$6:$AG$308,COLUMN()-1,0)","v":"Fresh"},{"$f":"VLOOKUP($B15,Store!$B$6:$AG$308,COLUMN()-1,0)","v":0},{"$f":"VLOOKUP($B15,Store!$B$6:$AG$308,COLUMN()-1,0)","v":"محمود"},{"$f":"VLOOKUP($B15,Store!$B$6:$AG$308,COLUMN()-1,0)","v":16},{"$f":"VLOOKUP($B15,Store!$B$6:$AG$308,COLUMN()-1,0)","v":10},{"$f":"VLOOKUP($B15,Store!$B$6:$AG$308,COLUMN()-1,0)","v":0.75},{"$f":"VLOOKUP($B15,Store!$B$6:$AG$308,COLUMN()-1,0)","v":"Jacquard"},{"$f":"VLOOKUP($B15,Store!$B$6:$AG$308,COLUMN()-1,0)","v":"Normal"},null,null,{"$f":"SUMIFS(Store!$AD$6:$AD$308,Store!$B$6:$B$308,Rassed!B15,Store!$AH$6:$AH$308,\"اضافه\")","v":30},{"$f":"SUMIFS(Store!$AD$6:$AD$308,Store!$B$6:$B$308,Rassed!B15,Store!$AN$6:$AN$308,\"صرف\")","v":30},0]
{"$rows_left_out":84}
{"sheet":"بطاقه حركه صنف","index":2,"n_rows":8,"n_cols":7,"rows_kept":8,"cut":false,"hidden":false,"merged":[[6,3,6,4],[6,5,7,5],[6,6,7,6]]}
[]
[]
[null,null,"كود الصنف"]
[]
[null,null,"عميل"]
[]
[null,null,null,"الحركه",null,"الرصيد","اسم العميل"]
[null,null,"تاريخ","اضافه","صرف"]