{"text_format":"1","workbook":"xlsx","n_sheets":3,"sheets":["النوادي","الحركة","الطلبات"],"not_rendered":{"charts":0,"images":0,"macros":0,"external_links":0,"defined_names":3,"comments":0,"pivot_tables":0},"unopened":[],"bounds":{"document_bytes":16777216,"sheet_cells":100000,"rows_first":2000,"rows_last":500,"rows_between":2000,"halvings":0,"cell_chars":16384,"cell_head_chars":4096},"cells_cut":0,"cells_raw":0,"read":"whole","date_system":"1900"}

{"sheet":"النوادي","index":0,"n_rows":6,"n_cols":5,"rows_kept":6,"cut":false,"hidden":false,"merged":[]}
["الكود","المحافظة","اسم النادي","المنطقة","القطعة"]
[1,"القاهرة","طيور الجنة 1","فيصل",1]
[2,"الإسكندرية","طيور الجنة 2","الكورنيش",1]
[3,"الغربية","طيور الجنة 3","طنطا",1]
[4,"الشرقية","طيور الجنة 4","الزقازيق",2]
[5,"الدقهلية","طيور الجنة 5","المنصورة",2]

{"sheet":"الحركة","index":1,"n_rows":10,"n_cols":11,"rows_kept":10,"cut":false,"hidden":false,"merged":[]}
["الكود","اسم \nالنادي","محافظة","المنطقة","القطعة","التاريخ","رقم العقد","الشركة الموردة","نوع العقد","الحالة","ملاحظات"]
[1,{"$f":"VLOOKUP(A2,nady,3,1)","v":"طيور الجنة 1"},{"$f":"VLOOKUP(A2,nady,2,1)","v":"القاهرة"},{"$f":"VLOOKUP(A2,nady,4,1)","v":"فيصل"},{"$f":"VLOOKUP(A2,nady,5,0)","v":1},2005,11,"العين","دائم","صيانة"]
[2,"طيور الجنة 2","الإسكندرية","الكورنيش",1,2011,11,"الإخلاص 1","دائم","صيانة"]
[3,"طيور الجنة 3","الغربية","طنطا",1,2008,11,"الإخلاص 2","مؤقت","استبدال"]
[4,"طيور الجنة 4","الشرقية","الزقازيق",2,2008,11,"الإخلاص 3","مؤقت","استبدال"]
[5,"طيور الجنة 5","الدقهلية","المنصورة",2,2008,11,"الإخلاص 4","مؤقت","استبدال"]
[2,"طيور الجنة 2","الإسكندرية","الكورنيش",1,2015,11,"الإخلاص 5","مؤقت","استبدال"]
[1,"طيور الجنة 1","القاهرة","فيصل",1,2011,11,"الإخلاص 6","مؤقت","استبدال"]
[1,"طيور الجنة 1","القاهرة","فيصل",1,2016,11,"الإخلاص 7","مؤقت","استبدال"]
[5,"طيور الجنة 5","الدقهلية","المنصورة",2,2018,11,"الإخلاص 8","مؤقت","استبدال"]

{"sheet":"الطلبات","index":2,"n_rows":3000,"n_cols":9,"rows_kept":3000,"cut":false,"hidden":false,"merged":[]}
["الكود","اسم النادي","المحافظة","المنطقة","القطعة","التواريخ","الحالة","تاريخ الطلب","القرار"]
[1,{"$f":"IFERROR(VLOOKUP(A2,nady,3,1),\"\")","v":"طيور الجنة 1"},{"$f":"IFERROR(VLOOKUP(A2,nady,2,1),\"\")","v":"القاهرة"},{"$f":"IFERROR(VLOOKUP(A2,nady,4,1),\"\")","v":"فيصل"},{"$f":"IFERROR(VLOOKUP(A2,nady,5,1),\"\")","v":1},{"$f":"_xlfn.TEXTJOIN(\"-\",TRUE,IF(الحركة!$A$2:$A$10=A2,الحركة!$F$2:$F$10,\"\"))","v":"2005-2011-2008-2008-2008-2015-2011-2016-2018"},{"$f":"IFERROR(LOOKUP(2,1/(الحركة!$A$2:$A$10=A2),الحركة!$J$2:$J$10),\"\")","v":"استبدال"}]
[5,"طيور الجنة 5","الدقهلية","المنصورة",2,{"$f":"_xlfn.TEXTJOIN(\"-\",TRUE,IF(الحركة!$A$2:$A$10=A3,الحركة!$F$2:$F$10,\"\"))","v":""},{"$f":"IFERROR(LOOKUP(2,1/(الحركة!$A$2:$A$10=A3),الحركة!$J$2:$J$10),\"\")","v":"استبدال"}]
[null,"","","","",{"$f":"_xlfn.TEXTJOIN(\"-\",TRUE,IF(الحركة!$A$2:$A$10=A4,الحركة!$F$2:$F$10,\"\"))","v":""},{"$f":"IFERROR(LOOKUP(2,1/(الحركة!$A$2:$A$10=A4),الحركة!$J$2:$J$10),\"\")","v":""}]
[null,"","","","",{"$f":"_xlfn.TEXTJOIN(\"-\",TRUE,IF(الحركة!$A$2:$A$10=A5,الحركة!$F$2:$F$10,\"\"))","v":""},{"$f":"IFERROR(LOOKUP(2,1/(الحركة!$A$2:$A$10=A5),الحركة!$J$2:$J$10),\"\")","v":""}]
[null,"","","","",{"$f":"_xlfn.TEXTJOIN(\"-\",TRUE,IF(الحركة!$A$2:$A$10=A6,الحركة!$F$2:$F$10,\"\"))","v":""},{"$f":"IFERROR(LOOKUP(2,1/(الحركة!$A$2:$A$10=A6),الحركة!$J$2:$J$10),\"\")","v":""}]
[null,"","","","",{"$f":"_xlfn.TEXTJOIN(\"-\",TRUE,IF(الحركة!$A$2:$A$10=A7,الحركة!$F$2:$F$10,\"\"))","v":""},{"$f":"IFERROR(LOOKUP(2,1/(الحركة!$A$2:$A$10=A7),الحركة!$J$2:$J$10),\"\")","v":""}]
[null,"","","",""]
[null,"","","",""]
[null,"","","",""]
[null,"","","",""]
[null,"","","",""]
[null,"","","",""]
[null,"","","",""]
[null,"","","",""]
[null,"","","",""]
[null,"","","",""]
[null,"","","",""]
[null,"","","",""]
[null,"","","",""]
[null,"","","",""]
[null,"","","",""]
[null,"","","",""]
[null,"","","",""]
[null,"","","",""]
[null,"","","",""]
[null,"","","",""]
[null,"","","",""]
[null,"","","",""]
[null,"","","",""]
[null,"","","",""]
[null,"","","",""]
[null,"","","",""]
[null,"","","",""]
[null,"","","",""]
[null,"","","",""]
[null,"","","",""]
[null,"","","",""]
[null,"","","",""]
[null,"","","",""]
[null,"","","",""]
[null,"","","",""]
[null,"","","",""]
[null,"","","",""]
[null,"","","",""]
[null,"","","",""]
[null,"","","",""]
[null,"","","",""]
[null,"","","",""]
[null,"","","",""]
[null,"","","",""]
[null,"","","",""]
[null,"","","",""]
[null,"","","",""]
[null,"","","",""]
[null,"","","",""]
[null,"","","",""]
[null,"","","",""]
[null,"","","",""]
[null,"","","",""]
[null,"","","",""]
[null,"","","",""]
[null,"","","",""]
[null,"","","",""]
[null,"","","",""]
[null,{"$f":"IFERROR(VLOOKUP(A66,nady,3,1),\"\")","v":""},{"$f":"IFERROR(VLOOKUP(A66,nady,2,1),\"\")","v":""},{"$f":"IFERROR(VLOOKUP(A66,nady,4,1),\"\")","v":""},{"$f":"IFERROR(VLOOKUP(A66,nady,5,1),\"\")","v":""}]
[null,"","","",""]
[null,"","","",""]
[null,"","","",""]
[null,"","","",""]
[null,"","","",""]
[null,"","","",""]
[null,"","","",""]
[null,"","","",""]
[null,"","","",""]
[null,"","","",""]
[null,"","","",""]
[null,"","","",""]
[null,"","","",""]
[null,"","","",""]
[null,"","","",""]
[null,"","","",""]
[null,"","","",""]
[null,"","","",""]
[null,"","","",""]
[null,"","","",""]
[null,"","","",""]
[null,"","","",""]
[null,"","","",""]
[null,"","","",""]
[null,"","","",""]
[null,"","","",""]
[null,"","","",""]
[null,"","","",""]
[null,"","","",""]
[null,"","","",""]
[null,"","","",""]
[null,"","","",""]
[null,"","","",""]
[null,"","","",""]
[null,"","","",""]
[null,"","","",""]
[null,"","","",""]
[null,"","","",""]
[null,"","","",""]
[null,"","","",""]
[null,"","","",""]
[null,"","","",""]
[null,"","","",""]
[null,"","","",""]
[null,"","","",""]
[null,"","","",""]
[null,"","","",""]
[null,"","","",""]
[null,"","","",""]
[null,"","","",""]
[null,"","","",""]
[null,"","","",""]
[null,"","","",""]
[null,"","","",""]
[null,"","","",""]
[null,"","","",""]
[null,"","","",""]
[null,"","","",""]
[null,"","","",""]
[null,"","","",""]
[null,"","","",""]
[null,"","","",""]
[null,"","","",""]
[null,{"$f":"IFERROR(VLOOKUP(A130,nady,3,1),\"\")","v":""},{"$f":"IFERROR(VLOOKUP(A130,nady,2,1),\"\")","v":""},{"$f":"IFERROR(VLOOKUP(A130,nady,4,1),\"\")","v":""},{"$f":"IFERROR(VLOOKUP(A130,nady,5,1),\"\")","v":""}]
[null,"","","",""]
[null,"","","",""]
[null,"","","",""]
[null,"","","",""]
[null,"","","",""]
[null,"","","",""]
[null,"","","",""]
[null,"","","",""]
[null,"","","",""]
[null,"","","",""]
[null,"","","",""]
[null,"","","",""]
[null,"","","",""]
[null,"","","",""]
[null,"","","",""]
[null,"","","",""]
[null,"","","",""]
[null,"","","",""]
[null,"","","",""]
[null,"","","",""]
[null,"","","",""]
[null,"","","",""]
[null,"","","",""]
[null,"","","",""]
[null,"","","",""]
[null,"","","",""]
[null,"","","",""]
[null,"","","",""]
[null,"","","",""]
[null,"","","",""]
[null,"","","",""]
[null,"","","",""]
[null,"","","",""]
[null,"","","",""]
[null,"","","",""]
[null,"","","",""]
[null,"","","",""]
[null,"","","",""]
[null,"","","",""]
[null,"","","",""]
[null,"","","",""]
[null,"","","",""]
[null,"","","",""]
[null,"","","",""]
[null,"","","",""]
[null,"","","",""]
[null,"","","",""]
[null,"","","",""]
[null,"","","",""]
[null,"","","",""]
[null,"","","",""]
[null,"","","",""]
[null,"","","",""]
[null,"","","",""]
[null,"","","",""]
[null,"","","",""]
[null,"","","",""]
[null,"","","",""]
[null,"","","",""]
[null,"","","",""]
[null,"","","",""]
[null,"","","",""]
[null,"","","",""]
[null,{"$f":"IFERROR(VLOOKUP(A194,nady,3,1),\"\")","v":""},{"$f":"IFERROR(VLOOKUP(A194,nady,2,1),\"\")","v":""},{"$f":"IFERROR(VLOOKUP(A194,nady,4,1),\"\")","v":""},{"$f":"IFERROR(VLOOKUP(A194,nady,5,1),\"\")","v":""}]
[null,"","","",""]
[null,"","","",""]
[null,"","","",""]
[null,"","","",""]
[null,"","","",""]
[null,"","","",""]
[null,"","","",""]
[null,"","","",""]
[null,"","","",""]
[null,"","","",""]
[null,"","","",""]
[null,"","","",""]
[null,"","","",""]
[null,"","","",""]
[null,"","","",""]
[null,"","","",""]
[null,"","","",""]
[null,"","","",""]
[null,"","","",""]
[null,"","","",""]
[null,"","","",""]
[null,"","","",""]
[null,"","","",""]
[null,"","","",""]
[null,"","","",""]
[null,"","","",""]
[null,"","","",""]
[null,"","","",""]
[null,"","","",""]
[null,"","","",""]
[null,"","","",""]
[null,"","","",""]
[null,"","","",""]
[null,"","","",""]
[null,"","","",""]
[null,"","","",""]
[null,"","","",""]
[null,"","","",""]
[null,"","","",""]
[null,"","","",""]
[null,"","","",""]
[null,"","","",""]
[null,"","","",""]
[null,"","","",""]
[null,"","","",""]
[null,"","","",""]
[null,"","","",""]
[null,"","","",""]
[null,"","","",""]
[null,"","","",""]
[null,"","","",""]
[null,"","","",""]
[null,"","","",""]
[null,"","","",""]
[null,"","","",""]
[null,"","","",""]
[null,"","","",""]
[null,"","","",""]
[null,"","","",""]
[null,"","","",""]
[null,"","","",""]
[null,"","","",""]
[null,"","","",""]
[null,{"$f":"IFERROR(VLOOKUP(A258,nady,3,1),\"\")","v":""},{"$f":"IFERROR(VLOOKUP(A258,nady,2,1),\"\")","v":""},{"$f":"IFERROR(VLOOKUP(A258,nady,4,1),\"\")","v":""},{"$f":"IFERROR(VLOOKUP(A258,nady,5,1),\"\")","v":""}]
[null,"","","",""]
[null,"","","",""]
[null,"","","",""]
[null,"","","",""]
[null,"","","",""]
[null,"","","",""]
[null,"","","",""]
[null,"","","",""]
[null,"","","",""]
[null,"","","",""]
[null,"","","",""]
[null,"","","",""]
[null,"","","",""]
[null,"","","",""]
[null,"","","",""]
[null,"","","",""]
[null,"","","",""]
[null,"","","",""]
[null,"","","",""]
[null,"","","",""]
[null,"","","",""]
[null,"","","",""]
[null,"","","",""]
[null,"","","",""]
[null,"","","",""]
[null,"","","",""]
[null,"","","",""]
[null,"","","",""]
[null,"","","",""]
[null,"","","",""]
[null,"","","",""]
[null,"","","",""]
[null,"","","",""]
[null,"","","",""]
[null,"","","",""]
[null,"","","",""]
[null,"","","",""]
[null,"","","",""]
[null,"","","",""]
[null,"","","",""]
[null,"","","",""]
[null,"","","",""]
[null,"","","",""]
[null,"","","",""]
[null,"","","",""]
[null,"","","",""]
[null,"","","",""]
[null,"","","",""]
[null,"","","",""]
[null,"","","",""]
[null,"","","",""]
[null,"","","",""]
[null,"","","",""]
[null,"","","",""]
[null,"","","",""]
[null,"","","",""]
[null,"","","",""]
[null,"","","",""]
[null,"","","",""]
[null,"","","",""]
[null,"","","",""]
[null,"","","",""]
[null,"","","",""]
[null,{"$f":"IFERROR(VLOOKUP(A322,nady,3,1),\"\")","v":""},{"$f":"IFERROR(VLOOKUP(A322,nady,2,1),\"\")","v":""},{"$f":"IFERROR(VLOOKUP(A322,nady,4,1),\"\")","v":""},{"$f":"IFERROR(VLOOKUP(A322,nady,5,1),\"\")","v":""}]
[null,"","","",""]
[null,"","","",""]
[null,"","","",""]
[null,"","","",""]
[null,"","","",""]
[null,"","","",""]
[null,"","","",""]
[null,"","","",""]
[null,"","","",""]
[null,"","","",""]
[null,"","","",""]
[null,"","","",""]
[null,"","","",""]
[null,"","","",""]
[null,"","","",""]
[null,"","","",""]
[null,"","","",""]
[null,"","","",""]
[null,"","","",""]
[null,"","","",""]
[null,"","","",""]
[null,"","","",""]
[null,"","","",""]
[null,"","","",""]
[null,"","","",""]
[null,"","","",""]
[null,"","","",""]
[null,"","","",""]
[null,"","","",""]
[null,"","","",""]
[null,"","","",""]
[null,"","","",""]
[null,"","","",""]
[null,"","","",""]
[null,"","","",""]
[null,"","","",""]
[null,"","","",""]
[null,"","","",""]
[null,"","","",""]
[null,"","","",""]
[null,"","","",""]
[null,"","","",""]
[null,"","","",""]
[null,"","","",""]
[null,"","","",""]
[null,"","","",""]
[null,"","","",""]
[null,"","","",""]
[null,"","","",""]
[null,"","","",""]
[null,"","","",""]
[null,"","","",""]
[null,"","","",""]
[null,"","","",""]
[null,"","","",""]
[null,"","","",""]
[null,"","","",""]
[null,"","","",""]
[null,"","","",""]
[null,"","","",""]
[null,"","","",""]
[null,"","","",""]
[null,"","","",""]
[null,{"$f":"IFERROR(VLOOKUP(A386,nady,3,1),\"\")","v":""},{"$f":"IFERROR(VLOOKUP(A386,nady,2,1),\"\")","v":""},{"$f":"IFERROR(VLOOKUP(A386,nady,4,1),\"\")","v":""},{"$f":"IFERROR(VLOOKUP(A386,nady,5,1),\"\")","v":""}]
[null,"","","",""]
[null,"","","",""]
[null,"","","",""]
[null,"","","",""]
[null,"","","",""]
[null,"","","",""]
[null,"","","",""]
[null,"","","",""]
[null,"","","",""]
[null,"","","",""]
[null,"","","",""]
[null,"","","",""]
[null,"","","",""]
[null,"","","",""]
{"$rows_left_out":2600}