{"text_format":"1","workbook":"xlsx","n_sheets":4,"sheets":["الفاتورة","مشتريات","مبيعات","رصيد"],"not_rendered":{"charts":0,"images":1,"macros":0,"external_links":2,"defined_names":2,"comments":0,"pivot_tables":0},"unopened":[],"bounds":{"document_bytes":16777216,"sheet_cells":100000,"rows_first":2000,"rows_last":500,"rows_between":2000,"halvings":0,"cell_chars":16384,"cell_head_chars":4096},"cells_cut":0,"cells_raw":0,"read":"whole","date_system":"1900"}

{"sheet":"الفاتورة","index":0,"n_rows":14,"n_cols":12,"rows_kept":14,"cut":false,"hidden":false,"merged":[]}
[null,null,null,"زيت"]
["صويا سايب"]
[null,{"$f":"IFERROR(INDEX(رصيد!$C$2:$C$48,SMALL(IF($D$1=رصيد!$B$2:$B$48,ROW(رصيد!$C$2:$C$48)-1),COLUMN(A1))),\"\")","v":"زيتون الحواج"},{"$f":"IFERROR(INDEX(رصيد!$C$2:$C$48,SMALL(IF($D$1=رصيد!$B$2:$B$48,ROW(رصيد!$C$2:$C$48)-1),COLUMN(B1))),\"\")","v":"زيتون حدائق سوريا"},{"$f":"IFERROR(INDEX(رصيد!$C$2:$C$48,SMALL(IF($D$1=رصيد!$B$2:$B$48,ROW(رصيد!$C$2:$C$48)-1),COLUMN(C1))),\"\")","v":"حار"}]
[null,{"$f":"IFERROR(INDEX(رصيد!$C$2:$C$48,SMALL(IF($D$1=رصيد!$B$2:$B$48,ROW(رصيد!$C$2:$C$48)-1),COLUMN(D1))),\"\")","v":"صني"},{"$f":"IFERROR(INDEX(رصيد!$C$2:$C$48,SMALL(IF($D$1=رصيد!$B$2:$B$48,ROW(رصيد!$C$2:$C$48)-1),COLUMN(E1))),\"\")","v":"عافية 3 لتر"},{"$f":"IFERROR(INDEX(رصيد!$C$2:$C$48,SMALL(IF($D$1=رصيد!$B$2:$B$48,ROW(رصيد!$C$2:$C$48)-1),COLUMN(F1))),\"\")","v":"الأصيل 3 لتر"},null,null,null,null,null,null,null,"بيض"]
[null,{"$f":"IFERROR(INDEX(رصيد!$C$2:$C$48,SMALL(IF($D$1=رصيد!$B$2:$B$48,ROW(رصيد!$C$2:$C$48)-1),COLUMN(G1))),\"\")","v":"سندباد"},{"$f":"IFERROR(INDEX(رصيد!$C$2:$C$48,SMALL(IF($D$1=رصيد!$B$2:$B$48,ROW(رصيد!$C$2:$C$48)-1),COLUMN(H1))),\"\")","v":"مبروكة"},{"$f":"IFERROR(INDEX(رصيد!$C$2:$C$48,SMALL(IF($D$1=رصيد!$B$2:$B$48,ROW(رصيد!$C$2:$C$48)-1),COLUMN(I1))),\"\")","v":"صولو"},null,null,null,null,null,null,null,"حلاوة طحينية"]
[null,{"$f":"IFERROR(INDEX(رصيد!$C$2:$C$48,SMALL(IF($D$1=رصيد!$B$2:$B$48,ROW(رصيد!$C$2:$C$48)-1),COLUMN(J1))),\"\")","v":"صويا سايب"},{"$f":"IFERROR(INDEX(رصيد!$C$2:$C$48,SMALL(IF($D$1=رصيد!$B$2:$B$48,ROW(رصيد!$C$2:$C$48)-1),COLUMN(K1))),\"\")","v":""},{"$f":"IFERROR(INDEX(رصيد!$C$2:$C$48,SMALL(IF($D$1=رصيد!$B$2:$B$48,ROW(رصيد!$C$2:$C$48)-1),COLUMN(L1))),\"\")","v":""},null,null,null,null,null,null,null,"خل"]
[null,{"$f":"IFERROR(INDEX(رصيد!$C$2:$C$48,SMALL(IF($D$1=رصيد!$B$2:$B$48,ROW(رصيد!$C$2:$C$48)-1),COLUMN(M1))),\"\")","v":""},{"$f":"IFERROR(INDEX(رصيد!$C$2:$C$48,SMALL(IF($D$1=رصيد!$B$2:$B$48,ROW(رصيد!$C$2:$C$48)-1),COLUMN(N1))),\"\")","v":""},{"$f":"IFERROR(INDEX(رصيد!$C$2:$C$48,SMALL(IF($D$1=رصيد!$B$2:$B$48,ROW(رصيد!$C$2:$C$48)-1),COLUMN(O1))),\"\")","v":""},null,null,null,null,null,null,null,"زبدة"]
[null,{"$f":"IFERROR(INDEX(رصيد!$C$2:$C$48,SMALL(IF($D$1=رصيد!$B$2:$B$48,ROW(رصيد!$C$2:$C$48)-1),COLUMN(P1))),\"\")","v":""},null,null,null,null,null,null,null,null,null,"زيت"]
[null,null,null,null,null,null,null,null,null,null,null,"سمنة"]
[null,null,null,null,null,null,null,null,null,null,null,"طحينة"]
[null,null,null,null,null,null,null,null,null,null,null,"عسل تمر"]
[null,null,null,null,null,null,null,null,null,null,null,"عسل قصب"]
[null,null,null,null,null,null,null,null,null,null,null,"عسل نحل"]
[null,null,null,null,null,null,null,null,null,null,null,"مفتقة"]

{"sheet":"مشتريات","index":1,"n_rows":0,"n_cols":0,"rows_kept":0,"cut":false,"hidden":false,"merged":[]}

{"sheet":"مبيعات","index":2,"n_rows":0,"n_cols":0,"rows_kept":0,"cut":false,"hidden":false,"merged":[]}

{"sheet":"رصيد","index":3,"n_rows":51,"n_cols":5,"rows_kept":51,"cut":false,"hidden":false,"merged":[]}
["كود الصنف","وصف الصنف","الصنف","السعر","الكمية"]
[1,"بيض","بلدي"]
[2,"بيض","مزارع"]
[3,"حلاوة طحينية","تركي علبة كبيرة شيكولاتة"]
[4,"حلاوة طحينية","تركي علبة كبيرة مكسرات"]
[5,"حلاوة طحينية","تركي علبة كبيرة سادة"]
[6,"حلاوة طحينية","تركي علبة صغيرة شيكولاتة "]
[7,"حلاوة طحينية","تركي علبة صغيرة مكسرات"]
[8,"حلاوة طحينية","تركي علبة صغيرة سادة"]
[9,"حلاوة طحينية","قطع"]
[10,"حلاوة طحينية","الرشيدي نص كيلو"]
[11,"حلاوة طحينية","تركي ربع كيلو"]
[12,"حلاوة طحينية","النصر علبة كبيرة سادة"]
[13,"حلاوة طحينية","النصر علبة صغيرة سادة"]
[14,"حلاوة طحينية","النصر علبة صغيرة بالشيكولاتة"]
[15,"حلاوة طحينية","زنك 4 كيلو تركي بالشيكولاتة"]
[16,"حلاوة طحينية","زنك 4 كيلو تركي سادة"]
[17,"حلاوة طحينية","زنك 4 كيلو تركي بالمكسرات"]
[18,"خل","بيور"]
[19,"خل","المهندس"]
[20,"زبدة","صفراء نيوزيلاندي"]
[21,"زيت","زيتون الحواج"]
[22,"زيت","زيتون حدائق سوريا"]
[23,"زيت","حار"]
[24,"زيت","صني"]
[25,"زيت","عافية 3 لتر"]
[26,"زيت","الأصيل 3 لتر"]
[27,"زيت","سندباد"]
[28,"زيت","مبروكة"]
[29,"زيت","صولو"]
[30,"زيت","صويا سايب"]
[31,"سمنة","جنة 2 كيلو"]
[32,"سمنة","الهانم 3 كيلو"]
[33,"طحينة","سمسم سايبة"]
[34,"عسل تمر","دبس التمر"]
[35,"عسل قصب","إسود"]
[36,"عسل نحل","بشمع نص كيلو"]
[37,"عسل نحل","حبة البركة نص كيلو"]
[38,"عسل نحل","زهرة البرسيم نص كيلو"]
[39,"عسل نحل","موالح نص كيلو"]
[40,"عسل نحل","البردقوس نص كيلو"]
[41,"عسل نحل","حبة البركة  كيلو"]
[42,"عسل نحل","زهرة البرسيم  كيلو"]
[43,"عسل نحل","موالح  كيلو"]
[44,"عسل نحل","البردقوس  كيلو"]
[45,"عسل نحل","جبلي كيلو"]
[46,"عسل نحل","صحراوي نص كيلو"]
[47,"مفتقة","مفتقة عسل إسود"]
[]
[]
[null,null," "]