{"text_format":"1","workbook":"xlsx","n_sheets":4,"sheets":["بيانات الموظفين","جدول الإجازات","الإعدادات","الإحصائية"],"not_rendered":{"charts":0,"images":0,"macros":1,"external_links":0,"defined_names":0,"comments":0,"pivot_tables":0},"unopened":[],"bounds":{"document_bytes":16777216,"sheet_cells":100000,"rows_first":2000,"rows_last":500,"rows_between":2000,"halvings":0,"cell_chars":16384,"cell_head_chars":4096},"cells_cut":0,"cells_raw":0,"read":"whole","date_system":"1900"}

{"sheet":"بيانات الموظفين","index":0,"n_rows":117,"n_cols":8,"rows_kept":117,"cut":false,"hidden":false,"merged":[[1,1,1,7]]}
[]
[null,"القائمة الرئيسية"]
[null,"كود الموظف","اسم الموظف","المسمى الوظيفي","الرقم الوظيفي","تاريخ التعيين","عدد أيام الإجازة خلال السنة","عدد أيام الإجازات المتبقي"]
[null,{"$f":"ROW()-3","v":1},"محمد1","مدرس1",440,"2005-04-09",7,{"$f":"VLOOKUP(Table1[[#This Row],[كود الموظف]],Table3[],18,FALSE)","v":7}]
[null,2,"محمد2","مدرس2",5062,"30/03/1993",7,{"$f":"VLOOKUP(Table1[[#This Row],[كود الموظف]],Table3[],18,FALSE)","v":7}]
[null,3,"محمد3","مدرس3",5290,"16/02/2003",7,{"$f":"VLOOKUP(Table1[[#This Row],[كود الموظف]],Table3[],18,FALSE)","v":7}]
[null,4,"محمد4","مدرس4",11271,"2001-01-09",7,{"$f":"VLOOKUP(Table1[[#This Row],[كود الموظف]],Table3[],18,FALSE)","v":7}]
[null,5,"محمد5","مدرس5",11713,"13/02/1999",7,{"$f":"VLOOKUP(Table1[[#This Row],[كود الموظف]],Table3[],18,FALSE)","v":7}]
[null,6,"محمد6","مدرس6",13265,"17/04/2006",7,{"$f":"VLOOKUP(Table1[[#This Row],[كود الموظف]],Table3[],18,FALSE)","v":7}]
[null,7,"محمد7","مدرس7",13826,"2006-02-04",7,{"$f":"VLOOKUP(Table1[[#This Row],[كود الموظف]],Table3[],18,FALSE)","v":7}]
[null,8,"محمد8","مدرس8",64103,"2005-04-09",7,{"$f":"VLOOKUP(Table1[[#This Row],[كود الموظف]],Table3[],18,FALSE)","v":7}]
[null,9,"محمد9","مدرس9",64602,"2009-01-11",7,{"$f":"VLOOKUP(Table1[[#This Row],[كود الموظف]],Table3[],18,FALSE)","v":7}]
[null,10,"محمد10","مدرس10",64830,"2008-07-09",7,{"$f":"VLOOKUP(Table1[[#This Row],[كود الموظف]],Table3[],18,FALSE)","v":7}]
[null,11,"محمد11","مدرس11",65658,"19/10/2009",7,{"$f":"VLOOKUP(Table1[[#This Row],[كود الموظف]],Table3[],18,FALSE)","v":7}]
[null,12,"محمد12","مدرس12",65662,"2007-04-09",7,{"$f":"VLOOKUP(Table1[[#This Row],[كود الموظف]],Table3[],18,FALSE)","v":7}]
[null,13,"محمد13","مدرس13",65663,"15/10/2008",7,{"$f":"VLOOKUP(Table1[[#This Row],[كود الموظف]],Table3[],18,FALSE)","v":7}]
[null,14,"محمد14","مدرس14",65666,"2006-05-12",7,{"$f":"VLOOKUP(Table1[[#This Row],[كود الموظف]],Table3[],18,FALSE)","v":7}]
[null,15,"محمد15","مدرس15",65668,"2006-10-11",7,{"$f":"VLOOKUP(Table1[[#This Row],[كود الموظف]],Table3[],18,FALSE)","v":7}]
[null,16,"محمد16","مدرس16",65669,"2006-02-10",7,{"$f":"VLOOKUP(Table1[[#This Row],[كود الموظف]],Table3[],18,FALSE)","v":7}]
[null,17,"محمد17","مدرس17",65670,"2008-01-09",7,{"$f":"VLOOKUP(Table1[[#This Row],[كود الموظف]],Table3[],18,FALSE)","v":7}]
{"$rows_left_out":98}
{"sheet":"جدول الإجازات","index":1,"n_rows":130,"n_cols":40,"rows_kept":130,"cut":false,"hidden":false,"merged":[[5,1,6,1],[5,2,6,2],[5,3,6,3],[1,1,1,36],[3,6,4,13]]}
[]
[null,"جدول الاجازات"]
[]
[null,null,"الشهر","السنة",null,null,{"$f":"VLOOKUP($C$5,الإعدادات!A1:B12,2,FALSE)","v":"يناير"}]
[null,null,1,2021]
[null,"كود الموظف","اسم الموظف","المسمى الوظيفي",{"$f":"TEXT(E7,\"DDD\")","v":"الجمعة"},{"$f":"TEXT(F7,\"DDD\")","v":"السبت"},"الأحد","الإثنين","الثلاثاء","الأربعاء","الخميس","الجمعة","السبت","الأحد","الإثنين","الثلاثاء","الأربعاء","الخميس","الجمعة","السبت","الأحد","الإثنين","الثلاثاء","الأربعاء","الخميس","الجمعة","السبت","الأحد","الإثنين","الثلاثاء","الأربعاء","الخميس","الجمعة","السبت","الأحد"]
[null,null,null,null,{"$f":"DATE($D$5,$C$5,COLUMN(A:A))","v":"2021-01-01"},{"$f":"DATE($D$5,$C$5,COLUMN(B:B))","v":"2021-01-02"},"2021-01-03","2021-01-04","2021-01-05","2021-01-06","2021-01-07","2021-01-08","2021-01-09","2021-01-10","2021-01-11","2021-01-12","2021-01-13","2021-01-14","2021-01-15","2021-01-16","2021-01-17","2021-01-18","2021-01-19","2021-01-20","2021-01-21","2021-01-22","2021-01-23","2021-01-24","2021-01-25","2021-01-26","2021-01-27","2021-01-28","2021-01-29","2021-01-30","2021-01-31","المجموع","الرصيد المتبقي"]
[null,"Column1","Column2","Column3","Column6","Column7","Column8","Column9","Column10","Column11","Column12","Column13","Column14","Column15","Column16","Column17","Column18","Column19","Column20","Column21","Column22","Column23","Column24","Column25","Column26","Column27","Column28","Column29","Column30","Column31","Column32","Column33","Column34","Column35","Column36","Column37","Column38"]
[null,{"$f":"ROW()-8","v":1},{"$f":"IFERROR(VLOOKUP(Table2[[#This Row],[Column1]],'بيانات الموظفين'!$B$4:$C$117,2,FALSE),\"\")","v":"محمد1"},{"$f":"IFERROR(VLOOKUP(Table2[[#This Row],[Column1]],'بيانات الموظفين'!$B$4:$D$117,3,FALSE),\"\")","v":"مدرس1"},null,null,null,null,null,null,null,null,null,null,null,null,null,null,null,null,null,null,null,null,null,null,null,null,null,null,null,null,null,null,null,{"$f":"COUNTA(E9:AI9)","v":0},{"$f":"VLOOKUP(Table2[[#This Row],[Column1]],Table3[],18,FALSE)","v":7},null,null,{"$f":"Table2[[#This Row],[Column37]]","v":0}]
[null,{"$f":"ROW()-8","v":2},{"$f":"IFERROR(VLOOKUP(Table2[[#This Row],[Column1]],'بيانات الموظفين'!$B$4:$C$117,2,FALSE),\"\")","v":"محمد2"},{"$f":"IFERROR(VLOOKUP(Table2[[#This Row],[Column1]],'بيانات الموظفين'!$B$4:$D$117,3,FALSE),\"\")","v":"مدرس2"},null,null,null,null,null,null,null,null,null,null,null,null,null,null,null,null,null,null,null,null,null,null,null,null,null,null,null,null,null,null,null,{"$f":"COUNTA(E10:AI10)","v":0},{"$f":"VLOOKUP(Table2[[#This Row],[Column1]],Table3[],18,FALSE)","v":7},null,null,{"$f":"Table2[[#This Row],[Column37]]","v":0}]
[null,3,{"$f":"IFERROR(VLOOKUP(Table2[[#This Row],[Column1]],'بيانات الموظفين'!$B$4:$C$117,2,FALSE),\"\")","v":"محمد3"},{"$f":"IFERROR(VLOOKUP(Table2[[#This Row],[Column1]],'بيانات الموظفين'!$B$4:$D$117,3,FALSE),\"\")","v":"مدرس3"},null,null,null,null,null,null,null,null,null,null,null,null,null,null,null,null,null,null,null,null,null,null,null,null,null,null,null,null,null,null,null,0,{"$f":"VLOOKUP(Table2[[#This Row],[Column1]],Table3[],18,FALSE)","v":7},null,null,{"$f":"Table2[[#This Row],[Column37]]","v":0}]
[null,4,{"$f":"IFERROR(VLOOKUP(Table2[[#This Row],[Column1]],'بيانات الموظفين'!$B$4:$C$117,2,FALSE),\"\")","v":"محمد4"},{"$f":"IFERROR(VLOOKUP(Table2[[#This Row],[Column1]],'بيانات الموظفين'!$B$4:$D$117,3,FALSE),\"\")","v":"مدرس4"},null,null,null,null,null,null,null,null,null,null,null,null,null,null,null,null,null,null,null,null,null,null,null,null,null,null,null,null,null,null,null,0,{"$f":"VLOOKUP(Table2[[#This Row],[Column1]],Table3[],18,FALSE)","v":7},null,null,{"$f":"Table2[[#This Row],[Column37]]","v":0}]
[null,5,{"$f":"IFERROR(VLOOKUP(Table2[[#This Row],[Column1]],'بيانات الموظفين'!$B$4:$C$117,2,FALSE),\"\")","v":"محمد5"},{"$f":"IFERROR(VLOOKUP(Table2[[#This Row],[Column1]],'بيانات الموظفين'!$B$4:$D$117,3,FALSE),\"\")","v":"مدرس5"},null,null,null,null,null,null,null,null,null,null,null,null,null,null,null,null,null,null,null,null,null,null,null,null,null,null,null,null,null,null,null,0,{"$f":"VLOOKUP(Table2[[#This Row],[Column1]],Table3[],18,FALSE)","v":7},null,null,{"$f":"Table2[[#This Row],[Column37]]","v":0}]
[null,6,{"$f":"IFERROR(VLOOKUP(Table2[[#This Row],[Column1]],'بيانات الموظفين'!$B$4:$C$117,2,FALSE),\"\")","v":"محمد6"},{"$f":"IFERROR(VLOOKUP(Table2[[#This Row],[Column1]],'بيانات الموظفين'!$B$4:$D$117,3,FALSE),\"\")","v":"مدرس6"},null,null,null,null,null,null,null,null,null,null,null,null,null,null,null,null,null,null,null,null,null,null,null,null,null,null,null,null,null,null,null,0,{"$f":"VLOOKUP(Table2[[#This Row],[Column1]],Table3[],18,FALSE)","v":7},null,null,{"$f":"Table2[[#This Row],[Column37]]","v":0}]
[null,7,{"$f":"IFERROR(VLOOKUP(Table2[[#This Row],[Column1]],'بيانات الموظفين'!$B$4:$C$117,2,FALSE),\"\")","v":"محمد7"},{"$f":"IFERROR(VLOOKUP(Table2[[#This Row],[Column1]],'بيانات الموظفين'!$B$4:$D$117,3,FALSE),\"\")","v":"مدرس7"},null,null,null,null,null,null,null,null,null,null,null,null,null,null,null,null,null,null,null,null,null,null,null,null,null,null,null,null,null,null,null,0,{"$f":"VLOOKUP(Table2[[#This Row],[Column1]],Table3[],18,FALSE)","v":7},null,null,{"$f":"Table2[[#This Row],[Column37]]","v":0}]
[null,8,{"$f":"IFERROR(VLOOKUP(Table2[[#This Row],[Column1]],'بيانات الموظفين'!$B$4:$C$117,2,FALSE),\"\")","v":"محمد8"},{"$f":"IFERROR(VLOOKUP(Table2[[#This Row],[Column1]],'بيانات الموظفين'!$B$4:$D$117,3,FALSE),\"\")","v":"مدرس8"},null,null,null,null,null,null,null,null,null,null,null,null,null,null,null,null,null,null,null,null,null,null,null,null,null,null,null,null,null,null,null,0,{"$f":"VLOOKUP(Table2[[#This Row],[Column1]],Table3[],18,FALSE)","v":7},null,null,{"$f":"Table2[[#This Row],[Column37]]","v":0}]
[null,9,{"$f":"IFERROR(VLOOKUP(Table2[[#This Row],[Column1]],'بيانات الموظفين'!$B$4:$C$117,2,FALSE),\"\")","v":"محمد9"},{"$f":"IFERROR(VLOOKUP(Table2[[#This Row],[Column1]],'بيانات الموظفين'!$B$4:$D$117,3,FALSE),\"\")","v":"مدرس9"},null,null,null,null,null,null,null,null,null,null,null,null,null,null,null,null,null,null,null,null,null,null,null,null,null,null,null,null,null,null,null,0,{"$f":"VLOOKUP(Table2[[#This Row],[Column1]],Table3[],18,FALSE)","v":7},null,null,{"$f":"Table2[[#This Row],[Column37]]","v":0}]
[null,10,{"$f":"IFERROR(VLOOKUP(Table2[[#This Row],[Column1]],'بيانات الموظفين'!$B$4:$C$117,2,FALSE),\"\")","v":"محمد10"},{"$f":"IFERROR(VLOOKUP(Table2[[#This Row],[Column1]],'بيانات الموظفين'!$B$4:$D$117,3,FALSE),\"\")","v":"مدرس10"},null,null,null,null,null,null,null,null,null,null,null,null,null,null,null,null,null,null,null,null,null,null,null,null,null,null,null,null,null,null,null,0,{"$f":"VLOOKUP(Table2[[#This Row],[Column1]],Table3[],18,FALSE)","v":7},null,null,{"$f":"Table2[[#This Row],[Column37]]","v":0}]
[null,11,{"$f":"IFERROR(VLOOKUP(Table2[[#This Row],[Column1]],'بيانات الموظفين'!$B$4:$C$117,2,FALSE),\"\")","v":"محمد11"},{"$f":"IFERROR(VLOOKUP(Table2[[#This Row],[Column1]],'بيانات الموظفين'!$B$4:$D$117,3,FALSE),\"\")","v":"مدرس11"},null,null,null,null,null,null,null,null,null,null,null,null,null,null,null,null,null,null,null,null,null,null,null,null,null,null,null,null,null,null,null,0,{"$f":"VLOOKUP(Table2[[#This Row],[Column1]],Table3[],18,FALSE)","v":7},null,null,{"$f":"Table2[[#This Row],[Column37]]","v":0}]
[null,12,{"$f":"IFERROR(VLOOKUP(Table2[[#This Row],[Column1]],'بيانات الموظفين'!$B$4:$C$117,2,FALSE),\"\")","v":"محمد12"},{"$f":"IFERROR(VLOOKUP(Table2[[#This Row],[Column1]],'بيانات الموظفين'!$B$4:$D$117,3,FALSE),\"\")","v":"مدرس12"},null,null,null,null,null,null,null,null,null,null,null,null,null,null,null,null,null,null,null,null,null,null,null,null,null,null,null,null,null,null,null,0,{"$f":"VLOOKUP(Table2[[#This Row],[Column1]],Table3[],18,FALSE)","v":7},null,null,{"$f":"Table2[[#This Row],[Column37]]","v":0}]
{"$rows_left_out":111}
{"sheet":"الإعدادات","index":2,"n_rows":12,"n_cols":2,"rows_kept":12,"cut":false,"hidden":true,"merged":[]}
[1,"يناير"]
[2,"فبراير"]
[3,"مارس"]
[4,"أبريل"]
[5,"مايو"]
[6,"يونيو"]
[7,"يوليو"]
[8,"أغسطس"]
[9,"سبتمبر"]
[10,"أكتوبر"]
[11,"نوفمبر"]
[12,"ديسمبر"]

{"sheet":"الإحصائية","index":3,"n_rows":118,"n_cols":19,"rows_kept":118,"cut":false,"hidden":false,"merged":[]}
[]
[null,"كود الموظف","اسم الموظف","المسمى الوظيفي ","Jan-21","Feb-21","Mar-21","Apr-21","May-21","Jun-21","Jul-21","Aug-21","Sep-21","Oct-21","Nov-21","Dec-21","المجموع","رصيد الإجازات","الرصيد المتبقي "]
[null,{"$f":"ROW()-2","v":1},{"$f":"IFERROR(VLOOKUP(Table3[[#This Row],[كود الموظف]],'بيانات الموظفين'!$B$4:$C$117,2,FALSE),\"\")","v":"محمد1"},{"$f":"IFERROR(VLOOKUP(Table3[[#This Row],[كود الموظف]],'بيانات الموظفين'!$B$4:$D$117,3,FALSE),\"\")","v":"مدرس1"},null,null,null,null,null,null,null,null,null,null,null,null,{"$f":"SUM(Table3[[#This Row],[Jan-21]:[Dec-21]])","v":0},{"$f":"IFERROR(VLOOKUP(Table3[[#This Row],[كود الموظف]],'بيانات الموظفين'!$B$4:$G$117,6,FALSE),\"\")","v":7},{"$f":"R3-Q3","v":7}]
[null,{"$f":"ROW()-2","v":2},{"$f":"IFERROR(VLOOKUP(Table3[[#This Row],[كود الموظف]],'بيانات الموظفين'!$B$4:$C$117,2,FALSE),\"\")","v":"محمد2"},{"$f":"IFERROR(VLOOKUP(Table3[[#This Row],[كود الموظف]],'بيانات الموظفين'!$B$4:$D$117,3,FALSE),\"\")","v":"مدرس2"},null,null,null,null,null,null,null,null,null,null,null,null,{"$f":"SUM(Table3[[#This Row],[Jan-21]:[Dec-21]])","v":0},{"$f":"IFERROR(VLOOKUP(Table3[[#This Row],[كود الموظف]],'بيانات الموظفين'!$B$4:$G$117,6,FALSE),\"\")","v":7},7]
[null,3,{"$f":"IFERROR(VLOOKUP(Table3[[#This Row],[كود الموظف]],'بيانات الموظفين'!$B$4:$C$117,2,FALSE),\"\")","v":"محمد3"},{"$f":"IFERROR(VLOOKUP(Table3[[#This Row],[كود الموظف]],'بيانات الموظفين'!$B$4:$D$117,3,FALSE),\"\")","v":"مدرس3"},null,null,null,null,null,null,null,null,null,null,null,null,{"$f":"SUM(Table3[[#This Row],[Jan-21]:[Dec-21]])","v":0},{"$f":"IFERROR(VLOOKUP(Table3[[#This Row],[كود الموظف]],'بيانات الموظفين'!$B$4:$G$117,6,FALSE),\"\")","v":7},7]
[null,4,{"$f":"IFERROR(VLOOKUP(Table3[[#This Row],[كود الموظف]],'بيانات الموظفين'!$B$4:$C$117,2,FALSE),\"\")","v":"محمد4"},{"$f":"IFERROR(VLOOKUP(Table3[[#This Row],[كود الموظف]],'بيانات الموظفين'!$B$4:$D$117,3,FALSE),\"\")","v":"مدرس4"},null,null,null,null,null,null,null,null,null,null,null,null,{"$f":"SUM(Table3[[#This Row],[Jan-21]:[Dec-21]])","v":0},{"$f":"IFERROR(VLOOKUP(Table3[[#This Row],[كود الموظف]],'بيانات الموظفين'!$B$4:$G$117,6,FALSE),\"\")","v":7},7]
[null,5,{"$f":"IFERROR(VLOOKUP(Table3[[#This Row],[كود الموظف]],'بيانات الموظفين'!$B$4:$C$117,2,FALSE),\"\")","v":"محمد5"},{"$f":"IFERROR(VLOOKUP(Table3[[#This Row],[كود الموظف]],'بيانات الموظفين'!$B$4:$D$117,3,FALSE),\"\")","v":"مدرس5"},null,null,null,null,null,null,null,null,null,null,null,null,{"$f":"SUM(Table3[[#This Row],[Jan-21]:[Dec-21]])","v":0},{"$f":"IFERROR(VLOOKUP(Table3[[#This Row],[كود الموظف]],'بيانات الموظفين'!$B$4:$G$117,6,FALSE),\"\")","v":7},7]
[null,6,{"$f":"IFERROR(VLOOKUP(Table3[[#This Row],[كود الموظف]],'بيانات الموظفين'!$B$4:$C$117,2,FALSE),\"\")","v":"محمد6"},{"$f":"IFERROR(VLOOKUP(Table3[[#This Row],[كود الموظف]],'بيانات الموظفين'!$B$4:$D$117,3,FALSE),\"\")","v":"مدرس6"},null,null,null,null,null,null,null,null,null,null,null,null,{"$f":"SUM(Table3[[#This Row],[Jan-21]:[Dec-21]])","v":0},{"$f":"IFERROR(VLOOKUP(Table3[[#This Row],[كود الموظف]],'بيانات الموظفين'!$B$4:$G$117,6,FALSE),\"\")","v":7},7]
[null,7,{"$f":"IFERROR(VLOOKUP(Table3[[#This Row],[كود الموظف]],'بيانات الموظفين'!$B$4:$C$117,2,FALSE),\"\")","v":"محمد7"},{"$f":"IFERROR(VLOOKUP(Table3[[#This Row],[كود الموظف]],'بيانات الموظفين'!$B$4:$D$117,3,FALSE),\"\")","v":"مدرس7"},null,null,null,null,null,null,null,null,null,null,null,null,{"$f":"SUM(Table3[[#This Row],[Jan-21]:[Dec-21]])","v":0},{"$f":"IFERROR(VLOOKUP(Table3[[#This Row],[كود الموظف]],'بيانات الموظفين'!$B$4:$G$117,6,FALSE),\"\")","v":7},7]
[null,8,{"$f":"IFERROR(VLOOKUP(Table3[[#This Row],[كود الموظف]],'بيانات الموظفين'!$B$4:$C$117,2,FALSE),\"\")","v":"محمد8"},{"$f":"IFERROR(VLOOKUP(Table3[[#This Row],[كود الموظف]],'بيانات الموظفين'!$B$4:$D$117,3,FALSE),\"\")","v":"مدرس8"},null,null,null,null,null,null,null,null,null,null,null,null,{"$f":"SUM(Table3[[#This Row],[Jan-21]:[Dec-21]])","v":0},{"$f":"IFERROR(VLOOKUP(Table3[[#This Row],[كود الموظف]],'بيانات الموظفين'!$B$4:$G$117,6,FALSE),\"\")","v":7},7]
[null,9,{"$f":"IFERROR(VLOOKUP(Table3[[#This Row],[كود الموظف]],'بيانات الموظفين'!$B$4:$C$117,2,FALSE),\"\")","v":"محمد9"},{"$f":"IFERROR(VLOOKUP(Table3[[#This Row],[كود الموظف]],'بيانات الموظفين'!$B$4:$D$117,3,FALSE),\"\")","v":"مدرس9"},null,null,null,null,null,null,null,null,null,null,null,null,{"$f":"SUM(Table3[[#This Row],[Jan-21]:[Dec-21]])","v":0},{"$f":"IFERROR(VLOOKUP(Table3[[#This Row],[كود الموظف]],'بيانات الموظفين'!$B$4:$G$117,6,FALSE),\"\")","v":7},7]
[null,10,{"$f":"IFERROR(VLOOKUP(Table3[[#This Row],[كود الموظف]],'بيانات الموظفين'!$B$4:$C$117,2,FALSE),\"\")","v":"محمد10"},{"$f":"IFERROR(VLOOKUP(Table3[[#This Row],[كود الموظف]],'بيانات الموظفين'!$B$4:$D$117,3,FALSE),\"\")","v":"مدرس10"},null,null,null,null,null,null,null,null,null,null,null,null,{"$f":"SUM(Table3[[#This Row],[Jan-21]:[Dec-21]])","v":0},{"$f":"IFERROR(VLOOKUP(Table3[[#This Row],[كود الموظف]],'بيانات الموظفين'!$B$4:$G$117,6,FALSE),\"\")","v":7},7]
[null,11,{"$f":"IFERROR(VLOOKUP(Table3[[#This Row],[كود الموظف]],'بيانات الموظفين'!$B$4:$C$117,2,FALSE),\"\")","v":"محمد11"},{"$f":"IFERROR(VLOOKUP(Table3[[#This Row],[كود الموظف]],'بيانات الموظفين'!$B$4:$D$117,3,FALSE),\"\")","v":"مدرس11"},null,null,null,null,null,null,null,null,null,null,null,null,{"$f":"SUM(Table3[[#This Row],[Jan-21]:[Dec-21]])","v":0},{"$f":"IFERROR(VLOOKUP(Table3[[#This Row],[كود الموظف]],'بيانات الموظفين'!$B$4:$G$117,6,FALSE),\"\")","v":7},7]
[null,12,{"$f":"IFERROR(VLOOKUP(Table3[[#This Row],[كود الموظف]],'بيانات الموظفين'!$B$4:$C$117,2,FALSE),\"\")","v":"محمد12"},{"$f":"IFERROR(VLOOKUP(Table3[[#This Row],[كود الموظف]],'بيانات الموظفين'!$B$4:$D$117,3,FALSE),\"\")","v":"مدرس12"},null,null,null,null,null,null,null,null,null,null,null,null,{"$f":"SUM(Table3[[#This Row],[Jan-21]:[Dec-21]])","v":0},{"$f":"IFERROR(VLOOKUP(Table3[[#This Row],[كود الموظف]],'بيانات الموظفين'!$B$4:$G$117,6,FALSE),\"\")","v":7},7]
[null,13,{"$f":"IFERROR(VLOOKUP(Table3[[#This Row],[كود الموظف]],'بيانات الموظفين'!$B$4:$C$117,2,FALSE),\"\")","v":"محمد13"},{"$f":"IFERROR(VLOOKUP(Table3[[#This Row],[كود الموظف]],'بيانات الموظفين'!$B$4:$D$117,3,FALSE),\"\")","v":"مدرس13"},null,null,null,null,null,null,null,null,null,null,null,null,{"$f":"SUM(Table3[[#This Row],[Jan-21]:[Dec-21]])","v":0},{"$f":"IFERROR(VLOOKUP(Table3[[#This Row],[كود الموظف]],'بيانات الموظفين'!$B$4:$G$117,6,FALSE),\"\")","v":7},{"$f":"R15-Q15","v":7}]
[null,14,{"$f":"IFERROR(VLOOKUP(Table3[[#This Row],[كود الموظف]],'بيانات الموظفين'!$B$4:$C$117,2,FALSE),\"\")","v":"محمد14"},{"$f":"IFERROR(VLOOKUP(Table3[[#This Row],[كود الموظف]],'بيانات الموظفين'!$B$4:$D$117,3,FALSE),\"\")","v":"مدرس14"},null,null,null,null,null,null,null,null,null,null,null,null,{"$f":"SUM(Table3[[#This Row],[Jan-21]:[Dec-21]])","v":0},{"$f":"IFERROR(VLOOKUP(Table3[[#This Row],[كود الموظف]],'بيانات الموظفين'!$B$4:$G$117,6,FALSE),\"\")","v":7},7]
[null,15,{"$f":"IFERROR(VLOOKUP(Table3[[#This Row],[كود الموظف]],'بيانات الموظفين'!$B$4:$C$117,2,FALSE),\"\")","v":"محمد15"},{"$f":"IFERROR(VLOOKUP(Table3[[#This Row],[كود الموظف]],'بيانات الموظفين'!$B$4:$D$117,3,FALSE),\"\")","v":"مدرس15"},null,null,null,null,null,null,null,null,null,null,null,null,{"$f":"SUM(Table3[[#This Row],[Jan-21]:[Dec-21]])","v":0},{"$f":"IFERROR(VLOOKUP(Table3[[#This Row],[كود الموظف]],'بيانات الموظفين'!$B$4:$G$117,6,FALSE),\"\")","v":7},7]
[null,16,{"$f":"IFERROR(VLOOKUP(Table3[[#This Row],[كود الموظف]],'بيانات الموظفين'!$B$4:$C$117,2,FALSE),\"\")","v":"محمد16"},{"$f":"IFERROR(VLOOKUP(Table3[[#This Row],[كود الموظف]],'بيانات الموظفين'!$B$4:$D$117,3,FALSE),\"\")","v":"مدرس16"},null,null,null,null,null,null,null,null,null,null,null,null,{"$f":"SUM(Table3[[#This Row],[Jan-21]:[Dec-21]])","v":0},{"$f":"IFERROR(VLOOKUP(Table3[[#This Row],[كود الموظف]],'بيانات الموظفين'!$B$4:$G$117,6,FALSE),\"\")","v":7},7]
[null,17,{"$f":"IFERROR(VLOOKUP(Table3[[#This Row],[كود الموظف]],'بيانات الموظفين'!$B$4:$C$117,2,FALSE),\"\")","v":"محمد17"},{"$f":"IFERROR(VLOOKUP(Table3[[#This Row],[كود الموظف]],'بيانات الموظفين'!$B$4:$D$117,3,FALSE),\"\")","v":"مدرس17"},null,null,null,null,null,null,null,null,null,null,null,null,{"$f":"SUM(Table3[[#This Row],[Jan-21]:[Dec-21]])","v":0},{"$f":"IFERROR(VLOOKUP(Table3[[#This Row],[كود الموظف]],'بيانات الموظفين'!$B$4:$G$117,6,FALSE),\"\")","v":7},7]
[null,18,{"$f":"IFERROR(VLOOKUP(Table3[[#This Row],[كود الموظف]],'بيانات الموظفين'!$B$4:$C$117,2,FALSE),\"\")","v":"محمد18"},{"$f":"IFERROR(VLOOKUP(Table3[[#This Row],[كود الموظف]],'بيانات الموظفين'!$B$4:$D$117,3,FALSE),\"\")","v":"مدرس18"},null,null,null,null,null,null,null,null,null,null,null,null,{"$f":"SUM(Table3[[#This Row],[Jan-21]:[Dec-21]])","v":0},{"$f":"IFERROR(VLOOKUP(Table3[[#This Row],[كود الموظف]],'بيانات الموظفين'!$B$4:$G$117,6,FALSE),\"\")","v":7},7]
{"$rows_left_out":98}