{"text_format":"1","workbook":"xlsx","n_sheets":7,"sheets":["الرئيسية","شهر 10","البوم","DATA","الرئيسية (1)","الرئيسية (2)","كارت حضور عاملين"],"not_rendered":{"charts":0,"images":0,"macros":1,"external_links":0,"defined_names":3,"comments":0,"pivot_tables":0},"unopened":[],"bounds":{"document_bytes":16777216,"sheet_cells":100000,"rows_first":2000,"rows_last":500,"rows_between":2000,"halvings":0,"cell_chars":16384,"cell_head_chars":4096},"cells_cut":0,"cells_raw":0,"read":"whole","date_system":"1900"}

{"sheet":"الرئيسية","index":0,"n_rows":16,"n_cols":12,"rows_kept":16,"cut":false,"hidden":false,"merged":[[6,7,6,11],[7,7,7,11],[8,7,8,11],[9,7,9,11],[13,7,13,11]]}
[]
[]
[]
[]
[]
[]
[null,null,null,null,null,null,null,"كشف حدادين"]
[null,null,null,null,null,null,null,"من شهر 10/2021"]
[null,null,null,null,null,null,null,"الي شهر 12/2021"]
[null,null,null,null,null,null,null,"بحث id"]
[null,null,null,null,null,null,null,"ID","الاسم","ساعات ","ايام ","سلف"]
[null,null,null,null,null,null,null,4,{"$f":"DGET(DATA!A2:F252,I11,H11:H12)","v":"باسم ابو الخير"},{"$f":"DGET(DATA!A2:F252,J$11,$H$11:$H$12)","v":0},{"$f":"DGET(DATA!A2:F252,K$11,$H$11:$H$12)","v":0},{"$f":"DGET(DATA!A2:F252,L$11,$H$11:$H$12)","v":0}]
[]
[null,null,null,null,null,null,null,"بحث بالاسم"]
[null,null,null,null,null,null,null,"ID","الاسم","ساعات ","ايام ","سلف"]
[null,null,null,null,null,null,null,{"$f":"DGET(DATA!A2:F252,H15,I15:I16)","v":4},"باسم ابو الخير",{"$f":"DGET(DATA!A2:F252,J15,I15:I16)","v":0},{"$f":"DGET(DATA!A2:F252,K15,I15:I16)","v":0},{"$f":"DGET(DATA!A2:F252,L15,I15:I16)","v":0}]

{"sheet":"شهر 10","index":1,"n_rows":202,"n_cols":38,"rows_kept":202,"cut":false,"hidden":false,"merged":[[178,0,179,0],[180,0,181,0],[182,0,183,0],[182,1,183,1],[184,0,185,0],[184,1,185,1],[162,1,163,1],[162,0,163,0],[164,0,165,0],[166,0,167,0],[168,0,169,0],[170,0,171,0],[172,0,173,0],[174,0,175,0],[176,0,177,0],[170,1,171,1],[172,1,173,1],[174,1,175,1],[176,1,177,1],[178,1,179,1],[180,1,181,1],[154,0,155,0],[156,0,157,0],[158,0,159,0],[160,0,161,0],[150,1,151,1],[152,1,153,1],[154,1,155,1],[156,1,157,1],[158,1,159,1],[160,1,161,1],[138,1,139,1],[140,1,141,1],[142,1,143,1],[144,1,145,1],[146,1,147,1],[148,1,149,1],[148,0,149,0],[150,0,151,0],[152,0,153,0],[198,0,199,0],[200,0,201,0],[194,1,195,1],[196,1,197,1],[198,1,199,1],[200,1,201,1],[186,0,187,0],[186,1,187,1],[188,0,189,0],[188,1,189,1],[190,0,191,0],[190,1,191,1],[192,1,193,1],[194,34,195,34],[194,35,195,35],[194,36,195,36],[194,37,195,37],[196,34,197,34],[196,35,197,35],[192,0,193,0],[194,0,195,0],[196,0,197,0],[196,36,197,36],[196,37,197,37],[198,34,199,34],[198,35,199,35],[198,36,199,36],[198,37,199,37],[200,34,201,34],[200,35,201,35],[200,36,201,36],[200,37,201,37],[186,37,187,37],[188,34,189,34],[188,37,189,37],[192,35,193,35],[192,36,193,36],[188,35,189,35],[188,36,189,36],[190,34,191,34],[190,35,191,35],[190,36,191,36],[190,37,191,37],[192,37,193,37],[192,34,193,34],[186,34,187,34],[186,35,187,35],[186,36,187,36],[120,0,121,0],[122,0,123,0],[124,0,125,0],[124,1,125,1],[126,0,127,0],[126,1,127,1],[164,1,165,1],[166,1,167,1],[168,1,169,1],[128,0,129,0],[128,1,129,1],[130,0,131,0],[130,1,131,1],[132,0,133,0],[132,1,133,1],[134,1,135,1],[134,0,135,0],[136,0,137,0],[138,0,139,0],[140,0,141,0],[142,0,143,0],[144,0,145,0],[146,0,147,0],[136,1,137,1],[104,1,105,1],[104,0,105,0],[106,0,107,0],[108,0,109,0],[110,0,111,0],[112,0,113,0],[114,0,115,0],[116,0,117,0],[118,0,119,0],[90,1,91,1],[90,0,91,0],[92,0,93,0],[94,0,95,0],[96,0,97,0],[98,0,99,0],[100,0,101,0],[102,0,103,0],[92,1,93,1],[94,1,95,1],[96,1,97,1],[98,1,99,1],[100,1,101,1],[102,1,103,1],[80,0,81,0],[82,0,83,0],[84,0,85,0],[86,0,87,0],[88,0,89,0],[78,1,79,1],[80,1,81,1],[82,1,83,1],[84,1,85,1],[86,1,87,1],[88,1,89,1],[62,0,63,0],[64,0,65,0],[66,0,67,0],[66,1,67,1],[68,0,69,0],[68,1,69,1],[120,1,121,1],[122,1,123,1],[106,1,107,1],[108,1,109,1],[110,1,111,1],[112,1,113,1],[114,1,115,1],[116,1,117,1],[118,1,119,1],[70,0,71,0],[70,1,71,1],[72,0,73,0],[72,1,73,1],[74,0,75,0],[74,1,75,1],[76,1,77,1],[76,0,77,0],[78,0,79,0],[46,1,47,1],[46,0,47,0],[48,0,49,0],[50,0,51,0],[52,0,53,0],[54,0,55,0],[56,0,57,0],[58,0,59,0],[60,0,61,0],[32,1,33,1],[32,0,33,0],[34,0,35,0],[36,0,37,0],[38,0,39,0],[40,0,41,0],[42,0,43,0],[44,0,45,0],[34,1,35,1],[36,1,37,1],[38,1,39,1],[40,1,41,1],[42,1,43,1],[44,1,45,1],[22,0,23,0],[24,0,25,0],[26,0,27,0],[28,0,29,0],[30,0,31,0],[20,1,21,1],[22,1,23,1],[24,1,25,1],[26,1,27,1],[28,1,29,1],[30,1,31,1],[12,0,13,0],[12,1,13,1],[14,0,15,0],[14,1,15,1],[16,0,17,0],[16,1,17,1],[18,1,19,1],[18,0,19,0],[20,0,21,0],[62,1,63,1],[64,1,65,1],[48,1,49,1],[50,1,51,1],[52,1,53,1],[54,1,55,1],[56,1,57,1],[58,1,59,1],[60,1,61,1],[2,34,3,34],[4,34,5,34],[6,34,7,34],[8,34,9,34],[10,34,11,34],[12,34,13,34],[14,34,15,34],[24,36,25,36],[24,37,25,37],[10,1,11,1],[14,35,15,35],[14,36,15,36],[14,37,15,37],[16,35,17,35],[16,36,17,36],[16,37,17,37],[8,35,9,35],[10,35,11,35],[10,36,11,36],[10,37,11,37],[12,35,13,35],[12,36,13,36],[12,37,13,37],[184,34,185,34],[184,35,185,35],[184,36,185,36],[184,37,185,37],[2,0,3,0],[2,1,3,1],[2,35,3,35],[2,36,3,36],[2,37,3,37],[4,1,5,1],[4,37,5,37],[4,35,5,35],[4,36,5,36],[6,35,7,35],[6,36,7,36],[6,37,7,37],[8,36,9,36],[8,37,9,37],[4,0,5,0],[6,0,7,0],[6,1,7,1],[8,0,9,0],[8,1,9,1],[10,0,11,0],[174,37,175,37],[170,34,171,34],[172,34,173,34],[172,35,173,35],[172,36,173,36],[172,37,173,37],[174,34,175,34],[174,35,175,35],[182,36,183,36],[182,37,183,37],[182,34,183,34],[182,35,183,35],[174,36,175,36],[176,34,177,34],[176,35,177,35],[176,36,177,36],[176,37,177,37],[178,35,179,35],[178,36,179,36],[178,37,179,37],[178,34,179,34],[180,34,181,34],[180,35,181,35],[180,36,181,36],[168,34,169,34],[168,35,169,35],[168,36,169,36],[168,37,169,37],[170,35,171,35],[170,36,171,36],[170,37,171,37],[152,34,153,34],[152,35,153,35],[152,36,153,36],[152,37,153,37],[154,35,155,35],[154,36,155,36],[154,37,155,37],[154,34,155,34],[156,34,157,34],[156,35,157,35],[156,36,157,36],[156,37,157,37],[180,37,181,37],[40,34,41,34],[40,35,41,35],[144,34,145,34],[144,35,145,35],[144,36,145,36],[144,37,145,37],[146,35,147,35],[146,36,147,36],[146,37,147,37],[146,34,147,34],[162,35,163,35],[162,36,163,36],[162,37,163,37],[162,34,163,34],[164,34,165,34],[164,35,165,35],[164,36,165,36],[164,37,165,37],[166,34,167,34],[166,35,167,35],[166,36,167,36],[166,37,167,37],[140,36,141,36],[34,34,35,34],[34,35,35,35],[34,36,35,36],[34,37,35,37],[36,35,37,35],[36,36,37,36],[36,37,37,37],[36,34,37,34],[38,34,39,34],[38,35,39,35],[38,36,39,36],[38,37,39,37],[140,37,141,37],[142,34,143,34],[142,35,143,35],[142,36,143,36],[142,37,143,37],[160,34,161,34],[160,35,161,35],[160,36,161,36],[160,37,161,37],[150,36,151,36],[150,37,151,37],[148,34,149,34],[148,35,149,35],[148,36,149,36],[148,37,149,37],[150,34,151,34],[150,35,151,35],[158,36,159,36],[158,37,159,37],[158,34,159,34],[158,35,159,35],[138,34,139,34],[138,35,139,35],[138,36,139,36],[138,37,139,37],[140,34,141,34],[140,35,141,35],[42,34,43,34],[42,35,43,35],[42,36,43,36],[42,37,43,37],[44,35,45,35],[44,36,45,36],[44,37,45,37],[44,34,45,34],[46,34,47,34],[46,35,47,35],[46,36,47,36],[46,37,47,37],[48,34,49,34],[48,35,49,35],[126,34,127,34],[126,35,127,35],[126,36,127,36],[126,37,127,37],[124,34,125,34],[124,35,125,35],[124,36,125,36],[124,37,125,37],[134,34,135,34],[134,35,135,35],[134,36,135,36],[134,37,135,37],[136,35,137,35],[136,36,137,36],[136,37,137,37],[136,34,137,34],[128,35,129,35],[128,36,129,36],[128,37,129,37],[132,36,133,36],[132,37,133,37],[128,34,129,34],[130,34,131,34],[130,35,131,35],[130,36,131,36],[130,37,131,37],[132,34,133,34],[132,35,133,35],[114,37,115,37],[110,34,111,34],[112,34,113,34],[112,35,113,35],[112,36,113,36],[112,37,113,37],[114,34,115,34],[114,35,115,35],[122,36,123,36],[122,37,123,37],[122,34,123,34],[122,35,123,35],[114,36,115,36],[116,34,117,34],[116,35,117,35],[116,36,117,36],[116,37,117,37],[118,35,119,35],[118,36,119,36],[118,37,119,37],[118,34,119,34],[120,34,121,34],[120,35,121,35],[120,36,121,36],[108,34,109,34],[108,35,109,35],[108,36,109,36],[108,37,109,37],[110,35,111,35],[110,36,111,36],[110,37,111,37],[106,37,107,37],[92,34,93,34],[92,35,93,35],[92,36,93,36],[92,37,93,37],[94,35,95,35],[94,36,95,36],[94,37,95,37],[94,34,95,34],[96,34,97,34],[96,35,97,35],[96,36,97,36],[96,37,97,37],[120,37,121,37],[50,37,51,37],[52,37,53,37],[86,35,87,35],[86,36,87,36],[52,35,53,35],[52,36,53,36],[84,34,85,34],[84,35,85,35],[84,36,85,36],[84,37,85,37],[86,37,87,37],[86,34,87,34],[102,35,103,35],[102,36,103,36],[102,37,103,37],[102,34,103,34],[104,34,105,34],[104,35,105,35],[104,36,105,36],[104,37,105,37],[106,34,107,34],[106,35,107,35],[106,36,107,36],[80,36,81,36],[80,37,81,37],[82,34,83,34],[82,35,83,35],[82,36,83,36],[82,37,83,37],[100,34,101,34],[100,35,101,35],[100,36,101,36],[100,37,101,37],[90,36,91,36],[90,37,91,37],[88,34,89,34],[88,35,89,35],[88,36,89,36],[88,37,89,37],[90,34,91,34],[90,35,91,35],[98,36,99,36],[98,37,99,37],[98,34,99,34],[98,35,99,35],[78,34,79,34],[78,35,79,35],[78,36,79,36],[78,37,79,37],[80,34,81,34],[80,35,81,35],[56,36,57,36],[56,37,57,37],[52,34,53,34],[54,34,55,34],[54,35,55,35],[54,36,55,36],[54,37,55,37],[56,34,57,34],[56,35,57,35],[66,34,67,34],[66,35,67,35],[66,36,67,36],[66,37,67,37],[68,35,69,35],[68,36,69,36],[68,37,69,37],[72,36,73,36],[72,37,73,37],[40,36,41,36],[40,37,41,37],[64,36,65,36],[64,37,65,37],[74,34,75,34],[74,35,75,35],[74,36,75,36],[74,37,75,37],[76,35,77,35],[76,36,77,36],[76,37,77,37],[76,34,77,34],[68,34,69,34],[70,34,71,34],[70,35,71,35],[70,36,71,36],[70,37,71,37],[72,34,73,34],[72,35,73,35],[48,36,49,36],[48,37,49,37],[50,34,51,34],[50,35,51,35],[50,36,51,36],[32,36,33,36],[32,37,33,37],[28,34,29,34],[30,34,31,34],[30,35,31,35],[30,36,31,36],[30,37,31,37],[32,34,33,34],[32,35,33,35],[64,34,65,34],[64,35,65,35],[16,34,17,34],[18,34,19,34],[18,35,19,35],[18,36,19,36],[18,37,19,37],[20,35,21,35],[20,36,21,36],[20,37,21,37],[20,34,21,34],[22,34,23,34],[22,35,23,35],[22,36,23,36],[22,37,23,37],[24,34,25,34],[24,35,25,35],[26,34,27,34],[26,35,27,35],[26,36,27,36],[26,37,27,37],[28,35,29,35],[28,36,29,36],[28,37,29,37],[58,34,59,34],[58,35,59,35],[58,36,59,36],[58,37,59,37],[60,35,61,35],[60,36,61,36],[60,37,61,37],[60,34,61,34],[62,34,63,34],[62,35,63,35],[62,36,63,36],[62,37,63,37]]}
[null,null,null,"2021-10-01","2021-10-02","2021-10-03","2021-10-04","2021-10-05","2021-10-06","2021-10-07","2021-10-08","2021-10-09","2021-10-10","2021-10-11","2021-10-12","2021-10-13","2021-10-14","2021-10-15","2021-10-16","2021-10-17","2021-10-18","2021-10-19","2021-10-20","2021-10-21","2021-10-22","2021-10-23","2021-10-24","2021-10-25","2021-10-26","2021-10-27","2021-10-28","2021-10-29","2021-10-30","2021-10-31","2021-10-01","1"]
["ID","الاسم","م",1,2,3,4,5,6,7,8,9,10,11,12,13,14,15,16,17,18,19,20,21,22,23,24,25,26,27,28,29,30,31,"ساعات العمل","ايام العمل","سلف","حساب بعد السلف"]
[1,{"$f":"DATA!B3","v":"احمد الحديدي"},"يوم",null,null,null,null,null,null,null,null,null,null,null,null,null,null,null,null,null,null,null,null,null,null,null,null,null,null,null,null,null,null,null,{"$f":"SUM(D3:AH3)","v":0},{"$f":"AI3/8","v":0},{"$f":"SUM(D4:AH4)","v":0},{"$f":"AJ3*DATA!F3-AK3","v":0}]
[null,null,"سلف"]
[2,{"$f":"DATA!B5","v":"مدحت عصام"},"يوم",null,null,null,null,null,null,null,null,null,null,null,null,null,null,null,null,null,null,null,null,null,null,null,null,null,null,null,null,null,null,null,{"$f":"SUM(D5:AH5)","v":0},{"$f":"AI5/8","v":0},{"$f":"SUM(D6:AH6)","v":0},{"$f":"AJ5*DATA!F5-AK5","v":0}]
[null,null,"سلف"]
[3,{"$f":"DATA!B7","v":"منير العيسوى"},"يوم",null,null,null,null,null,null,null,null,null,null,null,null,null,null,null,null,null,null,null,null,null,null,null,null,null,null,null,null,null,null,null,{"$f":"SUM(D7:AH7)","v":0},{"$f":"AI7/8","v":0},{"$f":"SUM(D8:AH8)","v":0},{"$f":"AJ7*DATA!F7-AK7","v":0}]
[null,null,"سلف"]
[4,{"$f":"DATA!B9","v":"باسم ابو الخير"},"يوم",null,null,null,null,null,null,null,null,null,null,null,null,null,null,null,null,null,null,null,null,null,null,null,null,null,null,null,null,null,null,null,{"$f":"SUM(D9:AH9)","v":0},{"$f":"AI9/8","v":0},{"$f":"SUM(D10:AH10)","v":0},{"$f":"AJ9*DATA!F9-AK9","v":0}]
[null,null,"سلف"]
[5,{"$f":"DATA!B11","v":"عبد الطيف المرسي"},"يوم",null,null,null,null,null,null,null,null,null,null,null,null,null,null,null,null,null,null,null,null,null,null,null,null,null,null,null,null,null,null,null,{"$f":"SUM(D11:AH11)","v":0},{"$f":"AI11/8","v":0},{"$f":"SUM(D12:AH12)","v":0},{"$f":"AJ11*DATA!F11-AK11","v":0}]
[null,null,"سلف"]
[6,{"$f":"DATA!B13","v":"محمود ابراهيم ضيف"},"يوم",null,null,null,null,null,null,null,null,null,null,null,null,null,null,null,null,null,null,null,null,null,null,null,null,null,null,null,null,null,null,null,{"$f":"SUM(D13:AH13)","v":0},{"$f":"AI13/8","v":0},{"$f":"SUM(D14:AH14)","v":0},{"$f":"AJ13*DATA!F13-AK13","v":0}]
[null,null,"سلف"]
[7,{"$f":"DATA!B15","v":"خليل محمد خليل"},"يوم",null,null,null,null,null,null,null,null,null,null,null,null,null,null,null,null,null,null,null,null,null,null,null,null,null,null,null,null,null,null,null,{"$f":"SUM(D15:AH15)","v":0},{"$f":"AI15/8","v":0},{"$f":"SUM(D16:AH16)","v":0},{"$f":"AJ15*DATA!F15-AK15","v":0}]
[null,null,"سلف"]
[8,{"$f":"DATA!B17","v":"حسام حسن"},"يوم",null,null,null,null,null,null,null,null,null,null,null,null,null,null,null,null,null,null,null,null,null,null,null,null,null,null,null,null,null,null,null,{"$f":"SUM(D17:AH17)","v":0},{"$f":"AI17/8","v":0},{"$f":"SUM(D18:AH18)","v":0},{"$f":"AJ17*DATA!F17-AK17","v":0}]
[null,null,"سلف"]
[9,{"$f":"DATA!B19","v":"محمود المحلاوي"},"يوم",null,null,null,null,null,null,null,null,null,null,null,null,null,null,null,null,null,null,null,null,null,null,null,null,null,null,null,null,null,null,null,{"$f":"SUM(D19:AH19)","v":0},{"$f":"AI19/8","v":0},{"$f":"SUM(D20:AH20)","v":0},{"$f":"AJ19*DATA!F19-AK19","v":0}]
[null,null,"سلف"]
[10,{"$f":"DATA!B21","v":"رضا رمضان الرشيدي"},"يوم",null,null,null,null,null,null,null,null,null,null,null,null,null,null,null,null,null,null,null,null,null,null,null,null,null,null,null,null,null,null,null,{"$f":"SUM(D21:AH21)","v":0},{"$f":"AI21/8","v":0},{"$f":"SUM(D22:AH22)","v":0},{"$f":"AJ21*DATA!F21-AK21","v":0}]
[null,null,"سلف"]
[11,{"$f":"DATA!B23","v":"السيد الدمرداش"},"يوم",null,null,null,null,null,null,null,null,null,null,null,null,null,null,null,null,null,null,null,null,null,null,null,null,null,null,null,null,null,null,null,{"$f":"SUM(D23:AH23)","v":0},{"$f":"AI23/8","v":0},{"$f":"SUM(D24:AH24)","v":0},{"$f":"AJ23*DATA!F23-AK23","v":0}]
[null,null,"سلف"]
[12,{"$f":"DATA!B25","v":"على صبح عطية"},"يوم",null,null,null,null,null,null,null,null,null,null,null,null,null,null,null,null,null,null,null,null,null,null,null,null,null,null,null,null,null,null,null,{"$f":"SUM(D25:AH25)","v":0},{"$f":"AI25/8","v":0},{"$f":"SUM(D26:AH26)","v":0},{"$f":"AJ25*DATA!F25-AK25","v":0}]
[null,null,"سلف"]
[13,{"$f":"DATA!B27","v":"سعد الدين عماد"},"يوم",null,null,null,null,null,null,null,null,null,null,null,null,null,null,null,null,null,null,null,null,null,null,null,null,null,null,null,null,null,null,null,{"$f":"SUM(D27:AH27)","v":0},{"$f":"AI27/8","v":0},{"$f":"SUM(D28:AH28)","v":0},{"$f":"AJ27*DATA!F27-AK27","v":0}]
[null,null,"سلف"]
[14,{"$f":"DATA!B29","v":"صلاح محمد"},"يوم",null,null,null,null,null,null,null,null,null,null,null,null,null,null,null,null,null,null,null,null,null,null,null,null,null,null,null,null,null,null,null,{"$f":"SUM(D29:AH29)","v":0},{"$f":"AI29/8","v":0},{"$f":"SUM(D30:AH30)","v":0},{"$f":"AJ29*DATA!F29-AK29","v":0}]
[null,null,"سلف"]
[15,{"$f":"DATA!B31","v":"يوسف منصور"},"يوم",null,null,null,null,null,null,null,null,null,null,null,null,null,null,null,null,null,null,null,null,null,null,null,null,null,null,null,null,null,null,null,{"$f":"SUM(D31:AH31)","v":0},{"$f":"AI31/8","v":0},{"$f":"SUM(D32:AH32)","v":0},{"$f":"AJ31*DATA!F31-AK31","v":0}]
[null,null,"سلف"]
[16,{"$f":"DATA!B33","v":"ابراهيم نصحي"},"يوم",null,null,null,null,null,null,null,null,null,null,null,null,null,null,null,null,null,null,null,null,null,null,null,null,null,null,null,null,null,null,null,{"$f":"SUM(D33:AH33)","v":0},{"$f":"AI33/8","v":0},{"$f":"SUM(D34:AH34)","v":0},{"$f":"AJ33*DATA!F33-AK33","v":0}]
[null,null,"سلف"]
[17,{"$f":"DATA!B35","v":"احمد علام"},"يوم",null,null,null,null,null,null,null,null,null,null,null,null,null,null,null,null,null,null,null,null,null,null,null,null,null,null,null,null,null,null,null,{"$f":"SUM(D35:AH35)","v":0},{"$f":"AI35/8","v":0},{"$f":"SUM(D36:AH36)","v":0},{"$f":"AJ35*DATA!F35-AK35","v":0}]
[null,null,"سلف"]
[18,{"$f":"DATA!B37","v":"عبد العزيز عبد الشافى"},"يوم",null,null,null,null,null,null,null,null,null,null,null,null,null,null,null,null,null,null,null,null,null,null,null,null,null,null,null,null,null,null,null,{"$f":"SUM(D37:AH37)","v":0},{"$f":"AI37/8","v":0},{"$f":"SUM(D38:AH38)","v":0},{"$f":"AJ37*DATA!F37-AK37","v":0}]
[null,null,"سلف"]
[19,{"$f":"DATA!B39","v":"باسم ابو بكر"},"يوم",null,null,null,null,null,null,null,null,null,null,null,null,null,null,null,null,null,null,null,null,null,null,null,null,null,null,null,null,null,null,null,{"$f":"SUM(D39:AH39)","v":0},{"$f":"AI39/8","v":0},{"$f":"SUM(D40:AH40)","v":0},{"$f":"AJ39*DATA!F39-AK39","v":0}]
[null,null,"سلف"]
[20,{"$f":"DATA!B41","v":"احمد محمد الدمرداش"},"يوم",null,null,null,null,null,null,null,null,null,null,null,null,null,null,null,null,null,null,null,null,null,null,null,null,null,null,null,null,null,null,null,{"$f":"SUM(D41:AH41)","v":0},{"$f":"AI41/8","v":0},{"$f":"SUM(D42:AH42)","v":0},{"$f":"AJ41*DATA!F41-AK41","v":0}]
[null,null,"سلف"]
[21,{"$f":"DATA!B43","v":"محمد احمد جمعه"},"يوم",null,null,null,null,null,null,null,null,null,null,null,null,null,null,null,null,null,null,null,null,null,null,null,null,null,null,null,null,null,null,null,{"$f":"SUM(D43:AH43)","v":0},{"$f":"AI43/8","v":0},{"$f":"SUM(D44:AH44)","v":0},{"$f":"AJ43*DATA!F43-AK43","v":0}]
[null,null,"سلف"]
[22,{"$f":"DATA!B45","v":"السيد رمضان الدسوقى"},"يوم",null,null,null,null,null,null,null,null,null,null,null,null,null,null,null,null,null,null,null,null,null,null,null,null,null,null,null,null,null,null,null,{"$f":"SUM(D45:AH45)","v":0},{"$f":"AI45/8","v":0},{"$f":"SUM(D46:AH46)","v":0},{"$f":"AJ45*DATA!F45-AK45","v":0}]
[null,null,"سلف"]
[23,{"$f":"DATA!B47","v":"على السيد عبد الكريم"},"يوم",null,null,null,null,null,null,null,null,null,null,null,null,null,null,null,null,null,null,null,null,null,null,null,null,null,null,null,null,null,null,null,{"$f":"SUM(D47:AH47)","v":0},{"$f":"AI47/8","v":0},{"$f":"SUM(D48:AH48)","v":0},{"$f":"AJ47*DATA!F47-AK47","v":0}]
[null,null,"سلف"]
[24,{"$f":"DATA!B49","v":"حلمي احمد العجوز"},"يوم",null,null,null,null,null,null,null,null,null,null,null,null,null,null,null,null,null,null,null,null,null,null,null,null,null,null,null,null,null,null,null,{"$f":"SUM(D49:AH49)","v":0},{"$f":"AI49/8","v":0},{"$f":"SUM(D50:AH50)","v":0},{"$f":"AJ49*DATA!F49-AK49","v":0}]
[null,null,"سلف"]
[25,{"$f":"DATA!B51","v":"فارس على عبوده"},"يوم",null,null,null,null,null,null,null,null,null,null,null,null,null,null,null,null,null,null,null,null,null,null,null,null,null,null,null,null,null,null,null,{"$f":"SUM(D51:AH51)","v":0},{"$f":"AI51/8","v":0},{"$f":"SUM(D52:AH52)","v":0},{"$f":"AJ51*DATA!F51-AK51","v":0}]
[null,null,"سلف"]
[26,{"$f":"DATA!B53","v":"محمد عبوده عبد المولى"},"يوم",null,null,null,null,null,null,null,null,null,null,null,null,null,null,null,null,null,null,null,null,null,null,null,null,null,null,null,null,null,null,null,{"$f":"SUM(D53:AH53)","v":0},{"$f":"AI53/8","v":0},{"$f":"SUM(D54:AH54)","v":0},{"$f":"AJ53*DATA!F53-AK53","v":0}]
[null,null,"سلف"]
[27,{"$f":"DATA!B55","v":"ايمن عبوده عبد المولى"},"يوم",null,null,null,null,null,null,null,null,null,null,null,null,null,null,null,null,null,null,null,null,null,null,null,null,null,null,null,null,null,null,null,{"$f":"SUM(D55:AH55)","v":0},{"$f":"AI55/8","v":0},{"$f":"SUM(D56:AH56)","v":0},{"$f":"AJ55*DATA!F55-AK55","v":0}]
[null,null,"سلف"]
[28,{"$f":"DATA!B57","v":"حاتم عبوده عبد المولى"},"يوم",null,null,null,null,null,null,null,null,null,null,null,null,null,null,null,null,null,null,null,null,null,null,null,null,null,null,null,null,null,null,null,{"$f":"SUM(D57:AH57)","v":0},{"$f":"AI57/8","v":0},{"$f":"SUM(D58:AH58)","v":0},{"$f":"AJ57*DATA!F57-AK57","v":0}]
[null,null,"سلف"]
[29,{"$f":"DATA!B59","v":"نادر عبد العال"},"يوم",null,null,null,null,null,null,null,null,null,null,null,null,null,null,null,null,null,null,null,null,null,null,null,null,null,null,null,null,null,null,null,{"$f":"SUM(D59:AH59)","v":0},{"$f":"AI59/8","v":0},{"$f":"SUM(D60:AH60)","v":0},{"$f":"AJ59*DATA!F59-AK59","v":0}]
[null,null,"سلف"]
[30,{"$f":"DATA!B61","v":"محمد متولى عباس"},"يوم",null,null,null,null,null,null,null,null,null,null,null,null,null,null,null,null,null,null,null,null,null,null,null,null,null,null,null,null,null,null,null,{"$f":"SUM(D61:AH61)","v":0},{"$f":"AI61/8","v":0},{"$f":"SUM(D62:AH62)","v":0},{"$f":"AJ61*DATA!F61-AK61","v":0}]
[null,null,"سلف"]
[31,{"$f":"DATA!B63","v":"السعيد الشرقاوي"},"يوم",null,null,null,null,null,null,null,null,null,null,null,null,null,null,null,null,null,null,null,null,null,null,null,null,null,null,null,null,null,null,null,{"$f":"SUM(D63:AH63)","v":0},{"$f":"AI63/8","v":0},{"$f":"SUM(D64:AH64)","v":0},{"$f":"AJ63*DATA!F63-AK63","v":0}]
[null,null,"سلف"]
[32,{"$f":"DATA!B65","v":"عزيز فتحي سعفان"},"يوم",null,null,null,null,null,null,null,null,null,null,null,null,null,null,null,null,null,null,null,null,null,null,null,null,null,null,null,null,null,null,null,{"$f":"SUM(D65:AH65)","v":0},{"$f":"AI65/8","v":0},{"$f":"SUM(D66:AH66)","v":0},{"$f":"AJ65*DATA!F65-AK65","v":0}]
[null,null,"سلف"]
[33,{"$f":"DATA!B67","v":"محمود سعد محمود"},"يوم",null,null,null,null,null,null,null,null,null,null,null,null,null,null,null,null,null,null,null,null,null,null,null,null,null,null,null,null,null,null,null,{"$f":"SUM(D67:AH67)","v":0},{"$f":"AI67/8","v":0},{"$f":"SUM(D68:AH68)","v":0},{"$f":"AJ67*DATA!F67-AK67","v":0}]
[null,null,"سلف"]
[34,{"$f":"DATA!B69","v":"حسن محمد طة"},"يوم",null,null,null,null,null,null,null,null,null,null,null,null,null,null,null,null,null,null,null,null,null,null,null,null,null,null,null,null,null,null,null,{"$f":"SUM(D69:AH69)","v":0},{"$f":"AI69/8","v":0},{"$f":"SUM(D70:AH70)","v":0},{"$f":"AJ69*DATA!F69-AK69","v":0}]
[null,null,"سلف"]
[35,{"$f":"DATA!B71","v":"حسين محمد حسين"},"يوم",null,null,null,null,null,null,null,null,null,null,null,null,null,null,null,null,null,null,null,null,null,null,null,null,null,null,null,null,null,null,null,{"$f":"SUM(D71:AH71)","v":0},{"$f":"AI71/8","v":0},{"$f":"SUM(D72:AH72)","v":0},{"$f":"AJ71*DATA!F71-AK71","v":0}]
[null,null,"سلف"]
[36,{"$f":"DATA!B73","v":"محمد ابراهيم محمد"},"يوم",null,null,null,null,null,null,null,null,null,null,null,null,null,null,null,null,null,null,null,null,null,null,null,null,null,null,null,null,null,null,null,{"$f":"SUM(D73:AH73)","v":0},{"$f":"AI73/8","v":0},{"$f":"SUM(D74:AH74)","v":0},{"$f":"AJ73*DATA!F73-AK73","v":0}]
[null,null,"سلف"]
[37,{"$f":"DATA!B75","v":"مصطفى حسن (القاهرة)"},"يوم",null,null,null,null,null,null,null,null,null,null,null,null,null,null,null,null,null,null,null,null,null,null,null,null,null,null,null,null,null,null,null,{"$f":"SUM(D75:AH75)","v":0},{"$f":"AI75/8","v":0},{"$f":"SUM(D76:AH76)","v":0},{"$f":"AJ75*DATA!F75-AK75","v":0}]
[null,null,"سلف"]
[38,{"$f":"DATA!B77","v":"سمير صلاح"},"يوم",null,null,null,null,null,null,null,null,null,null,null,null,null,null,null,null,null,null,null,null,null,null,null,null,null,null,null,null,null,null,null,{"$f":"SUM(D77:AH77)","v":0},{"$f":"AI77/8","v":0},{"$f":"SUM(D78:AH78)","v":0},{"$f":"AJ77*DATA!F77-AK77","v":0}]
[null,null,"سلف"]
[39,{"$f":"DATA!B79","v":"رمضان ابراهيم منصور"},"يوم",null,null,null,null,null,null,null,null,null,null,null,null,null,null,null,null,null,null,null,null,null,null,null,null,null,null,null,null,null,null,null,{"$f":"SUM(D79:AH79)","v":0},{"$f":"AI79/8","v":0},{"$f":"SUM(D80:AH80)","v":0},{"$f":"AJ79*DATA!F79-AK79","v":0}]
[null,null,"سلف"]
[40,{"$f":"DATA!B81","v":"يوسف الدكروري"},"يوم",null,null,null,null,null,null,null,null,null,null,null,null,null,null,null,null,null,null,null,null,null,null,null,null,null,null,null,null,null,null,null,{"$f":"SUM(D81:AH81)","v":0},{"$f":"AI81/8","v":0},{"$f":"SUM(D82:AH82)","v":0},{"$f":"AJ81*DATA!F81-AK81","v":0}]
[null,null,"سلف"]
[41,{"$f":"DATA!B83","v":"علاء احمد ابراهيم"},"يوم",null,null,null,null,null,null,null,null,null,null,null,null,null,null,null,null,null,null,null,null,null,null,null,null,null,null,null,null,null,null,null,{"$f":"SUM(D83:AH83)","v":0},{"$f":"AI83/8","v":0},{"$f":"SUM(D84:AH84)","v":0},{"$f":"AJ83*DATA!F83-AK83","v":0}]
[null,null,"سلف"]
[42,{"$f":"DATA!B85","v":"محمد ابراهيم السيد عقل"},"يوم",null,null,null,null,null,null,null,null,null,null,null,null,null,null,null,null,null,null,null,null,null,null,null,null,null,null,null,null,null,null,null,{"$f":"SUM(D85:AH85)","v":0},{"$f":"AI85/8","v":0},{"$f":"SUM(D86:AH86)","v":0},{"$f":"AJ85*DATA!F85-AK85","v":0}]
[null,null,"سلف"]
[43,{"$f":"DATA!B87","v":"السيد رمضان"},"يوم",null,null,null,null,null,null,null,null,null,null,null,null,null,null,null,null,null,null,null,null,null,null,null,null,null,null,null,null,null,null,null,{"$f":"SUM(D87:AH87)","v":0},{"$f":"AI87/8","v":0},{"$f":"SUM(D88:AH88)","v":0},{"$f":"AJ87*DATA!F87-AK87","v":0}]
[null,null,"سلف"]
[44,{"$f":"DATA!B89","v":"فارس شاكوش"},"يوم",null,null,null,null,null,null,null,null,null,null,null,null,null,null,null,null,null,null,null,null,null,null,null,null,null,null,null,null,null,null,null,{"$f":"SUM(D89:AH89)","v":0},{"$f":"AI89/8","v":0},{"$f":"SUM(D90:AH90)","v":0},{"$f":"AJ89*DATA!F89-AK89","v":0}]
[null,null,"سلف"]
[45,{"$f":"DATA!B91","v":"عبده عزت"},"يوم",null,null,null,null,null,null,null,null,null,null,null,null,null,null,null,null,null,null,null,null,null,null,null,null,null,null,null,null,null,null,null,{"$f":"SUM(D91:AH91)","v":0},{"$f":"AI91/8","v":0},{"$f":"SUM(D92:AH92)","v":0},{"$f":"AJ91*DATA!F91-AK91","v":0}]
[null,null,"سلف"]
[46,{"$f":"DATA!B93","v":"السيد نشأت"},"يوم",null,null,null,null,null,null,null,null,null,null,null,null,null,null,null,null,null,null,null,null,null,null,null,null,null,null,null,null,null,null,null,{"$f":"SUM(D93:AH93)","v":0},{"$f":"AI93/8","v":0},{"$f":"SUM(D94:AH94)","v":0},{"$f":"AJ93*DATA!F93-AK93","v":0}]
[null,null,"سلف"]
[47,{"$f":"DATA!B95","v":"محمود ابراهيم"},"يوم",null,null,null,null,null,null,null,null,null,null,null,null,null,null,null,null,null,null,null,null,null,null,null,null,null,null,null,null,null,null,null,{"$f":"SUM(D95:AH95)","v":0},{"$f":"AI95/8","v":0},{"$f":"SUM(D96:AH96)","v":0},{"$f":"AJ95*DATA!F95-AK95","v":0}]
[null,null,"سلف"]
[48,{"$f":"DATA!B97","v":"نصراحمد مسعد"},"يوم",null,null,null,null,null,null,null,null,null,null,null,null,null,null,null,null,null,null,null,null,null,null,null,null,null,null,null,null,null,null,null,{"$f":"SUM(D97:AH97)","v":0},{"$f":"AI97/8","v":0},{"$f":"SUM(D98:AH98)","v":0},{"$f":"AJ97*DATA!F97-AK97","v":0}]
[null,null,"سلف"]
[49,{"$f":"DATA!B99","v":"ايمن جمعة "},"يوم",null,null,null,null,null,null,null,null,null,null,null,null,null,null,null,null,null,null,null,null,null,null,null,null,null,null,null,null,null,null,null,{"$f":"SUM(D99:AH99)","v":0},{"$f":"AI99/8","v":0},{"$f":"SUM(D100:AH100)","v":0},{"$f":"AJ99*DATA!F99-AK99","v":0}]
[null,null,"سلف"]
[50,{"$f":"DATA!B101","v":0},"يوم",null,null,null,null,null,null,null,null,null,null,null,null,null,null,null,null,null,null,null,null,null,null,null,null,null,null,null,null,null,null,null,{"$f":"SUM(D101:AH101)","v":0},{"$f":"AI101/8","v":0},{"$f":"SUM(D102:AH102)","v":0},{"$f":"AJ101*DATA!F101-AK101","v":0}]
[null,null,"سلف"]
[51,{"$f":"DATA!B103","v":"حسام محسن ابراهيم"},"يوم",null,null,null,null,null,null,null,null,null,null,null,null,null,null,null,null,null,null,null,null,null,null,null,null,null,null,null,null,null,null,null,{"$f":"SUM(D103:AH103)","v":0},{"$f":"AI103/8","v":0},{"$f":"SUM(D104:AH104)","v":0},{"$f":"AJ103*DATA!F103-AK103","v":0}]
[null,null,"سلف"]
[52,{"$f":"DATA!B105","v":"محمد رمضان ابراهيم"},"يوم",null,null,null,null,null,null,null,null,null,null,null,null,null,null,null,null,null,null,null,null,null,null,null,null,null,null,null,null,null,null,null,{"$f":"SUM(D105:AH105)","v":0},{"$f":"AI105/8","v":0},{"$f":"SUM(D106:AH106)","v":0},{"$f":"AJ105*DATA!F105-AK105","v":0}]
[null,null,"سلف"]
[53,{"$f":"DATA!B107","v":"علام السيد"},"يوم",null,null,null,null,null,null,null,null,null,null,null,null,null,null,null,null,null,null,null,null,null,null,null,null,null,null,null,null,null,null,null,{"$f":"SUM(D107:AH107)","v":0},{"$f":"AI107/8","v":0},{"$f":"SUM(D108:AH108)","v":0},{"$f":"AJ107*DATA!F107-AK107","v":0}]
[null,null,"سلف"]
[54,{"$f":"DATA!B109","v":"محمد سكر"},"يوم",null,null,null,null,null,null,null,null,null,null,null,null,null,null,null,null,null,null,null,null,null,null,null,null,null,null,null,null,null,null,null,{"$f":"SUM(D109:AH109)","v":0},{"$f":"AI109/8","v":0},{"$f":"SUM(D110:AH110)","v":0},{"$f":"AJ109*DATA!F109-AK109","v":0}]
[null,null,"سلف"]
[55,{"$f":"DATA!B111","v":"محمد الدمرداش"},"يوم",null,null,null,null,null,null,null,null,null,null,null,null,null,null,null,null,null,null,null,null,null,null,null,null,null,null,null,null,null,null,null,{"$f":"SUM(D111:AH111)","v":0},{"$f":"AI111/8","v":0},{"$f":"SUM(D112:AH112)","v":0},{"$f":"AJ111*DATA!F111-AK111","v":0}]
[null,null,"سلف"]
[56,{"$f":"DATA!B113","v":"عيد المتولى"},"يوم",null,null,null,null,null,null,null,null,null,null,null,null,null,null,null,null,null,null,null,null,null,null,null,null,null,null,null,null,null,null,null,{"$f":"SUM(D113:AH113)","v":0},{"$f":"AI113/8","v":0},{"$f":"SUM(D114:AH114)","v":0},{"$f":"AJ113*DATA!F113-AK113","v":0}]
[null,null,"سلف"]
[57,{"$f":"DATA!B115","v":"سمير الشحات"},"يوم",null,null,null,null,null,null,null,null,null,null,null,null,null,null,null,null,null,null,null,null,null,null,null,null,null,null,null,null,null,null,null,{"$f":"SUM(D115:AH115)","v":0},{"$f":"AI115/8","v":0},{"$f":"SUM(D116:AH116)","v":0},{"$f":"AJ115*DATA!F115-AK115","v":0}]
[null,null,"سلف"]
[58,{"$f":"DATA!B117","v":"حسام حمدان"},"يوم",null,null,null,null,null,null,null,null,null,null,null,null,null,null,null,null,null,null,null,null,null,null,null,null,null,null,null,null,null,null,null,{"$f":"SUM(D117:AH117)","v":0},{"$f":"AI117/8","v":0},{"$f":"SUM(D118:AH118)","v":0},{"$f":"AJ117*DATA!F117-AK117","v":0}]
[null,null,"سلف"]
[59,{"$f":"DATA!B119","v":"رمضان الخميسى"},"يوم",null,null,null,null,null,null,null,null,null,null,null,null,null,null,null,null,null,null,null,null,null,null,null,null,null,null,null,null,null,null,null,{"$f":"SUM(D119:AH119)","v":0},{"$f":"AI119/8","v":0},{"$f":"SUM(D120:AH120)","v":0},{"$f":"AJ119*DATA!F119-AK119","v":0}]
[null,null,"سلف"]
[60,{"$f":"DATA!B121","v":"السيد ذاكى"},"يوم",null,null,null,null,null,null,null,null,null,null,null,null,null,null,null,null,null,null,null,null,null,null,null,null,null,null,null,null,null,null,null,{"$f":"SUM(D121:AH121)","v":0},{"$f":"AI121/8","v":0},{"$f":"SUM(D122:AH122)","v":0},{"$f":"AJ121*DATA!F121-AK121","v":0}]
[null,null,"سلف"]
[61,{"$f":"DATA!B123","v":"احمد فكرى"},"يوم",null,null,null,null,null,null,null,null,null,null,null,null,null,null,null,null,null,null,null,null,null,null,null,null,null,null,null,null,null,null,null,{"$f":"SUM(D123:AH123)","v":0},{"$f":"AI123/8","v":0},{"$f":"SUM(D124:AH124)","v":0},{"$f":"AJ123*DATA!F123-AK123","v":0}]
[null,null,"سلف"]
[62,{"$f":"DATA!B125","v":"محمد سعد"},"يوم",null,null,null,null,null,null,null,null,null,null,null,null,null,null,null,null,null,null,null,null,null,null,null,null,null,null,null,null,null,null,null,{"$f":"SUM(D125:AH125)","v":0},{"$f":"AI125/8","v":0},{"$f":"SUM(D126:AH126)","v":0},{"$f":"AJ125*DATA!F125-AK125","v":0}]
[null,null,"سلف"]
[63,{"$f":"DATA!B127","v":"احمد محمود السعيد"},"يوم",null,null,null,null,null,null,null,null,null,null,null,null,null,null,null,null,null,null,null,null,null,null,null,null,null,null,null,null,null,null,null,{"$f":"SUM(D127:AH127)","v":0},{"$f":"AI127/8","v":0},{"$f":"SUM(D128:AH128)","v":0},{"$f":"AJ127*DATA!F127-AK127","v":0}]
[null,null,"سلف"]
[64,{"$f":"DATA!B129","v":"خالد عزت"},"يوم",null,null,null,null,null,null,null,null,null,null,null,null,null,null,null,null,null,null,null,null,null,null,null,null,null,null,null,null,null,null,null,{"$f":"SUM(D129:AH129)","v":0},{"$f":"AI129/8","v":0},{"$f":"SUM(D130:AH130)","v":0},{"$f":"AJ129*DATA!F129-AK129","v":0}]
[null,null,"سلف"]
[65,{"$f":"DATA!B131","v":"احمد محمد الرشيدى"},"يوم",null,null,null,null,null,null,null,null,null,null,null,null,null,null,null,null,null,null,null,null,null,null,null,null,null,null,null,null,null,null,null,{"$f":"SUM(D131:AH131)","v":0},{"$f":"AI131/8","v":0},{"$f":"SUM(D132:AH132)","v":0},{"$f":"AJ131*DATA!F131-AK131","v":0}]
[null,null,"سلف"]
[66,{"$f":"DATA!B133","v":"خالد وليد"},"يوم",null,null,null,null,null,null,null,null,null,null,null,null,null,null,null,null,null,null,null,null,null,null,null,null,null,null,null,null,null,null,null,{"$f":"SUM(D133:AH133)","v":0},{"$f":"AI133/8","v":0},{"$f":"SUM(D134:AH134)","v":0},{"$f":"AJ133*DATA!F133-AK133","v":0}]
[null,null,"سلف"]
[67,{"$f":"DATA!B135","v":"محمد امر الله"},"يوم",null,null,null,null,null,null,null,null,null,null,null,null,null,null,null,null,null,null,null,null,null,null,null,null,null,null,null,null,null,null,null,{"$f":"SUM(D135:AH135)","v":0},{"$f":"AI135/8","v":0},{"$f":"SUM(D136:AH136)","v":0},{"$f":"AJ135*DATA!F135-AK135","v":0}]
[null,null,"سلف"]
[68,{"$f":"DATA!B137","v":"فايز المحلاوى"},"يوم",null,null,null,null,null,null,null,null,null,null,null,null,null,null,null,null,null,null,null,null,null,null,null,null,null,null,null,null,null,null,null,{"$f":"SUM(D137:AH137)","v":0},{"$f":"AI137/8","v":0},{"$f":"SUM(D138:AH138)","v":0},{"$f":"AJ137*DATA!F137-AK137","v":0}]
[null,null,"سلف"]
[69,{"$f":"DATA!B139","v":"هشام محمود السعيد"},"يوم",null,null,null,null,null,null,null,null,null,null,null,null,null,null,null,null,null,null,null,null,null,null,null,null,null,null,null,null,null,null,null,{"$f":"SUM(D139:AH139)","v":0},{"$f":"AI139/8","v":0},{"$f":"SUM(D140:AH140)","v":0},{"$f":"AJ139*DATA!F139-AK139","v":0}]
[null,null,"سلف"]
[70,{"$f":"DATA!B141","v":"صالح محمد نواره"},"يوم",null,null,null,null,null,null,null,null,null,null,null,null,null,null,null,null,null,null,null,null,null,null,null,null,null,null,null,null,null,null,null,{"$f":"SUM(D141:AH141)","v":0},{"$f":"AI141/8","v":0},{"$f":"SUM(D142:AH142)","v":0},{"$f":"AJ141*DATA!F141-AK141","v":0}]
[null,null,"سلف"]
[71,{"$f":"DATA!B143","v":"محمد السيد السيد"},"يوم",null,null,null,null,null,null,null,null,null,null,null,null,null,null,null,null,null,null,null,null,null,null,null,null,null,null,null,null,null,null,null,{"$f":"SUM(D143:AH143)","v":0},{"$f":"AI143/8","v":0},{"$f":"SUM(D144:AH144)","v":0},{"$f":"AJ143*DATA!F143-AK143","v":0}]
[null,null,"سلف"]
[72,{"$f":"DATA!B145","v":"محمود السيد السيد"},"يوم",null,null,null,null,null,null,null,null,null,null,null,null,null,null,null,null,null,null,null,null,null,null,null,null,null,null,null,null,null,null,null,{"$f":"SUM(D145:AH145)","v":0},{"$f":"AI145/8","v":0},{"$f":"SUM(D146:AH146)","v":0},{"$f":"AJ145*DATA!F145-AK145","v":0}]
[null,null,"سلف"]
[73,{"$f":"DATA!B147","v":"ابراهيم عبد الخالق"},"يوم",null,null,null,null,null,null,null,null,null,null,null,null,null,null,null,null,null,null,null,null,null,null,null,null,null,null,null,null,null,null,null,{"$f":"SUM(D147:AH147)","v":0},{"$f":"AI147/8","v":0},{"$f":"SUM(D148:AH148)","v":0},{"$f":"AJ147*DATA!F147-AK147","v":0}]
[null,null,"سلف"]
[74,{"$f":"DATA!B149","v":"محمد شحاته"},"يوم",null,null,null,null,null,null,null,null,null,null,null,null,null,null,null,null,null,null,null,null,null,null,null,null,null,null,null,null,null,null,null,{"$f":"SUM(D149:AH149)","v":0},{"$f":"AI149/8","v":0},{"$f":"SUM(D150:AH150)","v":0},{"$f":"AJ149*DATA!F149-AK149","v":0}]
[null,null,"سلف"]
[75,{"$f":"DATA!B151","v":"ابراهيم القطب"},"يوم",null,null,null,null,null,null,null,null,null,null,null,null,null,null,null,null,null,null,null,null,null,null,null,null,null,null,null,null,null,null,null,{"$f":"SUM(D151:AH151)","v":0},{"$f":"AI151/8","v":0},{"$f":"SUM(D152:AH152)","v":0},{"$f":"AJ151*DATA!F151-AK151","v":0}]
[null,null,"سلف"]
[76,{"$f":"DATA!B153","v":"محمد احمد الطيب"},"يوم",null,null,null,null,null,null,null,null,null,null,null,null,null,null,null,null,null,null,null,null,null,null,null,null,null,null,null,null,null,null,null,{"$f":"SUM(D153:AH153)","v":0},{"$f":"AI153/8","v":0},{"$f":"SUM(D154:AH154)","v":0},{"$f":"AJ153*DATA!F153-AK153","v":0}]
[null,null,"سلف"]
[77,{"$f":"DATA!B155","v":"حماده عونى"},"يوم",null,null,null,null,null,null,null,null,null,null,null,null,null,null,null,null,null,null,null,null,null,null,null,null,null,null,null,null,null,null,null,{"$f":"SUM(D155:AH155)","v":0},{"$f":"AI155/8","v":0},{"$f":"SUM(D156:AH156)","v":0},{"$f":"AJ155*DATA!F155-AK155","v":0}]
[null,null,"سلف"]
[78,{"$f":"DATA!B157","v":"محمد عادل مرعي"},"يوم",null,null,null,null,null,null,null,null,null,null,null,null,null,null,null,null,null,null,null,null,null,null,null,null,null,null,null,null,null,null,null,{"$f":"SUM(D157:AH157)","v":0},{"$f":"AI157/8","v":0},{"$f":"SUM(D158:AH158)","v":0},{"$f":"AJ157*DATA!F157-AK157","v":0}]
[null,null,"سلف"]
[79,{"$f":"DATA!B159","v":"محمد اسعد"},"يوم",null,null,null,null,null,null,null,null,null,null,null,null,null,null,null,null,null,null,null,null,null,null,null,null,null,null,null,null,null,null,null,{"$f":"SUM(D159:AH159)","v":0},{"$f":"AI159/8","v":0},{"$f":"SUM(D160:AH160)","v":0},{"$f":"AJ159*DATA!F159-AK159","v":0}]
[null,null,"سلف"]
[80,{"$f":"DATA!B161","v":"المتولى محمد شحاتة"},"يوم",null,null,null,null,null,null,null,null,null,null,null,null,null,null,null,null,null,null,null,null,null,null,null,null,null,null,null,null,null,null,null,{"$f":"SUM(D161:AH161)","v":0},{"$f":"AI161/8","v":0},{"$f":"SUM(D162:AH162)","v":0},{"$f":"AJ161*DATA!F161-AK161","v":0}]
[null,null,"سلف"]
[81,{"$f":"DATA!B163","v":"محمد عوضين الدكش"},"يوم",null,null,null,null,null,null,null,null,null,null,null,null,null,null,null,null,null,null,null,null,null,null,null,null,null,null,null,null,null,null,null,{"$f":"SUM(D163:AH163)","v":0},{"$f":"AI163/8","v":0},{"$f":"SUM(D164:AH164)","v":0},{"$f":"AJ163*DATA!F163-AK163","v":0}]
[null,null,"سلف"]
[82,{"$f":"DATA!B165","v":"رجب الشحات"},"يوم",null,null,null,null,null,null,null,null,null,null,null,null,null,null,null,null,null,null,null,null,null,null,null,null,null,null,null,null,null,null,null,{"$f":"SUM(D165:AH165)","v":0},{"$f":"AI165/8","v":0},{"$f":"SUM(D166:AH166)","v":0},{"$f":"AJ165*DATA!F165-AK165","v":0}]
[null,null,"سلف"]
[83,{"$f":"DATA!B167","v":"احمد عبد السلام المتبولى"},"يوم",null,null,null,null,null,null,null,null,null,null,null,null,null,null,null,null,null,null,null,null,null,null,null,null,null,null,null,null,null,null,null,{"$f":"SUM(D167:AH167)","v":0},{"$f":"AI167/8","v":0},{"$f":"SUM(D168:AH168)","v":0},{"$f":"AJ167*DATA!F167-AK167","v":0}]
[null,null,"سلف"]
[84,{"$f":"DATA!B169","v":"كريم شريف المتبولى"},"يوم",null,null,null,null,null,null,null,null,null,null,null,null,null,null,null,null,null,null,null,null,null,null,null,null,null,null,null,null,null,null,null,{"$f":"SUM(D169:AH169)","v":0},{"$f":"AI169/8","v":0},{"$f":"SUM(D170:AH170)","v":0},{"$f":"AJ169*DATA!F169-AK169","v":0}]
[null,null,"سلف"]
[85,{"$f":"DATA!B171","v":"ابراهيم العيسوى"},"يوم",null,null,null,null,null,null,null,null,null,null,null,null,null,null,null,null,null,null,null,null,null,null,null,null,null,null,null,null,null,null,null,{"$f":"SUM(D171:AH171)","v":0},{"$f":"AI171/8","v":0},{"$f":"SUM(D172:AH172)","v":0},{"$f":"AJ171*DATA!F171-AK171","v":0}]
[null,null,"سلف"]
[86,{"$f":"DATA!B173","v":"محمود محمد ياسين"},"يوم",null,null,null,null,null,null,null,null,null,null,null,null,null,null,null,null,null,null,null,null,null,null,null,null,null,null,null,null,null,null,null,{"$f":"SUM(D173:AH173)","v":0},{"$f":"AI173/8","v":0},{"$f":"SUM(D174:AH174)","v":0},{"$f":"AJ173*DATA!F173-AK173","v":0}]
[null,null,"سلف"]
[87,{"$f":"DATA!B175","v":"شعبان ابراهيم (القاهرة)"},"يوم",null,null,null,null,null,null,null,null,null,null,null,null,null,null,null,null,null,null,null,null,null,null,null,null,null,null,null,null,null,null,null,{"$f":"SUM(D175:AH175)","v":0},{"$f":"AI175/8","v":0},{"$f":"SUM(D176:AH176)","v":0},{"$f":"AJ175*DATA!F175-AK175","v":0}]
[null,null,"سلف"]
[88,{"$f":"DATA!B177","v":0},"يوم",null,null,null,null,null,null,null,null,null,null,null,null,null,null,null,null,null,null,null,null,null,null,null,null,null,null,null,null,null,null,null,{"$f":"SUM(D177:AH177)","v":0},{"$f":"AI177/8","v":0},{"$f":"SUM(D178:AH178)","v":0},{"$f":"AJ177*DATA!F177-AK177","v":0}]
[null,null,"سلف"]
[89,{"$f":"DATA!B179","v":0},"يوم",null,null,null,null,null,null,null,null,null,null,null,null,null,null,null,null,null,null,null,null,null,null,null,null,null,null,null,null,null,null,null,{"$f":"SUM(D179:AH179)","v":0},{"$f":"AI179/8","v":0},{"$f":"SUM(D180:AH180)","v":0},{"$f":"AJ179*DATA!F179-AK179","v":0}]
[null,null,"سلف"]
[90,{"$f":"DATA!B181","v":0},"يوم",null,null,null,null,null,null,null,null,null,null,null,null,null,null,null,null,null,null,null,null,null,null,null,null,null,null,null,null,null,null,null,{"$f":"SUM(D181:AH181)","v":0},{"$f":"AI181/8","v":0},{"$f":"SUM(D182:AH182)","v":0},{"$f":"AJ181*DATA!F181-AK181","v":0}]
[null,null,"سلف"]
[91,{"$f":"DATA!B183","v":0},"يوم",null,null,null,null,null,null,null,null,null,null,null,null,null,null,null,null,null,null,null,null,null,null,null,null,null,null,null,null,null,null,null,{"$f":"SUM(D183:AH183)","v":0},{"$f":"AI183/8","v":0},{"$f":"SUM(D184:AH184)","v":0},{"$f":"AJ183*DATA!F183-AK183","v":0}]
[null,null,"سلف"]
[92,{"$f":"DATA!B185","v":0},"يوم",null,null,null,null,null,null,null,null,null,null,null,null,null,null,null,null,null,null,null,null,null,null,null,null,null,null,null,null,null,null,null,{"$f":"SUM(D185:AH185)","v":0},{"$f":"AI185/8","v":0},{"$f":"SUM(D186:AH186)","v":0},{"$f":"AJ185*DATA!F185-AK185","v":0}]
[null,null,"سلف"]
[93,{"$f":"DATA!B187","v":0},"يوم",null,null,null,null,null,null,null,null,null,null,null,null,null,null,null,null,null,null,null,null,null,null,null,null,null,null,null,null,null,null,null,{"$f":"SUM(D187:AH187)","v":0},{"$f":"AI187/8","v":0},{"$f":"SUM(D188:AH188)","v":0},{"$f":"AJ187*DATA!F187-AK187","v":0}]
[null,null,"سلف"]
[94,{"$f":"DATA!B189","v":0},"يوم",null,null,null,null,null,null,null,null,null,null,null,null,null,null,null,null,null,null,null,null,null,null,null,null,null,null,null,null,null,null,null,{"$f":"SUM(D189:AH189)","v":0},{"$f":"AI189/8","v":0},{"$f":"SUM(D190:AH190)","v":0},{"$f":"AJ189*DATA!F189-AK189","v":0}]
[null,null,"سلف"]
[95,{"$f":"DATA!B191","v":0},"يوم",null,null,null,null,null,null,null,null,null,null,null,null,null,null,null,null,null,null,null,null,null,null,null,null,null,null,null,null,null,null,null,{"$f":"SUM(D191:AH191)","v":0},{"$f":"AI191/8","v":0},{"$f":"SUM(D192:AH192)","v":0},{"$f":"AJ191*DATA!F191-AK191","v":0}]
[null,null,"سلف"]
[96,{"$f":"DATA!B193","v":0},"يوم",null,null,null,null,null,null,null,null,null,null,null,null,null,null,null,null,null,null,null,null,null,null,null,null,null,null,null,null,null,null,null,{"$f":"SUM(D193:AH193)","v":0},{"$f":"AI193/8","v":0},{"$f":"SUM(D194:AH194)","v":0},{"$f":"AJ193*DATA!F193-AK193","v":0}]
[null,null,"سلف"]
[97,{"$f":"DATA!B195","v":0},"يوم",null,null,null,null,null,null,null,null,null,null,null,null,null,null,null,null,null,null,null,null,null,null,null,null,null,null,null,null,null,null,null,{"$f":"SUM(D195:AH195)","v":0},{"$f":"AI195/8","v":0},{"$f":"SUM(D196:AH196)","v":0},{"$f":"AJ195*DATA!F195-AK195","v":0}]
[null,null,"سلف"]
[98,{"$f":"DATA!B197","v":0},"يوم",null,null,null,null,null,null,null,null,null,null,null,null,null,null,null,null,null,null,null,null,null,null,null,null,null,null,null,null,null,null,null,{"$f":"SUM(D197:AH197)","v":0},{"$f":"AI197/8","v":0},{"$f":"SUM(D198:AH198)","v":0},{"$f":"AJ197*DATA!F197-AK197","v":0}]
[null,null,"سلف"]
[99,{"$f":"DATA!B199","v":0},"يوم",null,null,null,null,null,null,null,null,null,null,null,null,null,null,null,null,null,null,null,null,null,null,null,null,null,null,null,null,null,null,null,{"$f":"SUM(D199:AH199)","v":0},{"$f":"AI199/8","v":0},{"$f":"SUM(D200:AH200)","v":0},{"$f":"AJ199*DATA!F199-AK199","v":0}]
[null,null,"سلف"]
[100,{"$f":"DATA!B201","v":0},"يوم",null,null,null,null,null,null,null,null,null,null,null,null,null,null,null,null,null,null,null,null,null,null,null,null,null,null,null,null,null,null,null,{"$f":"SUM(D201:AH201)","v":0},{"$f":"AI201/8","v":0},{"$f":"SUM(D202:AH202)","v":0},{"$f":"AJ201*DATA!F201-AK201","v":0}]
[null,null,"سلف"]

{"sheet":"البوم","index":2,"n_rows":2,"n_cols":3,"rows_kept":2,"cut":false,"hidden":false,"merged":[]}
["م","صورة","ملاحظة"]
["1.(1/18)","البوم_Images/2.صورة.193328.png"]

{"sheet":"DATA","index":3,"n_rows":252,"n_cols":37,"rows_kept":252,"cut":false,"hidden":false,"merged":[]}
[]
["ID","الاسم","ساعات ","ايام ","سلف","s","1","2","3","4","5","6","7","8","9","10","11","12","13","14","15","16","17","18","19","20","21","22","23","24","25","26","27","28","29","30","31"]
[1,"احمد الحديدي",{"$f":"'شهر 10'!AI3","v":0},{"$f":"'شهر 10'!AJ3","v":0},{"$f":"'شهر 10'!AK3","v":0},200,{"$f":"'شهر 10'!D3","v":0},{"$f":"'شهر 10'!E3","v":0},{"$f":"'شهر 10'!F3","v":0},{"$f":"'شهر 10'!G3","v":0},{"$f":"'شهر 10'!H3","v":0},{"$f":"'شهر 10'!I3","v":0},{"$f":"'شهر 10'!J3","v":0},{"$f":"'شهر 10'!K3","v":0},{"$f":"'شهر 10'!L3","v":0},{"$f":"'شهر 10'!M3","v":0},{"$f":"'شهر 10'!N3","v":0},{"$f":"'شهر 10'!O3","v":0},{"$f":"'شهر 10'!P3","v":0},{"$f":"'شهر 10'!Q3","v":0},{"$f":"'شهر 10'!R3","v":0},{"$f":"'شهر 10'!S3","v":0},{"$f":"'شهر 10'!T3","v":0},{"$f":"'شهر 10'!U3","v":0},{"$f":"'شهر 10'!V3","v":0},{"$f":"'شهر 10'!W3","v":0},{"$f":"'شهر 10'!X3","v":0},{"$f":"'شهر 10'!Y3","v":0},{"$f":"'شهر 10'!Z3","v":0},{"$f":"'شهر 10'!AA3","v":0},{"$f":"'شهر 10'!AB3","v":0},{"$f":"'شهر 10'!AC3","v":0},{"$f":"'شهر 10'!AD3","v":0},{"$f":"'شهر 10'!AE3","v":0},{"$f":"'شهر 10'!AF3","v":0},{"$f":"'شهر 10'!AG3","v":0},{"$f":"'شهر 10'!AH3","v":0}]
[null,null,null,null,null,null,{"$f":"'شهر 10'!D4","v":0},{"$f":"'شهر 10'!E4","v":0},{"$f":"'شهر 10'!F4","v":0},{"$f":"'شهر 10'!G4","v":0},{"$f":"'شهر 10'!H4","v":0},{"$f":"'شهر 10'!I4","v":0},{"$f":"'شهر 10'!J4","v":0},{"$f":"'شهر 10'!K4","v":0},{"$f":"'شهر 10'!L4","v":0},{"$f":"'شهر 10'!M4","v":0},{"$f":"'شهر 10'!N4","v":0},{"$f":"'شهر 10'!O4","v":0},{"$f":"'شهر 10'!P4","v":0},{"$f":"'شهر 10'!Q4","v":0},{"$f":"'شهر 10'!R4","v":0},{"$f":"'شهر 10'!S4","v":0},{"$f":"'شهر 10'!T4","v":0},{"$f":"'شهر 10'!U4","v":0},{"$f":"'شهر 10'!V4","v":0},{"$f":"'شهر 10'!W4","v":0},{"$f":"'شهر 10'!X4","v":0},{"$f":"'شهر 10'!Y4","v":0},{"$f":"'شهر 10'!Z4","v":0},{"$f":"'شهر 10'!AA4","v":0},{"$f":"'شهر 10'!AB4","v":0},{"$f":"'شهر 10'!AC4","v":0},{"$f":"'شهر 10'!AD4","v":0},{"$f":"'شهر 10'!AE4","v":0},{"$f":"'شهر 10'!AF4","v":0},{"$f":"'شهر 10'!AG4","v":0},{"$f":"'شهر 10'!AH4","v":0}]
[2,"مدحت عصام",{"$f":"'شهر 10'!AI5","v":0},{"$f":"'شهر 10'!AJ5","v":0},{"$f":"'شهر 10'!AK5","v":0},null,{"$f":"'شهر 10'!D5","v":0},{"$f":"'شهر 10'!E5","v":0},{"$f":"'شهر 10'!F5","v":0},{"$f":"'شهر 10'!G5","v":0},{"$f":"'شهر 10'!H5","v":0},{"$f":"'شهر 10'!I5","v":0},{"$f":"'شهر 10'!J5","v":0},{"$f":"'شهر 10'!K5","v":0},{"$f":"'شهر 10'!L5","v":0},{"$f":"'شهر 10'!M5","v":0},{"$f":"'شهر 10'!N5","v":0},{"$f":"'شهر 10'!O5","v":0},{"$f":"'شهر 10'!P5","v":0},{"$f":"'شهر 10'!Q5","v":0},{"$f":"'شهر 10'!R5","v":0},{"$f":"'شهر 10'!S5","v":0},{"$f":"'شهر 10'!T5","v":0},{"$f":"'شهر 10'!U5","v":0},{"$f":"'شهر 10'!V5","v":0},{"$f":"'شهر 10'!W5","v":0},{"$f":"'شهر 10'!X5","v":0},{"$f":"'شهر 10'!Y5","v":0},{"$f":"'شهر 10'!Z5","v":0},{"$f":"'شهر 10'!AA5","v":0},{"$f":"'شهر 10'!AB5","v":0},{"$f":"'شهر 10'!AC5","v":0},{"$f":"'شهر 10'!AD5","v":0},{"$f":"'شهر 10'!AE5","v":0},{"$f":"'شهر 10'!AF5","v":0},{"$f":"'شهر 10'!AG5","v":0},{"$f":"'شهر 10'!AH5","v":0}]
[null,null,null,null,null,null,{"$f":"'شهر 10'!D6","v":0},{"$f":"'شهر 10'!E6","v":0},{"$f":"'شهر 10'!F6","v":0},{"$f":"'شهر 10'!G6","v":0},{"$f":"'شهر 10'!H6","v":0},{"$f":"'شهر 10'!I6","v":0},{"$f":"'شهر 10'!J6","v":0},{"$f":"'شهر 10'!K6","v":0},{"$f":"'شهر 10'!L6","v":0},{"$f":"'شهر 10'!M6","v":0},{"$f":"'شهر 10'!N6","v":0},{"$f":"'شهر 10'!O6","v":0},{"$f":"'شهر 10'!P6","v":0},{"$f":"'شهر 10'!Q6","v":0},{"$f":"'شهر 10'!R6","v":0},{"$f":"'شهر 10'!S6","v":0},{"$f":"'شهر 10'!T6","v":0},{"$f":"'شهر 10'!U6","v":0},{"$f":"'شهر 10'!V6","v":0},{"$f":"'شهر 10'!W6","v":0},{"$f":"'شهر 10'!X6","v":0},{"$f":"'شهر 10'!Y6","v":0},{"$f":"'شهر 10'!Z6","v":0},{"$f":"'شهر 10'!AA6","v":0},{"$f":"'شهر 10'!AB6","v":0},{"$f":"'شهر 10'!AC6","v":0},{"$f":"'شهر 10'!AD6","v":0},{"$f":"'شهر 10'!AE6","v":0},{"$f":"'شهر 10'!AF6","v":0},{"$f":"'شهر 10'!AG6","v":0},{"$f":"'شهر 10'!AH6","v":0}]
[3,"منير العيسوى",{"$f":"'شهر 10'!AI7","v":0},{"$f":"'شهر 10'!AJ7","v":0},{"$f":"'شهر 10'!AK7","v":0},null,{"$f":"'شهر 10'!D7","v":0},{"$f":"'شهر 10'!E7","v":0},{"$f":"'شهر 10'!F7","v":0},{"$f":"'شهر 10'!G7","v":0},{"$f":"'شهر 10'!H7","v":0},{"$f":"'شهر 10'!I7","v":0},{"$f":"'شهر 10'!J7","v":0},{"$f":"'شهر 10'!K7","v":0},{"$f":"'شهر 10'!L7","v":0},{"$f":"'شهر 10'!M7","v":0},{"$f":"'شهر 10'!N7","v":0},{"$f":"'شهر 10'!O7","v":0},{"$f":"'شهر 10'!P7","v":0},{"$f":"'شهر 10'!Q7","v":0},{"$f":"'شهر 10'!R7","v":0},{"$f":"'شهر 10'!S7","v":0},{"$f":"'شهر 10'!T7","v":0},{"$f":"'شهر 10'!U7","v":0},{"$f":"'شهر 10'!V7","v":0},{"$f":"'شهر 10'!W7","v":0},{"$f":"'شهر 10'!X7","v":0},{"$f":"'شهر 10'!Y7","v":0},{"$f":"'شهر 10'!Z7","v":0},{"$f":"'شهر 10'!AA7","v":0},{"$f":"'شهر 10'!AB7","v":0},{"$f":"'شهر 10'!AC7","v":0},{"$f":"'شهر 10'!AD7","v":0},{"$f":"'شهر 10'!AE7","v":0},{"$f":"'شهر 10'!AF7","v":0},{"$f":"'شهر 10'!AG7","v":0},{"$f":"'شهر 10'!AH7","v":0}]
[null,null,null,null,null,null,{"$f":"'شهر 10'!D8","v":0},{"$f":"'شهر 10'!E8","v":0},{"$f":"'شهر 10'!F8","v":0},{"$f":"'شهر 10'!G8","v":0},{"$f":"'شهر 10'!H8","v":0},{"$f":"'شهر 10'!I8","v":0},{"$f":"'شهر 10'!J8","v":0},{"$f":"'شهر 10'!K8","v":0},{"$f":"'شهر 10'!L8","v":0},{"$f":"'شهر 10'!M8","v":0},{"$f":"'شهر 10'!N8","v":0},{"$f":"'شهر 10'!O8","v":0},{"$f":"'شهر 10'!P8","v":0},{"$f":"'شهر 10'!Q8","v":0},{"$f":"'شهر 10'!R8","v":0},{"$f":"'شهر 10'!S8","v":0},{"$f":"'شهر 10'!T8","v":0},{"$f":"'شهر 10'!U8","v":0},{"$f":"'شهر 10'!V8","v":0},{"$f":"'شهر 10'!W8","v":0},{"$f":"'شهر 10'!X8","v":0},{"$f":"'شهر 10'!Y8","v":0},{"$f":"'شهر 10'!Z8","v":0},{"$f":"'شهر 10'!AA8","v":0},{"$f":"'شهر 10'!AB8","v":0},{"$f":"'شهر 10'!AC8","v":0},{"$f":"'شهر 10'!AD8","v":0},{"$f":"'شهر 10'!AE8","v":0},{"$f":"'شهر 10'!AF8","v":0},{"$f":"'شهر 10'!AG8","v":0},{"$f":"'شهر 10'!AH8","v":0}]
[4,"باسم ابو الخير",{"$f":"'شهر 10'!AI9","v":0},{"$f":"'شهر 10'!AJ9","v":0},{"$f":"'شهر 10'!AK9","v":0},null,{"$f":"'شهر 10'!D9","v":0},{"$f":"'شهر 10'!E9","v":0},{"$f":"'شهر 10'!F9","v":0},{"$f":"'شهر 10'!G9","v":0},{"$f":"'شهر 10'!H9","v":0},{"$f":"'شهر 10'!I9","v":0},{"$f":"'شهر 10'!J9","v":0},{"$f":"'شهر 10'!K9","v":0},{"$f":"'شهر 10'!L9","v":0},{"$f":"'شهر 10'!M9","v":0},{"$f":"'شهر 10'!N9","v":0},{"$f":"'شهر 10'!O9","v":0},{"$f":"'شهر 10'!P9","v":0},{"$f":"'شهر 10'!Q9","v":0},{"$f":"'شهر 10'!R9","v":0},{"$f":"'شهر 10'!S9","v":0},{"$f":"'شهر 10'!T9","v":0},{"$f":"'شهر 10'!U9","v":0},{"$f":"'شهر 10'!V9","v":0},{"$f":"'شهر 10'!W9","v":0},{"$f":"'شهر 10'!X9","v":0},{"$f":"'شهر 10'!Y9","v":0},{"$f":"'شهر 10'!Z9","v":0},{"$f":"'شهر 10'!AA9","v":0},{"$f":"'شهر 10'!AB9","v":0},{"$f":"'شهر 10'!AC9","v":0},{"$f":"'شهر 10'!AD9","v":0},{"$f":"'شهر 10'!AE9","v":0},{"$f":"'شهر 10'!AF9","v":0},{"$f":"'شهر 10'!AG9","v":0},{"$f":"'شهر 10'!AH9","v":0}]
[null,null,null,null,null,null,{"$f":"'شهر 10'!D10","v":0},{"$f":"'شهر 10'!E10","v":0},{"$f":"'شهر 10'!F10","v":0},{"$f":"'شهر 10'!G10","v":0},{"$f":"'شهر 10'!H10","v":0},{"$f":"'شهر 10'!I10","v":0},{"$f":"'شهر 10'!J10","v":0},{"$f":"'شهر 10'!K10","v":0},{"$f":"'شهر 10'!L10","v":0},{"$f":"'شهر 10'!M10","v":0},{"$f":"'شهر 10'!N10","v":0},{"$f":"'شهر 10'!O10","v":0},{"$f":"'شهر 10'!P10","v":0},{"$f":"'شهر 10'!Q10","v":0},{"$f":"'شهر 10'!R10","v":0},{"$f":"'شهر 10'!S10","v":0},{"$f":"'شهر 10'!T10","v":0},{"$f":"'شهر 10'!U10","v":0},{"$f":"'شهر 10'!V10","v":0},{"$f":"'شهر 10'!W10","v":0},{"$f":"'شهر 10'!X10","v":0},{"$f":"'شهر 10'!Y10","v":0},{"$f":"'شهر 10'!Z10","v":0},{"$f":"'شهر 10'!AA10","v":0},{"$f":"'شهر 10'!AB10","v":0},{"$f":"'شهر 10'!AC10","v":0},{"$f":"'شهر 10'!AD10","v":0},{"$f":"'شهر 10'!AE10","v":0},{"$f":"'شهر 10'!AF10","v":0},{"$f":"'شهر 10'!AG10","v":0},{"$f":"'شهر 10'!AH10","v":0}]
[5,"عبد الطيف المرسي",{"$f":"'شهر 10'!AI11","v":0},{"$f":"'شهر 10'!AJ11","v":0},{"$f":"'شهر 10'!AK11","v":0},null,{"$f":"'شهر 10'!D11","v":0},{"$f":"'شهر 10'!E11","v":0},{"$f":"'شهر 10'!F11","v":0},{"$f":"'شهر 10'!G11","v":0},{"$f":"'شهر 10'!H11","v":0},{"$f":"'شهر 10'!I11","v":0},{"$f":"'شهر 10'!J11","v":0},{"$f":"'شهر 10'!K11","v":0},{"$f":"'شهر 10'!L11","v":0},{"$f":"'شهر 10'!M11","v":0},{"$f":"'شهر 10'!N11","v":0},{"$f":"'شهر 10'!O11","v":0},{"$f":"'شهر 10'!P11","v":0},{"$f":"'شهر 10'!Q11","v":0},{"$f":"'شهر 10'!R11","v":0},{"$f":"'شهر 10'!S11","v":0},{"$f":"'شهر 10'!T11","v":0},{"$f":"'شهر 10'!U11","v":0},{"$f":"'شهر 10'!V11","v":0},{"$f":"'شهر 10'!W11","v":0},{"$f":"'شهر 10'!X11","v":0},{"$f":"'شهر 10'!Y11","v":0},{"$f":"'شهر 10'!Z11","v":0},{"$f":"'شهر 10'!AA11","v":0},{"$f":"'شهر 10'!AB11","v":0},{"$f":"'شهر 10'!AC11","v":0},{"$f":"'شهر 10'!AD11","v":0},{"$f":"'شهر 10'!AE11","v":0},{"$f":"'شهر 10'!AF11","v":0},{"$f":"'شهر 10'!AG11","v":0},{"$f":"'شهر 10'!AH11","v":0}]
[null,null,null,null,null,null,{"$f":"'شهر 10'!D12","v":0},{"$f":"'شهر 10'!E12","v":0},{"$f":"'شهر 10'!F12","v":0},{"$f":"'شهر 10'!G12","v":0},{"$f":"'شهر 10'!H12","v":0},{"$f":"'شهر 10'!I12","v":0},{"$f":"'شهر 10'!J12","v":0},{"$f":"'شهر 10'!K12","v":0},{"$f":"'شهر 10'!L12","v":0},{"$f":"'شهر 10'!M12","v":0},{"$f":"'شهر 10'!N12","v":0},{"$f":"'شهر 10'!O12","v":0},{"$f":"'شهر 10'!P12","v":0},{"$f":"'شهر 10'!Q12","v":0},{"$f":"'شهر 10'!R12","v":0},{"$f":"'شهر 10'!S12","v":0},{"$f":"'شهر 10'!T12","v":0},{"$f":"'شهر 10'!U12","v":0},{"$f":"'شهر 10'!V12","v":0},{"$f":"'شهر 10'!W12","v":0},{"$f":"'شهر 10'!X12","v":0},{"$f":"'شهر 10'!Y12","v":0},{"$f":"'شهر 10'!Z12","v":0},{"$f":"'شهر 10'!AA12","v":0},{"$f":"'شهر 10'!AB12","v":0},{"$f":"'شهر 10'!AC12","v":0},{"$f":"'شهر 10'!AD12","v":0},{"$f":"'شهر 10'!AE12","v":0},{"$f":"'شهر 10'!AF12","v":0},{"$f":"'شهر 10'!AG12","v":0},{"$f":"'شهر 10'!AH12","v":0}]
[6,"محمود ابراهيم ضيف",{"$f":"'شهر 10'!AI13","v":0},{"$f":"'شهر 10'!AJ13","v":0},{"$f":"'شهر 10'!AK13","v":0},null,{"$f":"'شهر 10'!D13","v":0},{"$f":"'شهر 10'!E13","v":0},{"$f":"'شهر 10'!F13","v":0},{"$f":"'شهر 10'!G13","v":0},{"$f":"'شهر 10'!H13","v":0},{"$f":"'شهر 10'!I13","v":0},{"$f":"'شهر 10'!J13","v":0},{"$f":"'شهر 10'!K13","v":0},{"$f":"'شهر 10'!L13","v":0},{"$f":"'شهر 10'!M13","v":0},{"$f":"'شهر 10'!N13","v":0},{"$f":"'شهر 10'!O13","v":0},{"$f":"'شهر 10'!P13","v":0},{"$f":"'شهر 10'!Q13","v":0},{"$f":"'شهر 10'!R13","v":0},{"$f":"'شهر 10'!S13","v":0},{"$f":"'شهر 10'!T13","v":0},{"$f":"'شهر 10'!U13","v":0},{"$f":"'شهر 10'!V13","v":0},{"$f":"'شهر 10'!W13","v":0},{"$f":"'شهر 10'!X13","v":0},{"$f":"'شهر 10'!Y13","v":0},{"$f":"'شهر 10'!Z13","v":0},{"$f":"'شهر 10'!AA13","v":0},{"$f":"'شهر 10'!AB13","v":0},{"$f":"'شهر 10'!AC13","v":0},{"$f":"'شهر 10'!AD13","v":0},{"$f":"'شهر 10'!AE13","v":0},{"$f":"'شهر 10'!AF13","v":0},{"$f":"'شهر 10'!AG13","v":0},{"$f":"'شهر 10'!AH13","v":0}]
[null,null,null,null,null,null,{"$f":"'شهر 10'!D14","v":0},{"$f":"'شهر 10'!E14","v":0},{"$f":"'شهر 10'!F14","v":0},{"$f":"'شهر 10'!G14","v":0},{"$f":"'شهر 10'!H14","v":0},{"$f":"'شهر 10'!I14","v":0},{"$f":"'شهر 10'!J14","v":0},{"$f":"'شهر 10'!K14","v":0},{"$f":"'شهر 10'!L14","v":0},{"$f":"'شهر 10'!M14","v":0},{"$f":"'شهر 10'!N14","v":0},{"$f":"'شهر 10'!O14","v":0},{"$f":"'شهر 10'!P14","v":0},{"$f":"'شهر 10'!Q14","v":0},{"$f":"'شهر 10'!R14","v":0},{"$f":"'شهر 10'!S14","v":0},{"$f":"'شهر 10'!T14","v":0},{"$f":"'شهر 10'!U14","v":0},{"$f":"'شهر 10'!V14","v":0},{"$f":"'شهر 10'!W14","v":0},{"$f":"'شهر 10'!X14","v":0},{"$f":"'شهر 10'!Y14","v":0},{"$f":"'شهر 10'!Z14","v":0},{"$f":"'شهر 10'!AA14","v":0},{"$f":"'شهر 10'!AB14","v":0},{"$f":"'شهر 10'!AC14","v":0},{"$f":"'شهر 10'!AD14","v":0},{"$f":"'شهر 10'!AE14","v":0},{"$f":"'شهر 10'!AF14","v":0},{"$f":"'شهر 10'!AG14","v":0},{"$f":"'شهر 10'!AH14","v":0}]
[7,"خليل محمد خليل",{"$f":"'شهر 10'!AI15","v":0},{"$f":"'شهر 10'!AJ15","v":0},{"$f":"'شهر 10'!AK15","v":0},null,{"$f":"'شهر 10'!D15","v":0},{"$f":"'شهر 10'!E15","v":0},{"$f":"'شهر 10'!F15","v":0},{"$f":"'شهر 10'!G15","v":0},{"$f":"'شهر 10'!H15","v":0},{"$f":"'شهر 10'!I15","v":0},{"$f":"'شهر 10'!J15","v":0},{"$f":"'شهر 10'!K15","v":0},{"$f":"'شهر 10'!L15","v":0},{"$f":"'شهر 10'!M15","v":0},{"$f":"'شهر 10'!N15","v":0},{"$f":"'شهر 10'!O15","v":0},{"$f":"'شهر 10'!P15","v":0},{"$f":"'شهر 10'!Q15","v":0},{"$f":"'شهر 10'!R15","v":0},{"$f":"'شهر 10'!S15","v":0},{"$f":"'شهر 10'!T15","v":0},{"$f":"'شهر 10'!U15","v":0},{"$f":"'شهر 10'!V15","v":0},{"$f":"'شهر 10'!W15","v":0},{"$f":"'شهر 10'!X15","v":0},{"$f":"'شهر 10'!Y15","v":0},{"$f":"'شهر 10'!Z15","v":0},{"$f":"'شهر 10'!AA15","v":0},{"$f":"'شهر 10'!AB15","v":0},{"$f":"'شهر 10'!AC15","v":0},{"$f":"'شهر 10'!AD15","v":0},{"$f":"'شهر 10'!AE15","v":0},{"$f":"'شهر 10'!AF15","v":0},{"$f":"'شهر 10'!AG15","v":0},{"$f":"'شهر 10'!AH15","v":0}]
[null,null,null,null,null,null,{"$f":"'شهر 10'!D16","v":0},{"$f":"'شهر 10'!E16","v":0},{"$f":"'شهر 10'!F16","v":0},{"$f":"'شهر 10'!G16","v":0},{"$f":"'شهر 10'!H16","v":0},{"$f":"'شهر 10'!I16","v":0},{"$f":"'شهر 10'!J16","v":0},{"$f":"'شهر 10'!K16","v":0},{"$f":"'شهر 10'!L16","v":0},{"$f":"'شهر 10'!M16","v":0},{"$f":"'شهر 10'!N16","v":0},{"$f":"'شهر 10'!O16","v":0},{"$f":"'شهر 10'!P16","v":0},{"$f":"'شهر 10'!Q16","v":0},{"$f":"'شهر 10'!R16","v":0},{"$f":"'شهر 10'!S16","v":0},{"$f":"'شهر 10'!T16","v":0},{"$f":"'شهر 10'!U16","v":0},{"$f":"'شهر 10'!V16","v":0},{"$f":"'شهر 10'!W16","v":0},{"$f":"'شهر 10'!X16","v":0},{"$f":"'شهر 10'!Y16","v":0},{"$f":"'شهر 10'!Z16","v":0},{"$f":"'شهر 10'!AA16","v":0},{"$f":"'شهر 10'!AB16","v":0},{"$f":"'شهر 10'!AC16","v":0},{"$f":"'شهر 10'!AD16","v":0},{"$f":"'شهر 10'!AE16","v":0},{"$f":"'شهر 10'!AF16","v":0},{"$f":"'شهر 10'!AG16","v":0},{"$f":"'شهر 10'!AH16","v":0}]
[8,"حسام حسن",{"$f":"'شهر 10'!AI17","v":0},{"$f":"'شهر 10'!AJ17","v":0},{"$f":"'شهر 10'!AK17","v":0},null,{"$f":"'شهر 10'!D17","v":0},{"$f":"'شهر 10'!E17","v":0},{"$f":"'شهر 10'!F17","v":0},{"$f":"'شهر 10'!G17","v":0},{"$f":"'شهر 10'!H17","v":0},{"$f":"'شهر 10'!I17","v":0},{"$f":"'شهر 10'!J17","v":0},{"$f":"'شهر 10'!K17","v":0},{"$f":"'شهر 10'!L17","v":0},{"$f":"'شهر 10'!M17","v":0},{"$f":"'شهر 10'!N17","v":0},{"$f":"'شهر 10'!O17","v":0},{"$f":"'شهر 10'!P17","v":0},{"$f":"'شهر 10'!Q17","v":0},{"$f":"'شهر 10'!R17","v":0},{"$f":"'شهر 10'!S17","v":0},{"$f":"'شهر 10'!T17","v":0},{"$f":"'شهر 10'!U17","v":0},{"$f":"'شهر 10'!V17","v":0},{"$f":"'شهر 10'!W17","v":0},{"$f":"'شهر 10'!X17","v":0},{"$f":"'شهر 10'!Y17","v":0},{"$f":"'شهر 10'!Z17","v":0},{"$f":"'شهر 10'!AA17","v":0},{"$f":"'شهر 10'!AB17","v":0},{"$f":"'شهر 10'!AC17","v":0},{"$f":"'شهر 10'!AD17","v":0},{"$f":"'شهر 10'!AE17","v":0},{"$f":"'شهر 10'!AF17","v":0},{"$f":"'شهر 10'!AG17","v":0},{"$f":"'شهر 10'!AH17","v":0}]
[null,null,null,null,null,null,{"$f":"'شهر 10'!D18","v":0},{"$f":"'شهر 10'!E18","v":0},{"$f":"'شهر 10'!F18","v":0},{"$f":"'شهر 10'!G18","v":0},{"$f":"'شهر 10'!H18","v":0},{"$f":"'شهر 10'!I18","v":0},{"$f":"'شهر 10'!J18","v":0},{"$f":"'شهر 10'!K18","v":0},{"$f":"'شهر 10'!L18","v":0},{"$f":"'شهر 10'!M18","v":0},{"$f":"'شهر 10'!N18","v":0},{"$f":"'شهر 10'!O18","v":0},{"$f":"'شهر 10'!P18","v":0},{"$f":"'شهر 10'!Q18","v":0},{"$f":"'شهر 10'!R18","v":0},{"$f":"'شهر 10'!S18","v":0},{"$f":"'شهر 10'!T18","v":0},{"$f":"'شهر 10'!U18","v":0},{"$f":"'شهر 10'!V18","v":0},{"$f":"'شهر 10'!W18","v":0},{"$f":"'شهر 10'!X18","v":0},{"$f":"'شهر 10'!Y18","v":0},{"$f":"'شهر 10'!Z18","v":0},{"$f":"'شهر 10'!AA18","v":0},{"$f":"'شهر 10'!AB18","v":0},{"$f":"'شهر 10'!AC18","v":0},{"$f":"'شهر 10'!AD18","v":0},{"$f":"'شهر 10'!AE18","v":0},{"$f":"'شهر 10'!AF18","v":0},{"$f":"'شهر 10'!AG18","v":0},{"$f":"'شهر 10'!AH18","v":0}]
[9,"محمود المحلاوي",{"$f":"'شهر 10'!AI19","v":0},{"$f":"'شهر 10'!AJ19","v":0},{"$f":"'شهر 10'!AK19","v":0},null,{"$f":"'شهر 10'!D19","v":0},{"$f":"'شهر 10'!E19","v":0},{"$f":"'شهر 10'!F19","v":0},{"$f":"'شهر 10'!G19","v":0},{"$f":"'شهر 10'!H19","v":0},{"$f":"'شهر 10'!I19","v":0},{"$f":"'شهر 10'!J19","v":0},{"$f":"'شهر 10'!K19","v":0},{"$f":"'شهر 10'!L19","v":0},{"$f":"'شهر 10'!M19","v":0},{"$f":"'شهر 10'!N19","v":0},{"$f":"'شهر 10'!O19","v":0},{"$f":"'شهر 10'!P19","v":0},{"$f":"'شهر 10'!Q19","v":0},{"$f":"'شهر 10'!R19","v":0},{"$f":"'شهر 10'!S19","v":0},{"$f":"'شهر 10'!T19","v":0},{"$f":"'شهر 10'!U19","v":0},{"$f":"'شهر 10'!V19","v":0},{"$f":"'شهر 10'!W19","v":0},{"$f":"'شهر 10'!X19","v":0},{"$f":"'شهر 10'!Y19","v":0},{"$f":"'شهر 10'!Z19","v":0},{"$f":"'شهر 10'!AA19","v":0},{"$f":"'شهر 10'!AB19","v":0},{"$f":"'شهر 10'!AC19","v":0},{"$f":"'شهر 10'!AD19","v":0},{"$f":"'شهر 10'!AE19","v":0},{"$f":"'شهر 10'!AF19","v":0},{"$f":"'شهر 10'!AG19","v":0},{"$f":"'شهر 10'!AH19","v":0}]
[null,null,null,null,null,null,{"$f":"'شهر 10'!D20","v":0},{"$f":"'شهر 10'!E20","v":0},{"$f":"'شهر 10'!F20","v":0},{"$f":"'شهر 10'!G20","v":0},{"$f":"'شهر 10'!H20","v":0},{"$f":"'شهر 10'!I20","v":0},{"$f":"'شهر 10'!J20","v":0},{"$f":"'شهر 10'!K20","v":0},{"$f":"'شهر 10'!L20","v":0},{"$f":"'شهر 10'!M20","v":0},{"$f":"'شهر 10'!N20","v":0},{"$f":"'شهر 10'!O20","v":0},{"$f":"'شهر 10'!P20","v":0},{"$f":"'شهر 10'!Q20","v":0},{"$f":"'شهر 10'!R20","v":0},{"$f":"'شهر 10'!S20","v":0},{"$f":"'شهر 10'!T20","v":0},{"$f":"'شهر 10'!U20","v":0},{"$f":"'شهر 10'!V20","v":0},{"$f":"'شهر 10'!W20","v":0},{"$f":"'شهر 10'!X20","v":0},{"$f":"'شهر 10'!Y20","v":0},{"$f":"'شهر 10'!Z20","v":0},{"$f":"'شهر 10'!AA20","v":0},{"$f":"'شهر 10'!AB20","v":0},{"$f":"'شهر 10'!AC20","v":0},{"$f":"'شهر 10'!AD20","v":0},{"$f":"'شهر 10'!AE20","v":0},{"$f":"'شهر 10'!AF20","v":0},{"$f":"'شهر 10'!AG20","v":0},{"$f":"'شهر 10'!AH20","v":0}]
[10,"رضا رمضان الرشيدي",{"$f":"'شهر 10'!AI21","v":0},{"$f":"'شهر 10'!AJ21","v":0},{"$f":"'شهر 10'!AK21","v":0},null,{"$f":"'شهر 10'!D21","v":0},{"$f":"'شهر 10'!E21","v":0},{"$f":"'شهر 10'!F21","v":0},{"$f":"'شهر 10'!G21","v":0},{"$f":"'شهر 10'!H21","v":0},{"$f":"'شهر 10'!I21","v":0},{"$f":"'شهر 10'!J21","v":0},{"$f":"'شهر 10'!K21","v":0},{"$f":"'شهر 10'!L21","v":0},{"$f":"'شهر 10'!M21","v":0},{"$f":"'شهر 10'!N21","v":0},{"$f":"'شهر 10'!O21","v":0},{"$f":"'شهر 10'!P21","v":0},{"$f":"'شهر 10'!Q21","v":0},{"$f":"'شهر 10'!R21","v":0},{"$f":"'شهر 10'!S21","v":0},{"$f":"'شهر 10'!T21","v":0},{"$f":"'شهر 10'!U21","v":0},{"$f":"'شهر 10'!V21","v":0},{"$f":"'شهر 10'!W21","v":0},{"$f":"'شهر 10'!X21","v":0},{"$f":"'شهر 10'!Y21","v":0},{"$f":"'شهر 10'!Z21","v":0},{"$f":"'شهر 10'!AA21","v":0},{"$f":"'شهر 10'!AB21","v":0},{"$f":"'شهر 10'!AC21","v":0},{"$f":"'شهر 10'!AD21","v":0},{"$f":"'شهر 10'!AE21","v":0},{"$f":"'شهر 10'!AF21","v":0},{"$f":"'شهر 10'!AG21","v":0},{"$f":"'شهر 10'!AH21","v":0}]
[null,null,null,null,null,null,{"$f":"'شهر 10'!D22","v":0},{"$f":"'شهر 10'!E22","v":0},{"$f":"'شهر 10'!F22","v":0},{"$f":"'شهر 10'!G22","v":0},{"$f":"'شهر 10'!H22","v":0},{"$f":"'شهر 10'!I22","v":0},{"$f":"'شهر 10'!J22","v":0},{"$f":"'شهر 10'!K22","v":0},{"$f":"'شهر 10'!L22","v":0},{"$f":"'شهر 10'!M22","v":0},{"$f":"'شهر 10'!N22","v":0},{"$f":"'شهر 10'!O22","v":0},{"$f":"'شهر 10'!P22","v":0},{"$f":"'شهر 10'!Q22","v":0},{"$f":"'شهر 10'!R22","v":0},{"$f":"'شهر 10'!S22","v":0},{"$f":"'شهر 10'!T22","v":0},{"$f":"'شهر 10'!U22","v":0},{"$f":"'شهر 10'!V22","v":0},{"$f":"'شهر 10'!W22","v":0},{"$f":"'شهر 10'!X22","v":0},{"$f":"'شهر 10'!Y22","v":0},{"$f":"'شهر 10'!Z22","v":0},{"$f":"'شهر 10'!AA22","v":0},{"$f":"'شهر 10'!AB22","v":0},{"$f":"'شهر 10'!AC22","v":0},{"$f":"'شهر 10'!AD22","v":0},{"$f":"'شهر 10'!AE22","v":0},{"$f":"'شهر 10'!AF22","v":0},{"$f":"'شهر 10'!AG22","v":0},{"$f":"'شهر 10'!AH22","v":0}]
[11,"السيد الدمرداش",{"$f":"'شهر 10'!AI23","v":0},{"$f":"'شهر 10'!AJ23","v":0},{"$f":"'شهر 10'!AK23","v":0},null,{"$f":"'شهر 10'!D23","v":0},{"$f":"'شهر 10'!E23","v":0},{"$f":"'شهر 10'!F23","v":0},{"$f":"'شهر 10'!G23","v":0},{"$f":"'شهر 10'!H23","v":0},{"$f":"'شهر 10'!I23","v":0},{"$f":"'شهر 10'!J23","v":0},{"$f":"'شهر 10'!K23","v":0},{"$f":"'شهر 10'!L23","v":0},{"$f":"'شهر 10'!M23","v":0},{"$f":"'شهر 10'!N23","v":0},{"$f":"'شهر 10'!O23","v":0},{"$f":"'شهر 10'!P23","v":0},{"$f":"'شهر 10'!Q23","v":0},{"$f":"'شهر 10'!R23","v":0},{"$f":"'شهر 10'!S23","v":0},{"$f":"'شهر 10'!T23","v":0},{"$f":"'شهر 10'!U23","v":0},{"$f":"'شهر 10'!V23","v":0},{"$f":"'شهر 10'!W23","v":0},{"$f":"'شهر 10'!X23","v":0},{"$f":"'شهر 10'!Y23","v":0},{"$f":"'شهر 10'!Z23","v":0},{"$f":"'شهر 10'!AA23","v":0},{"$f":"'شهر 10'!AB23","v":0},{"$f":"'شهر 10'!AC23","v":0},{"$f":"'شهر 10'!AD23","v":0},{"$f":"'شهر 10'!AE23","v":0},{"$f":"'شهر 10'!AF23","v":0},{"$f":"'شهر 10'!AG23","v":0},{"$f":"'شهر 10'!AH23","v":0}]
[null,null,null,null,null,null,{"$f":"'شهر 10'!D24","v":0},{"$f":"'شهر 10'!E24","v":0},{"$f":"'شهر 10'!F24","v":0},{"$f":"'شهر 10'!G24","v":0},{"$f":"'شهر 10'!H24","v":0},{"$f":"'شهر 10'!I24","v":0},{"$f":"'شهر 10'!J24","v":0},{"$f":"'شهر 10'!K24","v":0},{"$f":"'شهر 10'!L24","v":0},{"$f":"'شهر 10'!M24","v":0},{"$f":"'شهر 10'!N24","v":0},{"$f":"'شهر 10'!O24","v":0},{"$f":"'شهر 10'!P24","v":0},{"$f":"'شهر 10'!Q24","v":0},{"$f":"'شهر 10'!R24","v":0},{"$f":"'شهر 10'!S24","v":0},{"$f":"'شهر 10'!T24","v":0},{"$f":"'شهر 10'!U24","v":0},{"$f":"'شهر 10'!V24","v":0},{"$f":"'شهر 10'!W24","v":0},{"$f":"'شهر 10'!X24","v":0},{"$f":"'شهر 10'!Y24","v":0},{"$f":"'شهر 10'!Z24","v":0},{"$f":"'شهر 10'!AA24","v":0},{"$f":"'شهر 10'!AB24","v":0},{"$f":"'شهر 10'!AC24","v":0},{"$f":"'شهر 10'!AD24","v":0},{"$f":"'شهر 10'!AE24","v":0},{"$f":"'شهر 10'!AF24","v":0},{"$f":"'شهر 10'!AG24","v":0},{"$f":"'شهر 10'!AH24","v":0}]
[12,"على صبح عطية",{"$f":"'شهر 10'!AI25","v":0},{"$f":"'شهر 10'!AJ25","v":0},{"$f":"'شهر 10'!AK25","v":0},null,{"$f":"'شهر 10'!D25","v":0},{"$f":"'شهر 10'!E25","v":0},{"$f":"'شهر 10'!F25","v":0},{"$f":"'شهر 10'!G25","v":0},{"$f":"'شهر 10'!H25","v":0},{"$f":"'شهر 10'!I25","v":0},{"$f":"'شهر 10'!J25","v":0},{"$f":"'شهر 10'!K25","v":0},{"$f":"'شهر 10'!L25","v":0},{"$f":"'شهر 10'!M25","v":0},{"$f":"'شهر 10'!N25","v":0},{"$f":"'شهر 10'!O25","v":0},{"$f":"'شهر 10'!P25","v":0},{"$f":"'شهر 10'!Q25","v":0},{"$f":"'شهر 10'!R25","v":0},{"$f":"'شهر 10'!S25","v":0},{"$f":"'شهر 10'!T25","v":0},{"$f":"'شهر 10'!U25","v":0},{"$f":"'شهر 10'!V25","v":0},{"$f":"'شهر 10'!W25","v":0},{"$f":"'شهر 10'!X25","v":0},{"$f":"'شهر 10'!Y25","v":0},{"$f":"'شهر 10'!Z25","v":0},{"$f":"'شهر 10'!AA25","v":0},{"$f":"'شهر 10'!AB25","v":0},{"$f":"'شهر 10'!AC25","v":0},{"$f":"'شهر 10'!AD25","v":0},{"$f":"'شهر 10'!AE25","v":0},{"$f":"'شهر 10'!AF25","v":0},{"$f":"'شهر 10'!AG25","v":0},{"$f":"'شهر 10'!AH25","v":0}]
[null,null,null,null,null,null,{"$f":"'شهر 10'!D26","v":0},{"$f":"'شهر 10'!E26","v":0},{"$f":"'شهر 10'!F26","v":0},{"$f":"'شهر 10'!G26","v":0},{"$f":"'شهر 10'!H26","v":0},{"$f":"'شهر 10'!I26","v":0},{"$f":"'شهر 10'!J26","v":0},{"$f":"'شهر 10'!K26","v":0},{"$f":"'شهر 10'!L26","v":0},{"$f":"'شهر 10'!M26","v":0},{"$f":"'شهر 10'!N26","v":0},{"$f":"'شهر 10'!O26","v":0},{"$f":"'شهر 10'!P26","v":0},{"$f":"'شهر 10'!Q26","v":0},{"$f":"'شهر 10'!R26","v":0},{"$f":"'شهر 10'!S26","v":0},{"$f":"'شهر 10'!T26","v":0},{"$f":"'شهر 10'!U26","v":0},{"$f":"'شهر 10'!V26","v":0},{"$f":"'شهر 10'!W26","v":0},{"$f":"'شهر 10'!X26","v":0},{"$f":"'شهر 10'!Y26","v":0},{"$f":"'شهر 10'!Z26","v":0},{"$f":"'شهر 10'!AA26","v":0},{"$f":"'شهر 10'!AB26","v":0},{"$f":"'شهر 10'!AC26","v":0},{"$f":"'شهر 10'!AD26","v":0},{"$f":"'شهر 10'!AE26","v":0},{"$f":"'شهر 10'!AF26","v":0},{"$f":"'شهر 10'!AG26","v":0},{"$f":"'شهر 10'!AH26","v":0}]
[13,"سعد الدين عماد",{"$f":"'شهر 10'!AI27","v":0},{"$f":"'شهر 10'!AJ27","v":0},{"$f":"'شهر 10'!AK27","v":0},null,{"$f":"'شهر 10'!D27","v":0},{"$f":"'شهر 10'!E27","v":0},{"$f":"'شهر 10'!F27","v":0},{"$f":"'شهر 10'!G27","v":0},{"$f":"'شهر 10'!H27","v":0},{"$f":"'شهر 10'!I27","v":0},{"$f":"'شهر 10'!J27","v":0},{"$f":"'شهر 10'!K27","v":0},{"$f":"'شهر 10'!L27","v":0},{"$f":"'شهر 10'!M27","v":0},{"$f":"'شهر 10'!N27","v":0},{"$f":"'شهر 10'!O27","v":0},{"$f":"'شهر 10'!P27","v":0},{"$f":"'شهر 10'!Q27","v":0},{"$f":"'شهر 10'!R27","v":0},{"$f":"'شهر 10'!S27","v":0},{"$f":"'شهر 10'!T27","v":0},{"$f":"'شهر 10'!U27","v":0},{"$f":"'شهر 10'!V27","v":0},{"$f":"'شهر 10'!W27","v":0},{"$f":"'شهر 10'!X27","v":0},{"$f":"'شهر 10'!Y27","v":0},{"$f":"'شهر 10'!Z27","v":0},{"$f":"'شهر 10'!AA27","v":0},{"$f":"'شهر 10'!AB27","v":0},{"$f":"'شهر 10'!AC27","v":0},{"$f":"'شهر 10'!AD27","v":0},{"$f":"'شهر 10'!AE27","v":0},{"$f":"'شهر 10'!AF27","v":0},{"$f":"'شهر 10'!AG27","v":0},{"$f":"'شهر 10'!AH27","v":0}]
[null,null,null,null,null,null,{"$f":"'شهر 10'!D28","v":0},{"$f":"'شهر 10'!E28","v":0},{"$f":"'شهر 10'!F28","v":0},{"$f":"'شهر 10'!G28","v":0},{"$f":"'شهر 10'!H28","v":0},{"$f":"'شهر 10'!I28","v":0},{"$f":"'شهر 10'!J28","v":0},{"$f":"'شهر 10'!K28","v":0},{"$f":"'شهر 10'!L28","v":0},{"$f":"'شهر 10'!M28","v":0},{"$f":"'شهر 10'!N28","v":0},{"$f":"'شهر 10'!O28","v":0},{"$f":"'شهر 10'!P28","v":0},{"$f":"'شهر 10'!Q28","v":0},{"$f":"'شهر 10'!R28","v":0},{"$f":"'شهر 10'!S28","v":0},{"$f":"'شهر 10'!T28","v":0},{"$f":"'شهر 10'!U28","v":0},{"$f":"'شهر 10'!V28","v":0},{"$f":"'شهر 10'!W28","v":0},{"$f":"'شهر 10'!X28","v":0},{"$f":"'شهر 10'!Y28","v":0},{"$f":"'شهر 10'!Z28","v":0},{"$f":"'شهر 10'!AA28","v":0},{"$f":"'شهر 10'!AB28","v":0},{"$f":"'شهر 10'!AC28","v":0},{"$f":"'شهر 10'!AD28","v":0},{"$f":"'شهر 10'!AE28","v":0},{"$f":"'شهر 10'!AF28","v":0},{"$f":"'شهر 10'!AG28","v":0},{"$f":"'شهر 10'!AH28","v":0}]
[14,"صلاح محمد",{"$f":"'شهر 10'!AI29","v":0},{"$f":"'شهر 10'!AJ29","v":0},{"$f":"'شهر 10'!AK29","v":0},null,{"$f":"'شهر 10'!D29","v":0},{"$f":"'شهر 10'!E29","v":0},{"$f":"'شهر 10'!F29","v":0},{"$f":"'شهر 10'!G29","v":0},{"$f":"'شهر 10'!H29","v":0},{"$f":"'شهر 10'!I29","v":0},{"$f":"'شهر 10'!J29","v":0},{"$f":"'شهر 10'!K29","v":0},{"$f":"'شهر 10'!L29","v":0},{"$f":"'شهر 10'!M29","v":0},{"$f":"'شهر 10'!N29","v":0},{"$f":"'شهر 10'!O29","v":0},{"$f":"'شهر 10'!P29","v":0},{"$f":"'شهر 10'!Q29","v":0},{"$f":"'شهر 10'!R29","v":0},{"$f":"'شهر 10'!S29","v":0},{"$f":"'شهر 10'!T29","v":0},{"$f":"'شهر 10'!U29","v":0},{"$f":"'شهر 10'!V29","v":0},{"$f":"'شهر 10'!W29","v":0},{"$f":"'شهر 10'!X29","v":0},{"$f":"'شهر 10'!Y29","v":0},{"$f":"'شهر 10'!Z29","v":0},{"$f":"'شهر 10'!AA29","v":0},{"$f":"'شهر 10'!AB29","v":0},{"$f":"'شهر 10'!AC29","v":0},{"$f":"'شهر 10'!AD29","v":0},{"$f":"'شهر 10'!AE29","v":0},{"$f":"'شهر 10'!AF29","v":0},{"$f":"'شهر 10'!AG29","v":0},{"$f":"'شهر 10'!AH29","v":0}]
[null,null,null,null,null,null,{"$f":"'شهر 10'!D30","v":0},{"$f":"'شهر 10'!E30","v":0},{"$f":"'شهر 10'!F30","v":0},{"$f":"'شهر 10'!G30","v":0},{"$f":"'شهر 10'!H30","v":0},{"$f":"'شهر 10'!I30","v":0},{"$f":"'شهر 10'!J30","v":0},{"$f":"'شهر 10'!K30","v":0},{"$f":"'شهر 10'!L30","v":0},{"$f":"'شهر 10'!M30","v":0},{"$f":"'شهر 10'!N30","v":0},{"$f":"'شهر 10'!O30","v":0},{"$f":"'شهر 10'!P30","v":0},{"$f":"'شهر 10'!Q30","v":0},{"$f":"'شهر 10'!R30","v":0},{"$f":"'شهر 10'!S30","v":0},{"$f":"'شهر 10'!T30","v":0},{"$f":"'شهر 10'!U30","v":0},{"$f":"'شهر 10'!V30","v":0},{"$f":"'شهر 10'!W30","v":0},{"$f":"'شهر 10'!X30","v":0},{"$f":"'شهر 10'!Y30","v":0},{"$f":"'شهر 10'!Z30","v":0},{"$f":"'شهر 10'!AA30","v":0},{"$f":"'شهر 10'!AB30","v":0},{"$f":"'شهر 10'!AC30","v":0},{"$f":"'شهر 10'!AD30","v":0},{"$f":"'شهر 10'!AE30","v":0},{"$f":"'شهر 10'!AF30","v":0},{"$f":"'شهر 10'!AG30","v":0},{"$f":"'شهر 10'!AH30","v":0}]
[15,"يوسف منصور",{"$f":"'شهر 10'!AI31","v":0},{"$f":"'شهر 10'!AJ31","v":0},{"$f":"'شهر 10'!AK31","v":0},null,{"$f":"'شهر 10'!D31","v":0},{"$f":"'شهر 10'!E31","v":0},{"$f":"'شهر 10'!F31","v":0},{"$f":"'شهر 10'!G31","v":0},{"$f":"'شهر 10'!H31","v":0},{"$f":"'شهر 10'!I31","v":0},{"$f":"'شهر 10'!J31","v":0},{"$f":"'شهر 10'!K31","v":0},{"$f":"'شهر 10'!L31","v":0},{"$f":"'شهر 10'!M31","v":0},{"$f":"'شهر 10'!N31","v":0},{"$f":"'شهر 10'!O31","v":0},{"$f":"'شهر 10'!P31","v":0},{"$f":"'شهر 10'!Q31","v":0},{"$f":"'شهر 10'!R31","v":0},{"$f":"'شهر 10'!S31","v":0},{"$f":"'شهر 10'!T31","v":0},{"$f":"'شهر 10'!U31","v":0},{"$f":"'شهر 10'!V31","v":0},{"$f":"'شهر 10'!W31","v":0},{"$f":"'شهر 10'!X31","v":0},{"$f":"'شهر 10'!Y31","v":0},{"$f":"'شهر 10'!Z31","v":0},{"$f":"'شهر 10'!AA31","v":0},{"$f":"'شهر 10'!AB31","v":0},{"$f":"'شهر 10'!AC31","v":0},{"$f":"'شهر 10'!AD31","v":0},{"$f":"'شهر 10'!AE31","v":0},{"$f":"'شهر 10'!AF31","v":0},{"$f":"'شهر 10'!AG31","v":0},{"$f":"'شهر 10'!AH31","v":0}]
[null,null,null,null,null,null,{"$f":"'شهر 10'!D32","v":0},{"$f":"'شهر 10'!E32","v":0},{"$f":"'شهر 10'!F32","v":0},{"$f":"'شهر 10'!G32","v":0},{"$f":"'شهر 10'!H32","v":0},{"$f":"'شهر 10'!I32","v":0},{"$f":"'شهر 10'!J32","v":0},{"$f":"'شهر 10'!K32","v":0},{"$f":"'شهر 10'!L32","v":0},{"$f":"'شهر 10'!M32","v":0},{"$f":"'شهر 10'!N32","v":0},{"$f":"'شهر 10'!O32","v":0},{"$f":"'شهر 10'!P32","v":0},{"$f":"'شهر 10'!Q32","v":0},{"$f":"'شهر 10'!R32","v":0},{"$f":"'شهر 10'!S32","v":0},{"$f":"'شهر 10'!T32","v":0},{"$f":"'شهر 10'!U32","v":0},{"$f":"'شهر 10'!V32","v":0},{"$f":"'شهر 10'!W32","v":0},{"$f":"'شهر 10'!X32","v":0},{"$f":"'شهر 10'!Y32","v":0},{"$f":"'شهر 10'!Z32","v":0},{"$f":"'شهر 10'!AA32","v":0},{"$f":"'شهر 10'!AB32","v":0},{"$f":"'شهر 10'!AC32","v":0},{"$f":"'شهر 10'!AD32","v":0},{"$f":"'شهر 10'!AE32","v":0},{"$f":"'شهر 10'!AF32","v":0},{"$f":"'شهر 10'!AG32","v":0},{"$f":"'شهر 10'!AH32","v":0}]
[16,"ابراهيم نصحي",{"$f":"'شهر 10'!AI33","v":0},{"$f":"'شهر 10'!AJ33","v":0},{"$f":"'شهر 10'!AK33","v":0},null,{"$f":"'شهر 10'!D33","v":0},{"$f":"'شهر 10'!E33","v":0},{"$f":"'شهر 10'!F33","v":0},{"$f":"'شهر 10'!G33","v":0},{"$f":"'شهر 10'!H33","v":0},{"$f":"'شهر 10'!I33","v":0},{"$f":"'شهر 10'!J33","v":0},{"$f":"'شهر 10'!K33","v":0},{"$f":"'شهر 10'!L33","v":0},{"$f":"'شهر 10'!M33","v":0},{"$f":"'شهر 10'!N33","v":0},{"$f":"'شهر 10'!O33","v":0},{"$f":"'شهر 10'!P33","v":0},{"$f":"'شهر 10'!Q33","v":0},{"$f":"'شهر 10'!R33","v":0},{"$f":"'شهر 10'!S33","v":0},{"$f":"'شهر 10'!T33","v":0},{"$f":"'شهر 10'!U33","v":0},{"$f":"'شهر 10'!V33","v":0},{"$f":"'شهر 10'!W33","v":0},{"$f":"'شهر 10'!X33","v":0},{"$f":"'شهر 10'!Y33","v":0},{"$f":"'شهر 10'!Z33","v":0},{"$f":"'شهر 10'!AA33","v":0},{"$f":"'شهر 10'!AB33","v":0},{"$f":"'شهر 10'!AC33","v":0},{"$f":"'شهر 10'!AD33","v":0},{"$f":"'شهر 10'!AE33","v":0},{"$f":"'شهر 10'!AF33","v":0},{"$f":"'شهر 10'!AG33","v":0},{"$f":"'شهر 10'!AH33","v":0}]
[null,null,null,null,null,null,{"$f":"'شهر 10'!D34","v":0},{"$f":"'شهر 10'!E34","v":0},{"$f":"'شهر 10'!F34","v":0},{"$f":"'شهر 10'!G34","v":0},{"$f":"'شهر 10'!H34","v":0},{"$f":"'شهر 10'!I34","v":0},{"$f":"'شهر 10'!J34","v":0},{"$f":"'شهر 10'!K34","v":0},{"$f":"'شهر 10'!L34","v":0},{"$f":"'شهر 10'!M34","v":0},{"$f":"'شهر 10'!N34","v":0},{"$f":"'شهر 10'!O34","v":0},{"$f":"'شهر 10'!P34","v":0},{"$f":"'شهر 10'!Q34","v":0},{"$f":"'شهر 10'!R34","v":0},{"$f":"'شهر 10'!S34","v":0},{"$f":"'شهر 10'!T34","v":0},{"$f":"'شهر 10'!U34","v":0},{"$f":"'شهر 10'!V34","v":0},{"$f":"'شهر 10'!W34","v":0},{"$f":"'شهر 10'!X34","v":0},{"$f":"'شهر 10'!Y34","v":0},{"$f":"'شهر 10'!Z34","v":0},{"$f":"'شهر 10'!AA34","v":0},{"$f":"'شهر 10'!AB34","v":0},{"$f":"'شهر 10'!AC34","v":0},{"$f":"'شهر 10'!AD34","v":0},{"$f":"'شهر 10'!AE34","v":0},{"$f":"'شهر 10'!AF34","v":0},{"$f":"'شهر 10'!AG34","v":0},{"$f":"'شهر 10'!AH34","v":0}]
[17,"احمد علام",{"$f":"'شهر 10'!AI35","v":0},{"$f":"'شهر 10'!AJ35","v":0},{"$f":"'شهر 10'!AK35","v":0},null,{"$f":"'شهر 10'!D35","v":0},{"$f":"'شهر 10'!E35","v":0},{"$f":"'شهر 10'!F35","v":0},{"$f":"'شهر 10'!G35","v":0},{"$f":"'شهر 10'!H35","v":0},{"$f":"'شهر 10'!I35","v":0},{"$f":"'شهر 10'!J35","v":0},{"$f":"'شهر 10'!K35","v":0},{"$f":"'شهر 10'!L35","v":0},{"$f":"'شهر 10'!M35","v":0},{"$f":"'شهر 10'!N35","v":0},{"$f":"'شهر 10'!O35","v":0},{"$f":"'شهر 10'!P35","v":0},{"$f":"'شهر 10'!Q35","v":0},{"$f":"'شهر 10'!R35","v":0},{"$f":"'شهر 10'!S35","v":0},{"$f":"'شهر 10'!T35","v":0},{"$f":"'شهر 10'!U35","v":0},{"$f":"'شهر 10'!V35","v":0},{"$f":"'شهر 10'!W35","v":0},{"$f":"'شهر 10'!X35","v":0},{"$f":"'شهر 10'!Y35","v":0},{"$f":"'شهر 10'!Z35","v":0},{"$f":"'شهر 10'!AA35","v":0},{"$f":"'شهر 10'!AB35","v":0},{"$f":"'شهر 10'!AC35","v":0},{"$f":"'شهر 10'!AD35","v":0},{"$f":"'شهر 10'!AE35","v":0},{"$f":"'شهر 10'!AF35","v":0},{"$f":"'شهر 10'!AG35","v":0},{"$f":"'شهر 10'!AH35","v":0}]
[null,null,null,null,null,null,{"$f":"'شهر 10'!D36","v":0},{"$f":"'شهر 10'!E36","v":0},{"$f":"'شهر 10'!F36","v":0},{"$f":"'شهر 10'!G36","v":0},{"$f":"'شهر 10'!H36","v":0},{"$f":"'شهر 10'!I36","v":0},{"$f":"'شهر 10'!J36","v":0},{"$f":"'شهر 10'!K36","v":0},{"$f":"'شهر 10'!L36","v":0},{"$f":"'شهر 10'!M36","v":0},{"$f":"'شهر 10'!N36","v":0},{"$f":"'شهر 10'!O36","v":0},{"$f":"'شهر 10'!P36","v":0},{"$f":"'شهر 10'!Q36","v":0},{"$f":"'شهر 10'!R36","v":0},{"$f":"'شهر 10'!S36","v":0},{"$f":"'شهر 10'!T36","v":0},{"$f":"'شهر 10'!U36","v":0},{"$f":"'شهر 10'!V36","v":0},{"$f":"'شهر 10'!W36","v":0},{"$f":"'شهر 10'!X36","v":0},{"$f":"'شهر 10'!Y36","v":0},{"$f":"'شهر 10'!Z36","v":0},{"$f":"'شهر 10'!AA36","v":0},{"$f":"'شهر 10'!AB36","v":0},{"$f":"'شهر 10'!AC36","v":0},{"$f":"'شهر 10'!AD36","v":0},{"$f":"'شهر 10'!AE36","v":0},{"$f":"'شهر 10'!AF36","v":0},{"$f":"'شهر 10'!AG36","v":0},{"$f":"'شهر 10'!AH36","v":0}]
[18,"عبد العزيز عبد الشافى",{"$f":"'شهر 10'!AI37","v":0},{"$f":"'شهر 10'!AJ37","v":0},{"$f":"'شهر 10'!AK37","v":0},null,{"$f":"'شهر 10'!D37","v":0},{"$f":"'شهر 10'!E37","v":0},{"$f":"'شهر 10'!F37","v":0},{"$f":"'شهر 10'!G37","v":0},{"$f":"'شهر 10'!H37","v":0},{"$f":"'شهر 10'!I37","v":0},{"$f":"'شهر 10'!J37","v":0},{"$f":"'شهر 10'!K37","v":0},{"$f":"'شهر 10'!L37","v":0},{"$f":"'شهر 10'!M37","v":0},{"$f":"'شهر 10'!N37","v":0},{"$f":"'شهر 10'!O37","v":0},{"$f":"'شهر 10'!P37","v":0},{"$f":"'شهر 10'!Q37","v":0},{"$f":"'شهر 10'!R37","v":0},{"$f":"'شهر 10'!S37","v":0},{"$f":"'شهر 10'!T37","v":0},{"$f":"'شهر 10'!U37","v":0},{"$f":"'شهر 10'!V37","v":0},{"$f":"'شهر 10'!W37","v":0},{"$f":"'شهر 10'!X37","v":0},{"$f":"'شهر 10'!Y37","v":0},{"$f":"'شهر 10'!Z37","v":0},{"$f":"'شهر 10'!AA37","v":0},{"$f":"'شهر 10'!AB37","v":0},{"$f":"'شهر 10'!AC37","v":0},{"$f":"'شهر 10'!AD37","v":0},{"$f":"'شهر 10'!AE37","v":0},{"$f":"'شهر 10'!AF37","v":0},{"$f":"'شهر 10'!AG37","v":0},{"$f":"'شهر 10'!AH37","v":0}]
[null,null,null,null,null,null,{"$f":"'شهر 10'!D38","v":0},{"$f":"'شهر 10'!E38","v":0},{"$f":"'شهر 10'!F38","v":0},{"$f":"'شهر 10'!G38","v":0},{"$f":"'شهر 10'!H38","v":0},{"$f":"'شهر 10'!I38","v":0},{"$f":"'شهر 10'!J38","v":0},{"$f":"'شهر 10'!K38","v":0},{"$f":"'شهر 10'!L38","v":0},{"$f":"'شهر 10'!M38","v":0},{"$f":"'شهر 10'!N38","v":0},{"$f":"'شهر 10'!O38","v":0},{"$f":"'شهر 10'!P38","v":0},{"$f":"'شهر 10'!Q38","v":0},{"$f":"'شهر 10'!R38","v":0},{"$f":"'شهر 10'!S38","v":0},{"$f":"'شهر 10'!T38","v":0},{"$f":"'شهر 10'!U38","v":0},{"$f":"'شهر 10'!V38","v":0},{"$f":"'شهر 10'!W38","v":0},{"$f":"'شهر 10'!X38","v":0},{"$f":"'شهر 10'!Y38","v":0},{"$f":"'شهر 10'!Z38","v":0},{"$f":"'شهر 10'!AA38","v":0},{"$f":"'شهر 10'!AB38","v":0},{"$f":"'شهر 10'!AC38","v":0},{"$f":"'شهر 10'!AD38","v":0},{"$f":"'شهر 10'!AE38","v":0},{"$f":"'شهر 10'!AF38","v":0},{"$f":"'شهر 10'!AG38","v":0},{"$f":"'شهر 10'!AH38","v":0}]
[19,"باسم ابو بكر",{"$f":"'شهر 10'!AI39","v":0},{"$f":"'شهر 10'!AJ39","v":0},{"$f":"'شهر 10'!AK39","v":0},null,{"$f":"'شهر 10'!D39","v":0},{"$f":"'شهر 10'!E39","v":0},{"$f":"'شهر 10'!F39","v":0},{"$f":"'شهر 10'!G39","v":0},{"$f":"'شهر 10'!H39","v":0},{"$f":"'شهر 10'!I39","v":0},{"$f":"'شهر 10'!J39","v":0},{"$f":"'شهر 10'!K39","v":0},{"$f":"'شهر 10'!L39","v":0},{"$f":"'شهر 10'!M39","v":0},{"$f":"'شهر 10'!N39","v":0},{"$f":"'شهر 10'!O39","v":0},{"$f":"'شهر 10'!P39","v":0},{"$f":"'شهر 10'!Q39","v":0},{"$f":"'شهر 10'!R39","v":0},{"$f":"'شهر 10'!S39","v":0},{"$f":"'شهر 10'!T39","v":0},{"$f":"'شهر 10'!U39","v":0},{"$f":"'شهر 10'!V39","v":0},{"$f":"'شهر 10'!W39","v":0},{"$f":"'شهر 10'!X39","v":0},{"$f":"'شهر 10'!Y39","v":0},{"$f":"'شهر 10'!Z39","v":0},{"$f":"'شهر 10'!AA39","v":0},{"$f":"'شهر 10'!AB39","v":0},{"$f":"'شهر 10'!AC39","v":0},{"$f":"'شهر 10'!AD39","v":0},{"$f":"'شهر 10'!AE39","v":0},{"$f":"'شهر 10'!AF39","v":0},{"$f":"'شهر 10'!AG39","v":0},{"$f":"'شهر 10'!AH39","v":0}]
[null,null,null,null,null,null,{"$f":"'شهر 10'!D40","v":0},{"$f":"'شهر 10'!E40","v":0},{"$f":"'شهر 10'!F40","v":0},{"$f":"'شهر 10'!G40","v":0},{"$f":"'شهر 10'!H40","v":0},{"$f":"'شهر 10'!I40","v":0},{"$f":"'شهر 10'!J40","v":0},{"$f":"'شهر 10'!K40","v":0},{"$f":"'شهر 10'!L40","v":0},{"$f":"'شهر 10'!M40","v":0},{"$f":"'شهر 10'!N40","v":0},{"$f":"'شهر 10'!O40","v":0},{"$f":"'شهر 10'!P40","v":0},{"$f":"'شهر 10'!Q40","v":0},{"$f":"'شهر 10'!R40","v":0},{"$f":"'شهر 10'!S40","v":0},{"$f":"'شهر 10'!T40","v":0},{"$f":"'شهر 10'!U40","v":0},{"$f":"'شهر 10'!V40","v":0},{"$f":"'شهر 10'!W40","v":0},{"$f":"'شهر 10'!X40","v":0},{"$f":"'شهر 10'!Y40","v":0},{"$f":"'شهر 10'!Z40","v":0},{"$f":"'شهر 10'!AA40","v":0},{"$f":"'شهر 10'!AB40","v":0},{"$f":"'شهر 10'!AC40","v":0},{"$f":"'شهر 10'!AD40","v":0},{"$f":"'شهر 10'!AE40","v":0},{"$f":"'شهر 10'!AF40","v":0},{"$f":"'شهر 10'!AG40","v":0},{"$f":"'شهر 10'!AH40","v":0}]
[20,"احمد محمد الدمرداش",{"$f":"'شهر 10'!AI41","v":0},{"$f":"'شهر 10'!AJ41","v":0},{"$f":"'شهر 10'!AK41","v":0},null,{"$f":"'شهر 10'!D41","v":0},{"$f":"'شهر 10'!E41","v":0},{"$f":"'شهر 10'!F41","v":0},{"$f":"'شهر 10'!G41","v":0},{"$f":"'شهر 10'!H41","v":0},{"$f":"'شهر 10'!I41","v":0},{"$f":"'شهر 10'!J41","v":0},{"$f":"'شهر 10'!K41","v":0},{"$f":"'شهر 10'!L41","v":0},{"$f":"'شهر 10'!M41","v":0},{"$f":"'شهر 10'!N41","v":0},{"$f":"'شهر 10'!O41","v":0},{"$f":"'شهر 10'!P41","v":0},{"$f":"'شهر 10'!Q41","v":0},{"$f":"'شهر 10'!R41","v":0},{"$f":"'شهر 10'!S41","v":0},{"$f":"'شهر 10'!T41","v":0},{"$f":"'شهر 10'!U41","v":0},{"$f":"'شهر 10'!V41","v":0},{"$f":"'شهر 10'!W41","v":0},{"$f":"'شهر 10'!X41","v":0},{"$f":"'شهر 10'!Y41","v":0},{"$f":"'شهر 10'!Z41","v":0},{"$f":"'شهر 10'!AA41","v":0},{"$f":"'شهر 10'!AB41","v":0},{"$f":"'شهر 10'!AC41","v":0},{"$f":"'شهر 10'!AD41","v":0},{"$f":"'شهر 10'!AE41","v":0},{"$f":"'شهر 10'!AF41","v":0},{"$f":"'شهر 10'!AG41","v":0},{"$f":"'شهر 10'!AH41","v":0}]
[null,null,null,null,null,null,{"$f":"'شهر 10'!D42","v":0},{"$f":"'شهر 10'!E42","v":0},{"$f":"'شهر 10'!F42","v":0},{"$f":"'شهر 10'!G42","v":0},{"$f":"'شهر 10'!H42","v":0},{"$f":"'شهر 10'!I42","v":0},{"$f":"'شهر 10'!J42","v":0},{"$f":"'شهر 10'!K42","v":0},{"$f":"'شهر 10'!L42","v":0},{"$f":"'شهر 10'!M42","v":0},{"$f":"'شهر 10'!N42","v":0},{"$f":"'شهر 10'!O42","v":0},{"$f":"'شهر 10'!P42","v":0},{"$f":"'شهر 10'!Q42","v":0},{"$f":"'شهر 10'!R42","v":0},{"$f":"'شهر 10'!S42","v":0},{"$f":"'شهر 10'!T42","v":0},{"$f":"'شهر 10'!U42","v":0},{"$f":"'شهر 10'!V42","v":0},{"$f":"'شهر 10'!W42","v":0},{"$f":"'شهر 10'!X42","v":0},{"$f":"'شهر 10'!Y42","v":0},{"$f":"'شهر 10'!Z42","v":0},{"$f":"'شهر 10'!AA42","v":0},{"$f":"'شهر 10'!AB42","v":0},{"$f":"'شهر 10'!AC42","v":0},{"$f":"'شهر 10'!AD42","v":0},{"$f":"'شهر 10'!AE42","v":0},{"$f":"'شهر 10'!AF42","v":0},{"$f":"'شهر 10'!AG42","v":0},{"$f":"'شهر 10'!AH42","v":0}]
[21,"محمد احمد جمعه",{"$f":"'شهر 10'!AI43","v":0},{"$f":"'شهر 10'!AJ43","v":0},{"$f":"'شهر 10'!AK43","v":0},null,{"$f":"'شهر 10'!D43","v":0},{"$f":"'شهر 10'!E43","v":0},{"$f":"'شهر 10'!F43","v":0},{"$f":"'شهر 10'!G43","v":0},{"$f":"'شهر 10'!H43","v":0},{"$f":"'شهر 10'!I43","v":0},{"$f":"'شهر 10'!J43","v":0},{"$f":"'شهر 10'!K43","v":0},{"$f":"'شهر 10'!L43","v":0},{"$f":"'شهر 10'!M43","v":0},{"$f":"'شهر 10'!N43","v":0},{"$f":"'شهر 10'!O43","v":0},{"$f":"'شهر 10'!P43","v":0},{"$f":"'شهر 10'!Q43","v":0},{"$f":"'شهر 10'!R43","v":0},{"$f":"'شهر 10'!S43","v":0},{"$f":"'شهر 10'!T43","v":0},{"$f":"'شهر 10'!U43","v":0},{"$f":"'شهر 10'!V43","v":0},{"$f":"'شهر 10'!W43","v":0},{"$f":"'شهر 10'!X43","v":0},{"$f":"'شهر 10'!Y43","v":0},{"$f":"'شهر 10'!Z43","v":0},{"$f":"'شهر 10'!AA43","v":0},{"$f":"'شهر 10'!AB43","v":0},{"$f":"'شهر 10'!AC43","v":0},{"$f":"'شهر 10'!AD43","v":0},{"$f":"'شهر 10'!AE43","v":0},{"$f":"'شهر 10'!AF43","v":0},{"$f":"'شهر 10'!AG43","v":0},{"$f":"'شهر 10'!AH43","v":0}]
[null,null,null,null,null,null,{"$f":"'شهر 10'!D44","v":0},{"$f":"'شهر 10'!E44","v":0},{"$f":"'شهر 10'!F44","v":0},{"$f":"'شهر 10'!G44","v":0},{"$f":"'شهر 10'!H44","v":0},{"$f":"'شهر 10'!I44","v":0},{"$f":"'شهر 10'!J44","v":0},{"$f":"'شهر 10'!K44","v":0},{"$f":"'شهر 10'!L44","v":0},{"$f":"'شهر 10'!M44","v":0},{"$f":"'شهر 10'!N44","v":0},{"$f":"'شهر 10'!O44","v":0},{"$f":"'شهر 10'!P44","v":0},{"$f":"'شهر 10'!Q44","v":0},{"$f":"'شهر 10'!R44","v":0},{"$f":"'شهر 10'!S44","v":0},{"$f":"'شهر 10'!T44","v":0},{"$f":"'شهر 10'!U44","v":0},{"$f":"'شهر 10'!V44","v":0},{"$f":"'شهر 10'!W44","v":0},{"$f":"'شهر 10'!X44","v":0},{"$f":"'شهر 10'!Y44","v":0},{"$f":"'شهر 10'!Z44","v":0},{"$f":"'شهر 10'!AA44","v":0},{"$f":"'شهر 10'!AB44","v":0},{"$f":"'شهر 10'!AC44","v":0},{"$f":"'شهر 10'!AD44","v":0},{"$f":"'شهر 10'!AE44","v":0},{"$f":"'شهر 10'!AF44","v":0},{"$f":"'شهر 10'!AG44","v":0},{"$f":"'شهر 10'!AH44","v":0}]
[22,"السيد رمضان الدسوقى",{"$f":"'شهر 10'!AI45","v":0},{"$f":"'شهر 10'!AJ45","v":0},{"$f":"'شهر 10'!AK45","v":0},null,{"$f":"'شهر 10'!D45","v":0},{"$f":"'شهر 10'!E45","v":0},{"$f":"'شهر 10'!F45","v":0},{"$f":"'شهر 10'!G45","v":0},{"$f":"'شهر 10'!H45","v":0},{"$f":"'شهر 10'!I45","v":0},{"$f":"'شهر 10'!J45","v":0},{"$f":"'شهر 10'!K45","v":0},{"$f":"'شهر 10'!L45","v":0},{"$f":"'شهر 10'!M45","v":0},{"$f":"'شهر 10'!N45","v":0},{"$f":"'شهر 10'!O45","v":0},{"$f":"'شهر 10'!P45","v":0},{"$f":"'شهر 10'!Q45","v":0},{"$f":"'شهر 10'!R45","v":0},{"$f":"'شهر 10'!S45","v":0},{"$f":"'شهر 10'!T45","v":0},{"$f":"'شهر 10'!U45","v":0},{"$f":"'شهر 10'!V45","v":0},{"$f":"'شهر 10'!W45","v":0},{"$f":"'شهر 10'!X45","v":0},{"$f":"'شهر 10'!Y45","v":0},{"$f":"'شهر 10'!Z45","v":0},{"$f":"'شهر 10'!AA45","v":0},{"$f":"'شهر 10'!AB45","v":0},{"$f":"'شهر 10'!AC45","v":0},{"$f":"'شهر 10'!AD45","v":0},{"$f":"'شهر 10'!AE45","v":0},{"$f":"'شهر 10'!AF45","v":0},{"$f":"'شهر 10'!AG45","v":0},{"$f":"'شهر 10'!AH45","v":0}]
[null,null,null,null,null,null,{"$f":"'شهر 10'!D46","v":0},{"$f":"'شهر 10'!E46","v":0},{"$f":"'شهر 10'!F46","v":0},{"$f":"'شهر 10'!G46","v":0},{"$f":"'شهر 10'!H46","v":0},{"$f":"'شهر 10'!I46","v":0},{"$f":"'شهر 10'!J46","v":0},{"$f":"'شهر 10'!K46","v":0},{"$f":"'شهر 10'!L46","v":0},{"$f":"'شهر 10'!M46","v":0},{"$f":"'شهر 10'!N46","v":0},{"$f":"'شهر 10'!O46","v":0},{"$f":"'شهر 10'!P46","v":0},{"$f":"'شهر 10'!Q46","v":0},{"$f":"'شهر 10'!R46","v":0},{"$f":"'شهر 10'!S46","v":0},{"$f":"'شهر 10'!T46","v":0},{"$f":"'شهر 10'!U46","v":0},{"$f":"'شهر 10'!V46","v":0},{"$f":"'شهر 10'!W46","v":0},{"$f":"'شهر 10'!X46","v":0},{"$f":"'شهر 10'!Y46","v":0},{"$f":"'شهر 10'!Z46","v":0},{"$f":"'شهر 10'!AA46","v":0},{"$f":"'شهر 10'!AB46","v":0},{"$f":"'شهر 10'!AC46","v":0},{"$f":"'شهر 10'!AD46","v":0},{"$f":"'شهر 10'!AE46","v":0},{"$f":"'شهر 10'!AF46","v":0},{"$f":"'شهر 10'!AG46","v":0},{"$f":"'شهر 10'!AH46","v":0}]
[23,"على السيد عبد الكريم",{"$f":"'شهر 10'!AI47","v":0},{"$f":"'شهر 10'!AJ47","v":0},{"$f":"'شهر 10'!AK47","v":0},null,{"$f":"'شهر 10'!D47","v":0},{"$f":"'شهر 10'!E47","v":0},{"$f":"'شهر 10'!F47","v":0},{"$f":"'شهر 10'!G47","v":0},{"$f":"'شهر 10'!H47","v":0},{"$f":"'شهر 10'!I47","v":0},{"$f":"'شهر 10'!J47","v":0},{"$f":"'شهر 10'!K47","v":0},{"$f":"'شهر 10'!L47","v":0},{"$f":"'شهر 10'!M47","v":0},{"$f":"'شهر 10'!N47","v":0},{"$f":"'شهر 10'!O47","v":0},{"$f":"'شهر 10'!P47","v":0},{"$f":"'شهر 10'!Q47","v":0},{"$f":"'شهر 10'!R47","v":0},{"$f":"'شهر 10'!S47","v":0},{"$f":"'شهر 10'!T47","v":0},{"$f":"'شهر 10'!U47","v":0},{"$f":"'شهر 10'!V47","v":0},{"$f":"'شهر 10'!W47","v":0},{"$f":"'شهر 10'!X47","v":0},{"$f":"'شهر 10'!Y47","v":0},{"$f":"'شهر 10'!Z47","v":0},{"$f":"'شهر 10'!AA47","v":0},{"$f":"'شهر 10'!AB47","v":0},{"$f":"'شهر 10'!AC47","v":0},{"$f":"'شهر 10'!AD47","v":0},{"$f":"'شهر 10'!AE47","v":0},{"$f":"'شهر 10'!AF47","v":0},{"$f":"'شهر 10'!AG47","v":0},{"$f":"'شهر 10'!AH47","v":0}]
[null,null,null,null,null,null,{"$f":"'شهر 10'!D48","v":0},{"$f":"'شهر 10'!E48","v":0},{"$f":"'شهر 10'!F48","v":0},{"$f":"'شهر 10'!G48","v":0},{"$f":"'شهر 10'!H48","v":0},{"$f":"'شهر 10'!I48","v":0},{"$f":"'شهر 10'!J48","v":0},{"$f":"'شهر 10'!K48","v":0},{"$f":"'شهر 10'!L48","v":0},{"$f":"'شهر 10'!M48","v":0},{"$f":"'شهر 10'!N48","v":0},{"$f":"'شهر 10'!O48","v":0},{"$f":"'شهر 10'!P48","v":0},{"$f":"'شهر 10'!Q48","v":0},{"$f":"'شهر 10'!R48","v":0},{"$f":"'شهر 10'!S48","v":0},{"$f":"'شهر 10'!T48","v":0},{"$f":"'شهر 10'!U48","v":0},{"$f":"'شهر 10'!V48","v":0},{"$f":"'شهر 10'!W48","v":0},{"$f":"'شهر 10'!X48","v":0},{"$f":"'شهر 10'!Y48","v":0},{"$f":"'شهر 10'!Z48","v":0},{"$f":"'شهر 10'!AA48","v":0},{"$f":"'شهر 10'!AB48","v":0},{"$f":"'شهر 10'!AC48","v":0},{"$f":"'شهر 10'!AD48","v":0},{"$f":"'شهر 10'!AE48","v":0},{"$f":"'شهر 10'!AF48","v":0},{"$f":"'شهر 10'!AG48","v":0},{"$f":"'شهر 10'!AH48","v":0}]
[24,"حلمي احمد العجوز",{"$f":"'شهر 10'!AI49","v":0},{"$f":"'شهر 10'!AJ49","v":0},{"$f":"'شهر 10'!AK49","v":0},null,{"$f":"'شهر 10'!D49","v":0},{"$f":"'شهر 10'!E49","v":0},{"$f":"'شهر 10'!F49","v":0},{"$f":"'شهر 10'!G49","v":0},{"$f":"'شهر 10'!H49","v":0},{"$f":"'شهر 10'!I49","v":0},{"$f":"'شهر 10'!J49","v":0},{"$f":"'شهر 10'!K49","v":0},{"$f":"'شهر 10'!L49","v":0},{"$f":"'شهر 10'!M49","v":0},{"$f":"'شهر 10'!N49","v":0},{"$f":"'شهر 10'!O49","v":0},{"$f":"'شهر 10'!P49","v":0},{"$f":"'شهر 10'!Q49","v":0},{"$f":"'شهر 10'!R49","v":0},{"$f":"'شهر 10'!S49","v":0},{"$f":"'شهر 10'!T49","v":0},{"$f":"'شهر 10'!U49","v":0},{"$f":"'شهر 10'!V49","v":0},{"$f":"'شهر 10'!W49","v":0},{"$f":"'شهر 10'!X49","v":0},{"$f":"'شهر 10'!Y49","v":0},{"$f":"'شهر 10'!Z49","v":0},{"$f":"'شهر 10'!AA49","v":0},{"$f":"'شهر 10'!AB49","v":0},{"$f":"'شهر 10'!AC49","v":0},{"$f":"'شهر 10'!AD49","v":0},{"$f":"'شهر 10'!AE49","v":0},{"$f":"'شهر 10'!AF49","v":0},{"$f":"'شهر 10'!AG49","v":0},{"$f":"'شهر 10'!AH49","v":0}]
[null,null,null,null,null,null,{"$f":"'شهر 10'!D50","v":0},{"$f":"'شهر 10'!E50","v":0},{"$f":"'شهر 10'!F50","v":0},{"$f":"'شهر 10'!G50","v":0},{"$f":"'شهر 10'!H50","v":0},{"$f":"'شهر 10'!I50","v":0},{"$f":"'شهر 10'!J50","v":0},{"$f":"'شهر 10'!K50","v":0},{"$f":"'شهر 10'!L50","v":0},{"$f":"'شهر 10'!M50","v":0},{"$f":"'شهر 10'!N50","v":0},{"$f":"'شهر 10'!O50","v":0},{"$f":"'شهر 10'!P50","v":0},{"$f":"'شهر 10'!Q50","v":0},{"$f":"'شهر 10'!R50","v":0},{"$f":"'شهر 10'!S50","v":0},{"$f":"'شهر 10'!T50","v":0},{"$f":"'شهر 10'!U50","v":0},{"$f":"'شهر 10'!V50","v":0},{"$f":"'شهر 10'!W50","v":0},{"$f":"'شهر 10'!X50","v":0},{"$f":"'شهر 10'!Y50","v":0},{"$f":"'شهر 10'!Z50","v":0},{"$f":"'شهر 10'!AA50","v":0},{"$f":"'شهر 10'!AB50","v":0},{"$f":"'شهر 10'!AC50","v":0},{"$f":"'شهر 10'!AD50","v":0},{"$f":"'شهر 10'!AE50","v":0},{"$f":"'شهر 10'!AF50","v":0},{"$f":"'شهر 10'!AG50","v":0},{"$f":"'شهر 10'!AH50","v":0}]
[25,"فارس على عبوده",{"$f":"'شهر 10'!AI51","v":0},{"$f":"'شهر 10'!AJ51","v":0},{"$f":"'شهر 10'!AK51","v":0},null,{"$f":"'شهر 10'!D51","v":0},{"$f":"'شهر 10'!E51","v":0},{"$f":"'شهر 10'!F51","v":0},{"$f":"'شهر 10'!G51","v":0},{"$f":"'شهر 10'!H51","v":0},{"$f":"'شهر 10'!I51","v":0},{"$f":"'شهر 10'!J51","v":0},{"$f":"'شهر 10'!K51","v":0},{"$f":"'شهر 10'!L51","v":0},{"$f":"'شهر 10'!M51","v":0},{"$f":"'شهر 10'!N51","v":0},{"$f":"'شهر 10'!O51","v":0},{"$f":"'شهر 10'!P51","v":0},{"$f":"'شهر 10'!Q51","v":0},{"$f":"'شهر 10'!R51","v":0},{"$f":"'شهر 10'!S51","v":0},{"$f":"'شهر 10'!T51","v":0},{"$f":"'شهر 10'!U51","v":0},{"$f":"'شهر 10'!V51","v":0},{"$f":"'شهر 10'!W51","v":0},{"$f":"'شهر 10'!X51","v":0},{"$f":"'شهر 10'!Y51","v":0},{"$f":"'شهر 10'!Z51","v":0},{"$f":"'شهر 10'!AA51","v":0},{"$f":"'شهر 10'!AB51","v":0},{"$f":"'شهر 10'!AC51","v":0},{"$f":"'شهر 10'!AD51","v":0},{"$f":"'شهر 10'!AE51","v":0},{"$f":"'شهر 10'!AF51","v":0},{"$f":"'شهر 10'!AG51","v":0},{"$f":"'شهر 10'!AH51","v":0}]
[null,null,null,null,null,null,{"$f":"'شهر 10'!D52","v":0},{"$f":"'شهر 10'!E52","v":0},{"$f":"'شهر 10'!F52","v":0},{"$f":"'شهر 10'!G52","v":0},{"$f":"'شهر 10'!H52","v":0},{"$f":"'شهر 10'!I52","v":0},{"$f":"'شهر 10'!J52","v":0},{"$f":"'شهر 10'!K52","v":0},{"$f":"'شهر 10'!L52","v":0},{"$f":"'شهر 10'!M52","v":0},{"$f":"'شهر 10'!N52","v":0},{"$f":"'شهر 10'!O52","v":0},{"$f":"'شهر 10'!P52","v":0},{"$f":"'شهر 10'!Q52","v":0},{"$f":"'شهر 10'!R52","v":0},{"$f":"'شهر 10'!S52","v":0},{"$f":"'شهر 10'!T52","v":0},{"$f":"'شهر 10'!U52","v":0},{"$f":"'شهر 10'!V52","v":0},{"$f":"'شهر 10'!W52","v":0},{"$f":"'شهر 10'!X52","v":0},{"$f":"'شهر 10'!Y52","v":0},{"$f":"'شهر 10'!Z52","v":0},{"$f":"'شهر 10'!AA52","v":0},{"$f":"'شهر 10'!AB52","v":0},{"$f":"'شهر 10'!AC52","v":0},{"$f":"'شهر 10'!AD52","v":0},{"$f":"'شهر 10'!AE52","v":0},{"$f":"'شهر 10'!AF52","v":0},{"$f":"'شهر 10'!AG52","v":0},{"$f":"'شهر 10'!AH52","v":0}]
[26,"محمد عبوده عبد المولى",{"$f":"'شهر 10'!AI53","v":0},{"$f":"'شهر 10'!AJ53","v":0},{"$f":"'شهر 10'!AK53","v":0},null,{"$f":"'شهر 10'!D53","v":0},{"$f":"'شهر 10'!E53","v":0},{"$f":"'شهر 10'!F53","v":0},{"$f":"'شهر 10'!G53","v":0},{"$f":"'شهر 10'!H53","v":0},{"$f":"'شهر 10'!I53","v":0},{"$f":"'شهر 10'!J53","v":0},{"$f":"'شهر 10'!K53","v":0},{"$f":"'شهر 10'!L53","v":0},{"$f":"'شهر 10'!M53","v":0},{"$f":"'شهر 10'!N53","v":0},{"$f":"'شهر 10'!O53","v":0},{"$f":"'شهر 10'!P53","v":0},{"$f":"'شهر 10'!Q53","v":0},{"$f":"'شهر 10'!R53","v":0},{"$f":"'شهر 10'!S53","v":0},{"$f":"'شهر 10'!T53","v":0},{"$f":"'شهر 10'!U53","v":0},{"$f":"'شهر 10'!V53","v":0},{"$f":"'شهر 10'!W53","v":0},{"$f":"'شهر 10'!X53","v":0},{"$f":"'شهر 10'!Y53","v":0},{"$f":"'شهر 10'!Z53","v":0},{"$f":"'شهر 10'!AA53","v":0},{"$f":"'شهر 10'!AB53","v":0},{"$f":"'شهر 10'!AC53","v":0},{"$f":"'شهر 10'!AD53","v":0},{"$f":"'شهر 10'!AE53","v":0},{"$f":"'شهر 10'!AF53","v":0},{"$f":"'شهر 10'!AG53","v":0},{"$f":"'شهر 10'!AH53","v":0}]
[null,null,null,null,null,null,{"$f":"'شهر 10'!D54","v":0},{"$f":"'شهر 10'!E54","v":0},{"$f":"'شهر 10'!F54","v":0},{"$f":"'شهر 10'!G54","v":0},{"$f":"'شهر 10'!H54","v":0},{"$f":"'شهر 10'!I54","v":0},{"$f":"'شهر 10'!J54","v":0},{"$f":"'شهر 10'!K54","v":0},{"$f":"'شهر 10'!L54","v":0},{"$f":"'شهر 10'!M54","v":0},{"$f":"'شهر 10'!N54","v":0},{"$f":"'شهر 10'!O54","v":0},{"$f":"'شهر 10'!P54","v":0},{"$f":"'شهر 10'!Q54","v":0},{"$f":"'شهر 10'!R54","v":0},{"$f":"'شهر 10'!S54","v":0},{"$f":"'شهر 10'!T54","v":0},{"$f":"'شهر 10'!U54","v":0},{"$f":"'شهر 10'!V54","v":0},{"$f":"'شهر 10'!W54","v":0},{"$f":"'شهر 10'!X54","v":0},{"$f":"'شهر 10'!Y54","v":0},{"$f":"'شهر 10'!Z54","v":0},{"$f":"'شهر 10'!AA54","v":0},{"$f":"'شهر 10'!AB54","v":0},{"$f":"'شهر 10'!AC54","v":0},{"$f":"'شهر 10'!AD54","v":0},{"$f":"'شهر 10'!AE54","v":0},{"$f":"'شهر 10'!AF54","v":0},{"$f":"'شهر 10'!AG54","v":0},{"$f":"'شهر 10'!AH54","v":0}]
[27,"ايمن عبوده عبد المولى",{"$f":"'شهر 10'!AI55","v":0},{"$f":"'شهر 10'!AJ55","v":0},{"$f":"'شهر 10'!AK55","v":0},null,{"$f":"'شهر 10'!D55","v":0},{"$f":"'شهر 10'!E55","v":0},{"$f":"'شهر 10'!F55","v":0},{"$f":"'شهر 10'!G55","v":0},{"$f":"'شهر 10'!H55","v":0},{"$f":"'شهر 10'!I55","v":0},{"$f":"'شهر 10'!J55","v":0},{"$f":"'شهر 10'!K55","v":0},{"$f":"'شهر 10'!L55","v":0},{"$f":"'شهر 10'!M55","v":0},{"$f":"'شهر 10'!N55","v":0},{"$f":"'شهر 10'!O55","v":0},{"$f":"'شهر 10'!P55","v":0},{"$f":"'شهر 10'!Q55","v":0},{"$f":"'شهر 10'!R55","v":0},{"$f":"'شهر 10'!S55","v":0},{"$f":"'شهر 10'!T55","v":0},{"$f":"'شهر 10'!U55","v":0},{"$f":"'شهر 10'!V55","v":0},{"$f":"'شهر 10'!W55","v":0},{"$f":"'شهر 10'!X55","v":0},{"$f":"'شهر 10'!Y55","v":0},{"$f":"'شهر 10'!Z55","v":0},{"$f":"'شهر 10'!AA55","v":0},{"$f":"'شهر 10'!AB55","v":0},{"$f":"'شهر 10'!AC55","v":0},{"$f":"'شهر 10'!AD55","v":0},{"$f":"'شهر 10'!AE55","v":0},{"$f":"'شهر 10'!AF55","v":0},{"$f":"'شهر 10'!AG55","v":0},{"$f":"'شهر 10'!AH55","v":0}]
[null,null,null,null,null,null,{"$f":"'شهر 10'!D56","v":0},{"$f":"'شهر 10'!E56","v":0},{"$f":"'شهر 10'!F56","v":0},{"$f":"'شهر 10'!G56","v":0},{"$f":"'شهر 10'!H56","v":0},{"$f":"'شهر 10'!I56","v":0},{"$f":"'شهر 10'!J56","v":0},{"$f":"'شهر 10'!K56","v":0},{"$f":"'شهر 10'!L56","v":0},{"$f":"'شهر 10'!M56","v":0},{"$f":"'شهر 10'!N56","v":0},{"$f":"'شهر 10'!O56","v":0},{"$f":"'شهر 10'!P56","v":0},{"$f":"'شهر 10'!Q56","v":0},{"$f":"'شهر 10'!R56","v":0},{"$f":"'شهر 10'!S56","v":0},{"$f":"'شهر 10'!T56","v":0},{"$f":"'شهر 10'!U56","v":0},{"$f":"'شهر 10'!V56","v":0},{"$f":"'شهر 10'!W56","v":0},{"$f":"'شهر 10'!X56","v":0},{"$f":"'شهر 10'!Y56","v":0},{"$f":"'شهر 10'!Z56","v":0},{"$f":"'شهر 10'!AA56","v":0},{"$f":"'شهر 10'!AB56","v":0},{"$f":"'شهر 10'!AC56","v":0},{"$f":"'شهر 10'!AD56","v":0},{"$f":"'شهر 10'!AE56","v":0},{"$f":"'شهر 10'!AF56","v":0},{"$f":"'شهر 10'!AG56","v":0},{"$f":"'شهر 10'!AH56","v":0}]
[28,"حاتم عبوده عبد المولى",{"$f":"'شهر 10'!AI57","v":0},{"$f":"'شهر 10'!AJ57","v":0},{"$f":"'شهر 10'!AK57","v":0},null,{"$f":"'شهر 10'!D57","v":0},{"$f":"'شهر 10'!E57","v":0},{"$f":"'شهر 10'!F57","v":0},{"$f":"'شهر 10'!G57","v":0},{"$f":"'شهر 10'!H57","v":0},{"$f":"'شهر 10'!I57","v":0},{"$f":"'شهر 10'!J57","v":0},{"$f":"'شهر 10'!K57","v":0},{"$f":"'شهر 10'!L57","v":0},{"$f":"'شهر 10'!M57","v":0},{"$f":"'شهر 10'!N57","v":0},{"$f":"'شهر 10'!O57","v":0},{"$f":"'شهر 10'!P57","v":0},{"$f":"'شهر 10'!Q57","v":0},{"$f":"'شهر 10'!R57","v":0},{"$f":"'شهر 10'!S57","v":0},{"$f":"'شهر 10'!T57","v":0},{"$f":"'شهر 10'!U57","v":0},{"$f":"'شهر 10'!V57","v":0},{"$f":"'شهر 10'!W57","v":0},{"$f":"'شهر 10'!X57","v":0},{"$f":"'شهر 10'!Y57","v":0},{"$f":"'شهر 10'!Z57","v":0},{"$f":"'شهر 10'!AA57","v":0},{"$f":"'شهر 10'!AB57","v":0},{"$f":"'شهر 10'!AC57","v":0},{"$f":"'شهر 10'!AD57","v":0},{"$f":"'شهر 10'!AE57","v":0},{"$f":"'شهر 10'!AF57","v":0},{"$f":"'شهر 10'!AG57","v":0},{"$f":"'شهر 10'!AH57","v":0}]
[null,null,null,null,null,null,{"$f":"'شهر 10'!D58","v":0},{"$f":"'شهر 10'!E58","v":0},{"$f":"'شهر 10'!F58","v":0},{"$f":"'شهر 10'!G58","v":0},{"$f":"'شهر 10'!H58","v":0},{"$f":"'شهر 10'!I58","v":0},{"$f":"'شهر 10'!J58","v":0},{"$f":"'شهر 10'!K58","v":0},{"$f":"'شهر 10'!L58","v":0},{"$f":"'شهر 10'!M58","v":0},{"$f":"'شهر 10'!N58","v":0},{"$f":"'شهر 10'!O58","v":0},{"$f":"'شهر 10'!P58","v":0},{"$f":"'شهر 10'!Q58","v":0},{"$f":"'شهر 10'!R58","v":0},{"$f":"'شهر 10'!S58","v":0},{"$f":"'شهر 10'!T58","v":0},{"$f":"'شهر 10'!U58","v":0},{"$f":"'شهر 10'!V58","v":0},{"$f":"'شهر 10'!W58","v":0},{"$f":"'شهر 10'!X58","v":0},{"$f":"'شهر 10'!Y58","v":0},{"$f":"'شهر 10'!Z58","v":0},{"$f":"'شهر 10'!AA58","v":0},{"$f":"'شهر 10'!AB58","v":0},{"$f":"'شهر 10'!AC58","v":0},{"$f":"'شهر 10'!AD58","v":0},{"$f":"'شهر 10'!AE58","v":0},{"$f":"'شهر 10'!AF58","v":0},{"$f":"'شهر 10'!AG58","v":0},{"$f":"'شهر 10'!AH58","v":0}]
[29,"نادر عبد العال",{"$f":"'شهر 10'!AI59","v":0},{"$f":"'شهر 10'!AJ59","v":0},{"$f":"'شهر 10'!AK59","v":0},null,{"$f":"'شهر 10'!D59","v":0},{"$f":"'شهر 10'!E59","v":0},{"$f":"'شهر 10'!F59","v":0},{"$f":"'شهر 10'!G59","v":0},{"$f":"'شهر 10'!H59","v":0},{"$f":"'شهر 10'!I59","v":0},{"$f":"'شهر 10'!J59","v":0},{"$f":"'شهر 10'!K59","v":0},{"$f":"'شهر 10'!L59","v":0},{"$f":"'شهر 10'!M59","v":0},{"$f":"'شهر 10'!N59","v":0},{"$f":"'شهر 10'!O59","v":0},{"$f":"'شهر 10'!P59","v":0},{"$f":"'شهر 10'!Q59","v":0},{"$f":"'شهر 10'!R59","v":0},{"$f":"'شهر 10'!S59","v":0},{"$f":"'شهر 10'!T59","v":0},{"$f":"'شهر 10'!U59","v":0},{"$f":"'شهر 10'!V59","v":0},{"$f":"'شهر 10'!W59","v":0},{"$f":"'شهر 10'!X59","v":0},{"$f":"'شهر 10'!Y59","v":0},{"$f":"'شهر 10'!Z59","v":0},{"$f":"'شهر 10'!AA59","v":0},{"$f":"'شهر 10'!AB59","v":0},{"$f":"'شهر 10'!AC59","v":0},{"$f":"'شهر 10'!AD59","v":0},{"$f":"'شهر 10'!AE59","v":0},{"$f":"'شهر 10'!AF59","v":0},{"$f":"'شهر 10'!AG59","v":0},{"$f":"'شهر 10'!AH59","v":0}]
[null,null,null,null,null,null,{"$f":"'شهر 10'!D60","v":0},{"$f":"'شهر 10'!E60","v":0},{"$f":"'شهر 10'!F60","v":0},{"$f":"'شهر 10'!G60","v":0},{"$f":"'شهر 10'!H60","v":0},{"$f":"'شهر 10'!I60","v":0},{"$f":"'شهر 10'!J60","v":0},{"$f":"'شهر 10'!K60","v":0},{"$f":"'شهر 10'!L60","v":0},{"$f":"'شهر 10'!M60","v":0},{"$f":"'شهر 10'!N60","v":0},{"$f":"'شهر 10'!O60","v":0},{"$f":"'شهر 10'!P60","v":0},{"$f":"'شهر 10'!Q60","v":0},{"$f":"'شهر 10'!R60","v":0},{"$f":"'شهر 10'!S60","v":0},{"$f":"'شهر 10'!T60","v":0},{"$f":"'شهر 10'!U60","v":0},{"$f":"'شهر 10'!V60","v":0},{"$f":"'شهر 10'!W60","v":0},{"$f":"'شهر 10'!X60","v":0},{"$f":"'شهر 10'!Y60","v":0},{"$f":"'شهر 10'!Z60","v":0},{"$f":"'شهر 10'!AA60","v":0},{"$f":"'شهر 10'!AB60","v":0},{"$f":"'شهر 10'!AC60","v":0},{"$f":"'شهر 10'!AD60","v":0},{"$f":"'شهر 10'!AE60","v":0},{"$f":"'شهر 10'!AF60","v":0},{"$f":"'شهر 10'!AG60","v":0},{"$f":"'شهر 10'!AH60","v":0}]
[30,"محمد متولى عباس",{"$f":"'شهر 10'!AI61","v":0},{"$f":"'شهر 10'!AJ61","v":0},{"$f":"'شهر 10'!AK61","v":0},null,{"$f":"'شهر 10'!D61","v":0},{"$f":"'شهر 10'!E61","v":0},{"$f":"'شهر 10'!F61","v":0},{"$f":"'شهر 10'!G61","v":0},{"$f":"'شهر 10'!H61","v":0},{"$f":"'شهر 10'!I61","v":0},{"$f":"'شهر 10'!J61","v":0},{"$f":"'شهر 10'!K61","v":0},{"$f":"'شهر 10'!L61","v":0},{"$f":"'شهر 10'!M61","v":0},{"$f":"'شهر 10'!N61","v":0},{"$f":"'شهر 10'!O61","v":0},{"$f":"'شهر 10'!P61","v":0},{"$f":"'شهر 10'!Q61","v":0},{"$f":"'شهر 10'!R61","v":0},{"$f":"'شهر 10'!S61","v":0},{"$f":"'شهر 10'!T61","v":0},{"$f":"'شهر 10'!U61","v":0},{"$f":"'شهر 10'!V61","v":0},{"$f":"'شهر 10'!W61","v":0},{"$f":"'شهر 10'!X61","v":0},{"$f":"'شهر 10'!Y61","v":0},{"$f":"'شهر 10'!Z61","v":0},{"$f":"'شهر 10'!AA61","v":0},{"$f":"'شهر 10'!AB61","v":0},{"$f":"'شهر 10'!AC61","v":0},{"$f":"'شهر 10'!AD61","v":0},{"$f":"'شهر 10'!AE61","v":0},{"$f":"'شهر 10'!AF61","v":0},{"$f":"'شهر 10'!AG61","v":0},{"$f":"'شهر 10'!AH61","v":0}]
[null,null,null,null,null,null,{"$f":"'شهر 10'!D62","v":0},{"$f":"'شهر 10'!E62","v":0},{"$f":"'شهر 10'!F62","v":0},{"$f":"'شهر 10'!G62","v":0},{"$f":"'شهر 10'!H62","v":0},{"$f":"'شهر 10'!I62","v":0},{"$f":"'شهر 10'!J62","v":0},{"$f":"'شهر 10'!K62","v":0},{"$f":"'شهر 10'!L62","v":0},{"$f":"'شهر 10'!M62","v":0},{"$f":"'شهر 10'!N62","v":0},{"$f":"'شهر 10'!O62","v":0},{"$f":"'شهر 10'!P62","v":0},{"$f":"'شهر 10'!Q62","v":0},{"$f":"'شهر 10'!R62","v":0},{"$f":"'شهر 10'!S62","v":0},{"$f":"'شهر 10'!T62","v":0},{"$f":"'شهر 10'!U62","v":0},{"$f":"'شهر 10'!V62","v":0},{"$f":"'شهر 10'!W62","v":0},{"$f":"'شهر 10'!X62","v":0},{"$f":"'شهر 10'!Y62","v":0},{"$f":"'شهر 10'!Z62","v":0},{"$f":"'شهر 10'!AA62","v":0},{"$f":"'شهر 10'!AB62","v":0},{"$f":"'شهر 10'!AC62","v":0},{"$f":"'شهر 10'!AD62","v":0},{"$f":"'شهر 10'!AE62","v":0},{"$f":"'شهر 10'!AF62","v":0},{"$f":"'شهر 10'!AG62","v":0},{"$f":"'شهر 10'!AH62","v":0}]
[31,"السعيد الشرقاوي",{"$f":"'شهر 10'!AI63","v":0},{"$f":"'شهر 10'!AJ63","v":0},{"$f":"'شهر 10'!AK63","v":0},null,{"$f":"'شهر 10'!D63","v":0},{"$f":"'شهر 10'!E63","v":0},{"$f":"'شهر 10'!F63","v":0},{"$f":"'شهر 10'!G63","v":0},{"$f":"'شهر 10'!H63","v":0},{"$f":"'شهر 10'!I63","v":0},{"$f":"'شهر 10'!J63","v":0},{"$f":"'شهر 10'!K63","v":0},{"$f":"'شهر 10'!L63","v":0},{"$f":"'شهر 10'!M63","v":0},{"$f":"'شهر 10'!N63","v":0},{"$f":"'شهر 10'!O63","v":0},{"$f":"'شهر 10'!P63","v":0},{"$f":"'شهر 10'!Q63","v":0},{"$f":"'شهر 10'!R63","v":0},{"$f":"'شهر 10'!S63","v":0},{"$f":"'شهر 10'!T63","v":0},{"$f":"'شهر 10'!U63","v":0},{"$f":"'شهر 10'!V63","v":0},{"$f":"'شهر 10'!W63","v":0},{"$f":"'شهر 10'!X63","v":0},{"$f":"'شهر 10'!Y63","v":0},{"$f":"'شهر 10'!Z63","v":0},{"$f":"'شهر 10'!AA63","v":0},{"$f":"'شهر 10'!AB63","v":0},{"$f":"'شهر 10'!AC63","v":0},{"$f":"'شهر 10'!AD63","v":0},{"$f":"'شهر 10'!AE63","v":0},{"$f":"'شهر 10'!AF63","v":0},{"$f":"'شهر 10'!AG63","v":0},{"$f":"'شهر 10'!AH63","v":0}]
[null,null,null,null,null,null,{"$f":"'شهر 10'!D64","v":0},{"$f":"'شهر 10'!E64","v":0},{"$f":"'شهر 10'!F64","v":0},{"$f":"'شهر 10'!G64","v":0},{"$f":"'شهر 10'!H64","v":0},{"$f":"'شهر 10'!I64","v":0},{"$f":"'شهر 10'!J64","v":0},{"$f":"'شهر 10'!K64","v":0},{"$f":"'شهر 10'!L64","v":0},{"$f":"'شهر 10'!M64","v":0},{"$f":"'شهر 10'!N64","v":0},{"$f":"'شهر 10'!O64","v":0},{"$f":"'شهر 10'!P64","v":0},{"$f":"'شهر 10'!Q64","v":0},{"$f":"'شهر 10'!R64","v":0},{"$f":"'شهر 10'!S64","v":0},{"$f":"'شهر 10'!T64","v":0},{"$f":"'شهر 10'!U64","v":0},{"$f":"'شهر 10'!V64","v":0},{"$f":"'شهر 10'!W64","v":0},{"$f":"'شهر 10'!X64","v":0},{"$f":"'شهر 10'!Y64","v":0},{"$f":"'شهر 10'!Z64","v":0},{"$f":"'شهر 10'!AA64","v":0},{"$f":"'شهر 10'!AB64","v":0},{"$f":"'شهر 10'!AC64","v":0},{"$f":"'شهر 10'!AD64","v":0},{"$f":"'شهر 10'!AE64","v":0},{"$f":"'شهر 10'!AF64","v":0},{"$f":"'شهر 10'!AG64","v":0},{"$f":"'شهر 10'!AH64","v":0}]
[32,"عزيز فتحي سعفان",{"$f":"'شهر 10'!AI65","v":0},{"$f":"'شهر 10'!AJ65","v":0},{"$f":"'شهر 10'!AK65","v":0},null,{"$f":"'شهر 10'!D65","v":0},{"$f":"'شهر 10'!E65","v":0},{"$f":"'شهر 10'!F65","v":0},{"$f":"'شهر 10'!G65","v":0},{"$f":"'شهر 10'!H65","v":0},{"$f":"'شهر 10'!I65","v":0},{"$f":"'شهر 10'!J65","v":0},{"$f":"'شهر 10'!K65","v":0},{"$f":"'شهر 10'!L65","v":0},{"$f":"'شهر 10'!M65","v":0},{"$f":"'شهر 10'!N65","v":0},{"$f":"'شهر 10'!O65","v":0},{"$f":"'شهر 10'!P65","v":0},{"$f":"'شهر 10'!Q65","v":0},{"$f":"'شهر 10'!R65","v":0},{"$f":"'شهر 10'!S65","v":0},{"$f":"'شهر 10'!T65","v":0},{"$f":"'شهر 10'!U65","v":0},{"$f":"'شهر 10'!V65","v":0},{"$f":"'شهر 10'!W65","v":0},{"$f":"'شهر 10'!X65","v":0},{"$f":"'شهر 10'!Y65","v":0},{"$f":"'شهر 10'!Z65","v":0},{"$f":"'شهر 10'!AA65","v":0},{"$f":"'شهر 10'!AB65","v":0},{"$f":"'شهر 10'!AC65","v":0},{"$f":"'شهر 10'!AD65","v":0},{"$f":"'شهر 10'!AE65","v":0},{"$f":"'شهر 10'!AF65","v":0},{"$f":"'شهر 10'!AG65","v":0},{"$f":"'شهر 10'!AH65","v":0}]
[null,null,null,null,null,null,{"$f":"'شهر 10'!D66","v":0},{"$f":"'شهر 10'!E66","v":0},{"$f":"'شهر 10'!F66","v":0},{"$f":"'شهر 10'!G66","v":0},{"$f":"'شهر 10'!H66","v":0},{"$f":"'شهر 10'!I66","v":0},{"$f":"'شهر 10'!J66","v":0},{"$f":"'شهر 10'!K66","v":0},{"$f":"'شهر 10'!L66","v":0},{"$f":"'شهر 10'!M66","v":0},{"$f":"'شهر 10'!N66","v":0},{"$f":"'شهر 10'!O66","v":0},{"$f":"'شهر 10'!P66","v":0},{"$f":"'شهر 10'!Q66","v":0},{"$f":"'شهر 10'!R66","v":0},{"$f":"'شهر 10'!S66","v":0},{"$f":"'شهر 10'!T66","v":0},{"$f":"'شهر 10'!U66","v":0},{"$f":"'شهر 10'!V66","v":0},{"$f":"'شهر 10'!W66","v":0},{"$f":"'شهر 10'!X66","v":0},{"$f":"'شهر 10'!Y66","v":0},{"$f":"'شهر 10'!Z66","v":0},{"$f":"'شهر 10'!AA66","v":0},{"$f":"'شهر 10'!AB66","v":0},{"$f":"'شهر 10'!AC66","v":0},{"$f":"'شهر 10'!AD66","v":0},{"$f":"'شهر 10'!AE66","v":0},{"$f":"'شهر 10'!AF66","v":0},{"$f":"'شهر 10'!AG66","v":0},{"$f":"'شهر 10'!AH66","v":0}]
[33,"محمود سعد محمود",{"$f":"'شهر 10'!AI67","v":0},{"$f":"'شهر 10'!AJ67","v":0},{"$f":"'شهر 10'!AK67","v":0},null,{"$f":"'شهر 10'!D67","v":0},{"$f":"'شهر 10'!E67","v":0},{"$f":"'شهر 10'!F67","v":0},{"$f":"'شهر 10'!G67","v":0},{"$f":"'شهر 10'!H67","v":0},{"$f":"'شهر 10'!I67","v":0},{"$f":"'شهر 10'!J67","v":0},{"$f":"'شهر 10'!K67","v":0},{"$f":"'شهر 10'!L67","v":0},{"$f":"'شهر 10'!M67","v":0},{"$f":"'شهر 10'!N67","v":0},{"$f":"'شهر 10'!O67","v":0},{"$f":"'شهر 10'!P67","v":0},{"$f":"'شهر 10'!Q67","v":0},{"$f":"'شهر 10'!R67","v":0},{"$f":"'شهر 10'!S67","v":0},{"$f":"'شهر 10'!T67","v":0},{"$f":"'شهر 10'!U67","v":0},{"$f":"'شهر 10'!V67","v":0},{"$f":"'شهر 10'!W67","v":0},{"$f":"'شهر 10'!X67","v":0},{"$f":"'شهر 10'!Y67","v":0},{"$f":"'شهر 10'!Z67","v":0},{"$f":"'شهر 10'!AA67","v":0},{"$f":"'شهر 10'!AB67","v":0},{"$f":"'شهر 10'!AC67","v":0},{"$f":"'شهر 10'!AD67","v":0},{"$f":"'شهر 10'!AE67","v":0},{"$f":"'شهر 10'!AF67","v":0},{"$f":"'شهر 10'!AG67","v":0},{"$f":"'شهر 10'!AH67","v":0}]
[null,null,null,null,null,null,{"$f":"'شهر 10'!D68","v":0},{"$f":"'شهر 10'!E68","v":0},{"$f":"'شهر 10'!F68","v":0},{"$f":"'شهر 10'!G68","v":0},{"$f":"'شهر 10'!H68","v":0},{"$f":"'شهر 10'!I68","v":0},{"$f":"'شهر 10'!J68","v":0},{"$f":"'شهر 10'!K68","v":0},{"$f":"'شهر 10'!L68","v":0},{"$f":"'شهر 10'!M68","v":0},{"$f":"'شهر 10'!N68","v":0},{"$f":"'شهر 10'!O68","v":0},{"$f":"'شهر 10'!P68","v":0},{"$f":"'شهر 10'!Q68","v":0},{"$f":"'شهر 10'!R68","v":0},{"$f":"'شهر 10'!S68","v":0},{"$f":"'شهر 10'!T68","v":0},{"$f":"'شهر 10'!U68","v":0},{"$f":"'شهر 10'!V68","v":0},{"$f":"'شهر 10'!W68","v":0},{"$f":"'شهر 10'!X68","v":0},{"$f":"'شهر 10'!Y68","v":0},{"$f":"'شهر 10'!Z68","v":0},{"$f":"'شهر 10'!AA68","v":0},{"$f":"'شهر 10'!AB68","v":0},{"$f":"'شهر 10'!AC68","v":0},{"$f":"'شهر 10'!AD68","v":0},{"$f":"'شهر 10'!AE68","v":0},{"$f":"'شهر 10'!AF68","v":0},{"$f":"'شهر 10'!AG68","v":0},{"$f":"'شهر 10'!AH68","v":0}]
[34,"حسن محمد طة",{"$f":"'شهر 10'!AI69","v":0},{"$f":"'شهر 10'!AJ69","v":0},{"$f":"'شهر 10'!AK69","v":0},null,{"$f":"'شهر 10'!D69","v":0},{"$f":"'شهر 10'!E69","v":0},{"$f":"'شهر 10'!F69","v":0},{"$f":"'شهر 10'!G69","v":0},{"$f":"'شهر 10'!H69","v":0},{"$f":"'شهر 10'!I69","v":0},{"$f":"'شهر 10'!J69","v":0},{"$f":"'شهر 10'!K69","v":0},{"$f":"'شهر 10'!L69","v":0},{"$f":"'شهر 10'!M69","v":0},{"$f":"'شهر 10'!N69","v":0},{"$f":"'شهر 10'!O69","v":0},{"$f":"'شهر 10'!P69","v":0},{"$f":"'شهر 10'!Q69","v":0},{"$f":"'شهر 10'!R69","v":0},{"$f":"'شهر 10'!S69","v":0},{"$f":"'شهر 10'!T69","v":0},{"$f":"'شهر 10'!U69","v":0},{"$f":"'شهر 10'!V69","v":0},{"$f":"'شهر 10'!W69","v":0},{"$f":"'شهر 10'!X69","v":0},{"$f":"'شهر 10'!Y69","v":0},{"$f":"'شهر 10'!Z69","v":0},{"$f":"'شهر 10'!AA69","v":0},{"$f":"'شهر 10'!AB69","v":0},{"$f":"'شهر 10'!AC69","v":0},{"$f":"'شهر 10'!AD69","v":0},{"$f":"'شهر 10'!AE69","v":0},{"$f":"'شهر 10'!AF69","v":0},{"$f":"'شهر 10'!AG69","v":0},{"$f":"'شهر 10'!AH69","v":0}]
[null,null,null,null,null,null,{"$f":"'شهر 10'!D70","v":0},{"$f":"'شهر 10'!E70","v":0},{"$f":"'شهر 10'!F70","v":0},{"$f":"'شهر 10'!G70","v":0},{"$f":"'شهر 10'!H70","v":0},{"$f":"'شهر 10'!I70","v":0},{"$f":"'شهر 10'!J70","v":0},{"$f":"'شهر 10'!K70","v":0},{"$f":"'شهر 10'!L70","v":0},{"$f":"'شهر 10'!M70","v":0},{"$f":"'شهر 10'!N70","v":0},{"$f":"'شهر 10'!O70","v":0},{"$f":"'شهر 10'!P70","v":0},{"$f":"'شهر 10'!Q70","v":0},{"$f":"'شهر 10'!R70","v":0},{"$f":"'شهر 10'!S70","v":0},{"$f":"'شهر 10'!T70","v":0},{"$f":"'شهر 10'!U70","v":0},{"$f":"'شهر 10'!V70","v":0},{"$f":"'شهر 10'!W70","v":0},{"$f":"'شهر 10'!X70","v":0},{"$f":"'شهر 10'!Y70","v":0},{"$f":"'شهر 10'!Z70","v":0},{"$f":"'شهر 10'!AA70","v":0},{"$f":"'شهر 10'!AB70","v":0},{"$f":"'شهر 10'!AC70","v":0},{"$f":"'شهر 10'!AD70","v":0},{"$f":"'شهر 10'!AE70","v":0},{"$f":"'شهر 10'!AF70","v":0},{"$f":"'شهر 10'!AG70","v":0},{"$f":"'شهر 10'!AH70","v":0}]
[35,"حسين محمد حسين",{"$f":"'شهر 10'!AI71","v":0},{"$f":"'شهر 10'!AJ71","v":0},{"$f":"'شهر 10'!AK71","v":0},null,{"$f":"'شهر 10'!D71","v":0},{"$f":"'شهر 10'!E71","v":0},{"$f":"'شهر 10'!F71","v":0},{"$f":"'شهر 10'!G71","v":0},{"$f":"'شهر 10'!H71","v":0},{"$f":"'شهر 10'!I71","v":0},{"$f":"'شهر 10'!J71","v":0},{"$f":"'شهر 10'!K71","v":0},{"$f":"'شهر 10'!L71","v":0},{"$f":"'شهر 10'!M71","v":0},{"$f":"'شهر 10'!N71","v":0},{"$f":"'شهر 10'!O71","v":0},{"$f":"'شهر 10'!P71","v":0},{"$f":"'شهر 10'!Q71","v":0},{"$f":"'شهر 10'!R71","v":0},{"$f":"'شهر 10'!S71","v":0},{"$f":"'شهر 10'!T71","v":0},{"$f":"'شهر 10'!U71","v":0},{"$f":"'شهر 10'!V71","v":0},{"$f":"'شهر 10'!W71","v":0},{"$f":"'شهر 10'!X71","v":0},{"$f":"'شهر 10'!Y71","v":0},{"$f":"'شهر 10'!Z71","v":0},{"$f":"'شهر 10'!AA71","v":0},{"$f":"'شهر 10'!AB71","v":0},{"$f":"'شهر 10'!AC71","v":0},{"$f":"'شهر 10'!AD71","v":0},{"$f":"'شهر 10'!AE71","v":0},{"$f":"'شهر 10'!AF71","v":0},{"$f":"'شهر 10'!AG71","v":0},{"$f":"'شهر 10'!AH71","v":0}]
[null,null,null,null,null,null,{"$f":"'شهر 10'!D72","v":0},{"$f":"'شهر 10'!E72","v":0},{"$f":"'شهر 10'!F72","v":0},{"$f":"'شهر 10'!G72","v":0},{"$f":"'شهر 10'!H72","v":0},{"$f":"'شهر 10'!I72","v":0},{"$f":"'شهر 10'!J72","v":0},{"$f":"'شهر 10'!K72","v":0},{"$f":"'شهر 10'!L72","v":0},{"$f":"'شهر 10'!M72","v":0},{"$f":"'شهر 10'!N72","v":0},{"$f":"'شهر 10'!O72","v":0},{"$f":"'شهر 10'!P72","v":0},{"$f":"'شهر 10'!Q72","v":0},{"$f":"'شهر 10'!R72","v":0},{"$f":"'شهر 10'!S72","v":0},{"$f":"'شهر 10'!T72","v":0},{"$f":"'شهر 10'!U72","v":0},{"$f":"'شهر 10'!V72","v":0},{"$f":"'شهر 10'!W72","v":0},{"$f":"'شهر 10'!X72","v":0},{"$f":"'شهر 10'!Y72","v":0},{"$f":"'شهر 10'!Z72","v":0},{"$f":"'شهر 10'!AA72","v":0},{"$f":"'شهر 10'!AB72","v":0},{"$f":"'شهر 10'!AC72","v":0},{"$f":"'شهر 10'!AD72","v":0},{"$f":"'شهر 10'!AE72","v":0},{"$f":"'شهر 10'!AF72","v":0},{"$f":"'شهر 10'!AG72","v":0},{"$f":"'شهر 10'!AH72","v":0}]
[36,"محمد ابراهيم محمد",{"$f":"'شهر 10'!AI73","v":0},{"$f":"'شهر 10'!AJ73","v":0},{"$f":"'شهر 10'!AK73","v":0},null,{"$f":"'شهر 10'!D73","v":0},{"$f":"'شهر 10'!E73","v":0},{"$f":"'شهر 10'!F73","v":0},{"$f":"'شهر 10'!G73","v":0},{"$f":"'شهر 10'!H73","v":0},{"$f":"'شهر 10'!I73","v":0},{"$f":"'شهر 10'!J73","v":0},{"$f":"'شهر 10'!K73","v":0},{"$f":"'شهر 10'!L73","v":0},{"$f":"'شهر 10'!M73","v":0},{"$f":"'شهر 10'!N73","v":0},{"$f":"'شهر 10'!O73","v":0},{"$f":"'شهر 10'!P73","v":0},{"$f":"'شهر 10'!Q73","v":0},{"$f":"'شهر 10'!R73","v":0},{"$f":"'شهر 10'!S73","v":0},{"$f":"'شهر 10'!T73","v":0},{"$f":"'شهر 10'!U73","v":0},{"$f":"'شهر 10'!V73","v":0},{"$f":"'شهر 10'!W73","v":0},{"$f":"'شهر 10'!X73","v":0},{"$f":"'شهر 10'!Y73","v":0},{"$f":"'شهر 10'!Z73","v":0},{"$f":"'شهر 10'!AA73","v":0},{"$f":"'شهر 10'!AB73","v":0},{"$f":"'شهر 10'!AC73","v":0},{"$f":"'شهر 10'!AD73","v":0},{"$f":"'شهر 10'!AE73","v":0},{"$f":"'شهر 10'!AF73","v":0},{"$f":"'شهر 10'!AG73","v":0},{"$f":"'شهر 10'!AH73","v":0}]
[null,null,null,null,null,null,{"$f":"'شهر 10'!D74","v":0},{"$f":"'شهر 10'!E74","v":0},{"$f":"'شهر 10'!F74","v":0},{"$f":"'شهر 10'!G74","v":0},{"$f":"'شهر 10'!H74","v":0},{"$f":"'شهر 10'!I74","v":0},{"$f":"'شهر 10'!J74","v":0},{"$f":"'شهر 10'!K74","v":0},{"$f":"'شهر 10'!L74","v":0},{"$f":"'شهر 10'!M74","v":0},{"$f":"'شهر 10'!N74","v":0},{"$f":"'شهر 10'!O74","v":0},{"$f":"'شهر 10'!P74","v":0},{"$f":"'شهر 10'!Q74","v":0},{"$f":"'شهر 10'!R74","v":0},{"$f":"'شهر 10'!S74","v":0},{"$f":"'شهر 10'!T74","v":0},{"$f":"'شهر 10'!U74","v":0},{"$f":"'شهر 10'!V74","v":0},{"$f":"'شهر 10'!W74","v":0},{"$f":"'شهر 10'!X74","v":0},{"$f":"'شهر 10'!Y74","v":0},{"$f":"'شهر 10'!Z74","v":0},{"$f":"'شهر 10'!AA74","v":0},{"$f":"'شهر 10'!AB74","v":0},{"$f":"'شهر 10'!AC74","v":0},{"$f":"'شهر 10'!AD74","v":0},{"$f":"'شهر 10'!AE74","v":0},{"$f":"'شهر 10'!AF74","v":0},{"$f":"'شهر 10'!AG74","v":0},{"$f":"'شهر 10'!AH74","v":0}]
[37,"مصطفى حسن (القاهرة)",{"$f":"'شهر 10'!AI75","v":0},{"$f":"'شهر 10'!AJ75","v":0},{"$f":"'شهر 10'!AK75","v":0},null,{"$f":"'شهر 10'!D75","v":0},{"$f":"'شهر 10'!E75","v":0},{"$f":"'شهر 10'!F75","v":0},{"$f":"'شهر 10'!G75","v":0},{"$f":"'شهر 10'!H75","v":0},{"$f":"'شهر 10'!I75","v":0},{"$f":"'شهر 10'!J75","v":0},{"$f":"'شهر 10'!K75","v":0},{"$f":"'شهر 10'!L75","v":0},{"$f":"'شهر 10'!M75","v":0},{"$f":"'شهر 10'!N75","v":0},{"$f":"'شهر 10'!O75","v":0},{"$f":"'شهر 10'!P75","v":0},{"$f":"'شهر 10'!Q75","v":0},{"$f":"'شهر 10'!R75","v":0},{"$f":"'شهر 10'!S75","v":0},{"$f":"'شهر 10'!T75","v":0},{"$f":"'شهر 10'!U75","v":0},{"$f":"'شهر 10'!V75","v":0},{"$f":"'شهر 10'!W75","v":0},{"$f":"'شهر 10'!X75","v":0},{"$f":"'شهر 10'!Y75","v":0},{"$f":"'شهر 10'!Z75","v":0},{"$f":"'شهر 10'!AA75","v":0},{"$f":"'شهر 10'!AB75","v":0},{"$f":"'شهر 10'!AC75","v":0},{"$f":"'شهر 10'!AD75","v":0},{"$f":"'شهر 10'!AE75","v":0},{"$f":"'شهر 10'!AF75","v":0},{"$f":"'شهر 10'!AG75","v":0},{"$f":"'شهر 10'!AH75","v":0}]
[null,null,null,null,null,null,{"$f":"'شهر 10'!D76","v":0},{"$f":"'شهر 10'!E76","v":0},{"$f":"'شهر 10'!F76","v":0},{"$f":"'شهر 10'!G76","v":0},{"$f":"'شهر 10'!H76","v":0},{"$f":"'شهر 10'!I76","v":0},{"$f":"'شهر 10'!J76","v":0},{"$f":"'شهر 10'!K76","v":0},{"$f":"'شهر 10'!L76","v":0},{"$f":"'شهر 10'!M76","v":0},{"$f":"'شهر 10'!N76","v":0},{"$f":"'شهر 10'!O76","v":0},{"$f":"'شهر 10'!P76","v":0},{"$f":"'شهر 10'!Q76","v":0},{"$f":"'شهر 10'!R76","v":0},{"$f":"'شهر 10'!S76","v":0},{"$f":"'شهر 10'!T76","v":0},{"$f":"'شهر 10'!U76","v":0},{"$f":"'شهر 10'!V76","v":0},{"$f":"'شهر 10'!W76","v":0},{"$f":"'شهر 10'!X76","v":0},{"$f":"'شهر 10'!Y76","v":0},{"$f":"'شهر 10'!Z76","v":0},{"$f":"'شهر 10'!AA76","v":0},{"$f":"'شهر 10'!AB76","v":0},{"$f":"'شهر 10'!AC76","v":0},{"$f":"'شهر 10'!AD76","v":0},{"$f":"'شهر 10'!AE76","v":0},{"$f":"'شهر 10'!AF76","v":0},{"$f":"'شهر 10'!AG76","v":0},{"$f":"'شهر 10'!AH76","v":0}]
[38,"سمير صلاح",{"$f":"'شهر 10'!AI77","v":0},{"$f":"'شهر 10'!AJ77","v":0},{"$f":"'شهر 10'!AK77","v":0},null,{"$f":"'شهر 10'!D77","v":0},{"$f":"'شهر 10'!E77","v":0},{"$f":"'شهر 10'!F77","v":0},{"$f":"'شهر 10'!G77","v":0},{"$f":"'شهر 10'!H77","v":0},{"$f":"'شهر 10'!I77","v":0},{"$f":"'شهر 10'!J77","v":0},{"$f":"'شهر 10'!K77","v":0},{"$f":"'شهر 10'!L77","v":0},{"$f":"'شهر 10'!M77","v":0},{"$f":"'شهر 10'!N77","v":0},{"$f":"'شهر 10'!O77","v":0},{"$f":"'شهر 10'!P77","v":0},{"$f":"'شهر 10'!Q77","v":0},{"$f":"'شهر 10'!R77","v":0},{"$f":"'شهر 10'!S77","v":0},{"$f":"'شهر 10'!T77","v":0},{"$f":"'شهر 10'!U77","v":0},{"$f":"'شهر 10'!V77","v":0},{"$f":"'شهر 10'!W77","v":0},{"$f":"'شهر 10'!X77","v":0},{"$f":"'شهر 10'!Y77","v":0},{"$f":"'شهر 10'!Z77","v":0},{"$f":"'شهر 10'!AA77","v":0},{"$f":"'شهر 10'!AB77","v":0},{"$f":"'شهر 10'!AC77","v":0},{"$f":"'شهر 10'!AD77","v":0},{"$f":"'شهر 10'!AE77","v":0},{"$f":"'شهر 10'!AF77","v":0},{"$f":"'شهر 10'!AG77","v":0},{"$f":"'شهر 10'!AH77","v":0}]
[null,null,null,null,null,null,{"$f":"'شهر 10'!D78","v":0},{"$f":"'شهر 10'!E78","v":0},{"$f":"'شهر 10'!F78","v":0},{"$f":"'شهر 10'!G78","v":0},{"$f":"'شهر 10'!H78","v":0},{"$f":"'شهر 10'!I78","v":0},{"$f":"'شهر 10'!J78","v":0},{"$f":"'شهر 10'!K78","v":0},{"$f":"'شهر 10'!L78","v":0},{"$f":"'شهر 10'!M78","v":0},{"$f":"'شهر 10'!N78","v":0},{"$f":"'شهر 10'!O78","v":0},{"$f":"'شهر 10'!P78","v":0},{"$f":"'شهر 10'!Q78","v":0},{"$f":"'شهر 10'!R78","v":0},{"$f":"'شهر 10'!S78","v":0},{"$f":"'شهر 10'!T78","v":0},{"$f":"'شهر 10'!U78","v":0},{"$f":"'شهر 10'!V78","v":0},{"$f":"'شهر 10'!W78","v":0},{"$f":"'شهر 10'!X78","v":0},{"$f":"'شهر 10'!Y78","v":0},{"$f":"'شهر 10'!Z78","v":0},{"$f":"'شهر 10'!AA78","v":0},{"$f":"'شهر 10'!AB78","v":0},{"$f":"'شهر 10'!AC78","v":0},{"$f":"'شهر 10'!AD78","v":0},{"$f":"'شهر 10'!AE78","v":0},{"$f":"'شهر 10'!AF78","v":0},{"$f":"'شهر 10'!AG78","v":0},{"$f":"'شهر 10'!AH78","v":0}]
[39,"رمضان ابراهيم منصور",{"$f":"'شهر 10'!AI79","v":0},{"$f":"'شهر 10'!AJ79","v":0},{"$f":"'شهر 10'!AK79","v":0},null,{"$f":"'شهر 10'!D79","v":0},{"$f":"'شهر 10'!E79","v":0},{"$f":"'شهر 10'!F79","v":0},{"$f":"'شهر 10'!G79","v":0},{"$f":"'شهر 10'!H79","v":0},{"$f":"'شهر 10'!I79","v":0},{"$f":"'شهر 10'!J79","v":0},{"$f":"'شهر 10'!K79","v":0},{"$f":"'شهر 10'!L79","v":0},{"$f":"'شهر 10'!M79","v":0},{"$f":"'شهر 10'!N79","v":0},{"$f":"'شهر 10'!O79","v":0},{"$f":"'شهر 10'!P79","v":0},{"$f":"'شهر 10'!Q79","v":0},{"$f":"'شهر 10'!R79","v":0},{"$f":"'شهر 10'!S79","v":0},{"$f":"'شهر 10'!T79","v":0},{"$f":"'شهر 10'!U79","v":0},{"$f":"'شهر 10'!V79","v":0},{"$f":"'شهر 10'!W79","v":0},{"$f":"'شهر 10'!X79","v":0},{"$f":"'شهر 10'!Y79","v":0},{"$f":"'شهر 10'!Z79","v":0},{"$f":"'شهر 10'!AA79","v":0},{"$f":"'شهر 10'!AB79","v":0},{"$f":"'شهر 10'!AC79","v":0},{"$f":"'شهر 10'!AD79","v":0},{"$f":"'شهر 10'!AE79","v":0},{"$f":"'شهر 10'!AF79","v":0},{"$f":"'شهر 10'!AG79","v":0},{"$f":"'شهر 10'!AH79","v":0}]
[null,null,null,null,null,null,{"$f":"'شهر 10'!D80","v":0},{"$f":"'شهر 10'!E80","v":0},{"$f":"'شهر 10'!F80","v":0},{"$f":"'شهر 10'!G80","v":0},{"$f":"'شهر 10'!H80","v":0},{"$f":"'شهر 10'!I80","v":0},{"$f":"'شهر 10'!J80","v":0},{"$f":"'شهر 10'!K80","v":0},{"$f":"'شهر 10'!L80","v":0},{"$f":"'شهر 10'!M80","v":0},{"$f":"'شهر 10'!N80","v":0},{"$f":"'شهر 10'!O80","v":0},{"$f":"'شهر 10'!P80","v":0},{"$f":"'شهر 10'!Q80","v":0},{"$f":"'شهر 10'!R80","v":0},{"$f":"'شهر 10'!S80","v":0},{"$f":"'شهر 10'!T80","v":0},{"$f":"'شهر 10'!U80","v":0},{"$f":"'شهر 10'!V80","v":0},{"$f":"'شهر 10'!W80","v":0},{"$f":"'شهر 10'!X80","v":0},{"$f":"'شهر 10'!Y80","v":0},{"$f":"'شهر 10'!Z80","v":0},{"$f":"'شهر 10'!AA80","v":0},{"$f":"'شهر 10'!AB80","v":0},{"$f":"'شهر 10'!AC80","v":0},{"$f":"'شهر 10'!AD80","v":0},{"$f":"'شهر 10'!AE80","v":0},{"$f":"'شهر 10'!AF80","v":0},{"$f":"'شهر 10'!AG80","v":0},{"$f":"'شهر 10'!AH80","v":0}]
[40,"يوسف الدكروري",{"$f":"'شهر 10'!AI81","v":0},{"$f":"'شهر 10'!AJ81","v":0},{"$f":"'شهر 10'!AK81","v":0},null,{"$f":"'شهر 10'!D81","v":0},{"$f":"'شهر 10'!E81","v":0},{"$f":"'شهر 10'!F81","v":0},{"$f":"'شهر 10'!G81","v":0},{"$f":"'شهر 10'!H81","v":0},{"$f":"'شهر 10'!I81","v":0},{"$f":"'شهر 10'!J81","v":0},{"$f":"'شهر 10'!K81","v":0},{"$f":"'شهر 10'!L81","v":0},{"$f":"'شهر 10'!M81","v":0},{"$f":"'شهر 10'!N81","v":0},{"$f":"'شهر 10'!O81","v":0},{"$f":"'شهر 10'!P81","v":0},{"$f":"'شهر 10'!Q81","v":0},{"$f":"'شهر 10'!R81","v":0},{"$f":"'شهر 10'!S81","v":0},{"$f":"'شهر 10'!T81","v":0},{"$f":"'شهر 10'!U81","v":0},{"$f":"'شهر 10'!V81","v":0},{"$f":"'شهر 10'!W81","v":0},{"$f":"'شهر 10'!X81","v":0},{"$f":"'شهر 10'!Y81","v":0},{"$f":"'شهر 10'!Z81","v":0},{"$f":"'شهر 10'!AA81","v":0},{"$f":"'شهر 10'!AB81","v":0},{"$f":"'شهر 10'!AC81","v":0},{"$f":"'شهر 10'!AD81","v":0},{"$f":"'شهر 10'!AE81","v":0},{"$f":"'شهر 10'!AF81","v":0},{"$f":"'شهر 10'!AG81","v":0},{"$f":"'شهر 10'!AH81","v":0}]
[null,null,null,null,null,null,{"$f":"'شهر 10'!D82","v":0},{"$f":"'شهر 10'!E82","v":0},{"$f":"'شهر 10'!F82","v":0},{"$f":"'شهر 10'!G82","v":0},{"$f":"'شهر 10'!H82","v":0},{"$f":"'شهر 10'!I82","v":0},{"$f":"'شهر 10'!J82","v":0},{"$f":"'شهر 10'!K82","v":0},{"$f":"'شهر 10'!L82","v":0},{"$f":"'شهر 10'!M82","v":0},{"$f":"'شهر 10'!N82","v":0},{"$f":"'شهر 10'!O82","v":0},{"$f":"'شهر 10'!P82","v":0},{"$f":"'شهر 10'!Q82","v":0},{"$f":"'شهر 10'!R82","v":0},{"$f":"'شهر 10'!S82","v":0},{"$f":"'شهر 10'!T82","v":0},{"$f":"'شهر 10'!U82","v":0},{"$f":"'شهر 10'!V82","v":0},{"$f":"'شهر 10'!W82","v":0},{"$f":"'شهر 10'!X82","v":0},{"$f":"'شهر 10'!Y82","v":0},{"$f":"'شهر 10'!Z82","v":0},{"$f":"'شهر 10'!AA82","v":0},{"$f":"'شهر 10'!AB82","v":0},{"$f":"'شهر 10'!AC82","v":0},{"$f":"'شهر 10'!AD82","v":0},{"$f":"'شهر 10'!AE82","v":0},{"$f":"'شهر 10'!AF82","v":0},{"$f":"'شهر 10'!AG82","v":0},{"$f":"'شهر 10'!AH82","v":0}]
[41,"علاء احمد ابراهيم",{"$f":"'شهر 10'!AI83","v":0},{"$f":"'شهر 10'!AJ83","v":0},{"$f":"'شهر 10'!AK83","v":0},null,{"$f":"'شهر 10'!D83","v":0},{"$f":"'شهر 10'!E83","v":0},{"$f":"'شهر 10'!F83","v":0},{"$f":"'شهر 10'!G83","v":0},{"$f":"'شهر 10'!H83","v":0},{"$f":"'شهر 10'!I83","v":0},{"$f":"'شهر 10'!J83","v":0},{"$f":"'شهر 10'!K83","v":0},{"$f":"'شهر 10'!L83","v":0},{"$f":"'شهر 10'!M83","v":0},{"$f":"'شهر 10'!N83","v":0},{"$f":"'شهر 10'!O83","v":0},{"$f":"'شهر 10'!P83","v":0},{"$f":"'شهر 10'!Q83","v":0},{"$f":"'شهر 10'!R83","v":0},{"$f":"'شهر 10'!S83","v":0},{"$f":"'شهر 10'!T83","v":0},{"$f":"'شهر 10'!U83","v":0},{"$f":"'شهر 10'!V83","v":0},{"$f":"'شهر 10'!W83","v":0},{"$f":"'شهر 10'!X83","v":0},{"$f":"'شهر 10'!Y83","v":0},{"$f":"'شهر 10'!Z83","v":0},{"$f":"'شهر 10'!AA83","v":0},{"$f":"'شهر 10'!AB83","v":0},{"$f":"'شهر 10'!AC83","v":0},{"$f":"'شهر 10'!AD83","v":0},{"$f":"'شهر 10'!AE83","v":0},{"$f":"'شهر 10'!AF83","v":0},{"$f":"'شهر 10'!AG83","v":0},{"$f":"'شهر 10'!AH83","v":0}]
[null,null,null,null,null,null,{"$f":"'شهر 10'!D84","v":0},{"$f":"'شهر 10'!E84","v":0},{"$f":"'شهر 10'!F84","v":0},{"$f":"'شهر 10'!G84","v":0},{"$f":"'شهر 10'!H84","v":0},{"$f":"'شهر 10'!I84","v":0},{"$f":"'شهر 10'!J84","v":0},{"$f":"'شهر 10'!K84","v":0},{"$f":"'شهر 10'!L84","v":0},{"$f":"'شهر 10'!M84","v":0},{"$f":"'شهر 10'!N84","v":0},{"$f":"'شهر 10'!O84","v":0},{"$f":"'شهر 10'!P84","v":0},{"$f":"'شهر 10'!Q84","v":0},{"$f":"'شهر 10'!R84","v":0},{"$f":"'شهر 10'!S84","v":0},{"$f":"'شهر 10'!T84","v":0},{"$f":"'شهر 10'!U84","v":0},{"$f":"'شهر 10'!V84","v":0},{"$f":"'شهر 10'!W84","v":0},{"$f":"'شهر 10'!X84","v":0},{"$f":"'شهر 10'!Y84","v":0},{"$f":"'شهر 10'!Z84","v":0},{"$f":"'شهر 10'!AA84","v":0},{"$f":"'شهر 10'!AB84","v":0},{"$f":"'شهر 10'!AC84","v":0},{"$f":"'شهر 10'!AD84","v":0},{"$f":"'شهر 10'!AE84","v":0},{"$f":"'شهر 10'!AF84","v":0},{"$f":"'شهر 10'!AG84","v":0},{"$f":"'شهر 10'!AH84","v":0}]
[42,"محمد ابراهيم السيد عقل",{"$f":"'شهر 10'!AI85","v":0},{"$f":"'شهر 10'!AJ85","v":0},{"$f":"'شهر 10'!AK85","v":0},null,{"$f":"'شهر 10'!D85","v":0},{"$f":"'شهر 10'!E85","v":0},{"$f":"'شهر 10'!F85","v":0},{"$f":"'شهر 10'!G85","v":0},{"$f":"'شهر 10'!H85","v":0},{"$f":"'شهر 10'!I85","v":0},{"$f":"'شهر 10'!J85","v":0},{"$f":"'شهر 10'!K85","v":0},{"$f":"'شهر 10'!L85","v":0},{"$f":"'شهر 10'!M85","v":0},{"$f":"'شهر 10'!N85","v":0},{"$f":"'شهر 10'!O85","v":0},{"$f":"'شهر 10'!P85","v":0},{"$f":"'شهر 10'!Q85","v":0},{"$f":"'شهر 10'!R85","v":0},{"$f":"'شهر 10'!S85","v":0},{"$f":"'شهر 10'!T85","v":0},{"$f":"'شهر 10'!U85","v":0},{"$f":"'شهر 10'!V85","v":0},{"$f":"'شهر 10'!W85","v":0},{"$f":"'شهر 10'!X85","v":0},{"$f":"'شهر 10'!Y85","v":0},{"$f":"'شهر 10'!Z85","v":0},{"$f":"'شهر 10'!AA85","v":0},{"$f":"'شهر 10'!AB85","v":0},{"$f":"'شهر 10'!AC85","v":0},{"$f":"'شهر 10'!AD85","v":0},{"$f":"'شهر 10'!AE85","v":0},{"$f":"'شهر 10'!AF85","v":0},{"$f":"'شهر 10'!AG85","v":0},{"$f":"'شهر 10'!AH85","v":0}]
[null,null,null,null,null,null,{"$f":"'شهر 10'!D86","v":0},{"$f":"'شهر 10'!E86","v":0},{"$f":"'شهر 10'!F86","v":0},{"$f":"'شهر 10'!G86","v":0},{"$f":"'شهر 10'!H86","v":0},{"$f":"'شهر 10'!I86","v":0},{"$f":"'شهر 10'!J86","v":0},{"$f":"'شهر 10'!K86","v":0},{"$f":"'شهر 10'!L86","v":0},{"$f":"'شهر 10'!M86","v":0},{"$f":"'شهر 10'!N86","v":0},{"$f":"'شهر 10'!O86","v":0},{"$f":"'شهر 10'!P86","v":0},{"$f":"'شهر 10'!Q86","v":0},{"$f":"'شهر 10'!R86","v":0},{"$f":"'شهر 10'!S86","v":0},{"$f":"'شهر 10'!T86","v":0},{"$f":"'شهر 10'!U86","v":0},{"$f":"'شهر 10'!V86","v":0},{"$f":"'شهر 10'!W86","v":0},{"$f":"'شهر 10'!X86","v":0},{"$f":"'شهر 10'!Y86","v":0},{"$f":"'شهر 10'!Z86","v":0},{"$f":"'شهر 10'!AA86","v":0},{"$f":"'شهر 10'!AB86","v":0},{"$f":"'شهر 10'!AC86","v":0},{"$f":"'شهر 10'!AD86","v":0},{"$f":"'شهر 10'!AE86","v":0},{"$f":"'شهر 10'!AF86","v":0},{"$f":"'شهر 10'!AG86","v":0},{"$f":"'شهر 10'!AH86","v":0}]
[43,"السيد رمضان",{"$f":"'شهر 10'!AI87","v":0},{"$f":"'شهر 10'!AJ87","v":0},{"$f":"'شهر 10'!AK87","v":0},null,{"$f":"'شهر 10'!D87","v":0},{"$f":"'شهر 10'!E87","v":0},{"$f":"'شهر 10'!F87","v":0},{"$f":"'شهر 10'!G87","v":0},{"$f":"'شهر 10'!H87","v":0},{"$f":"'شهر 10'!I87","v":0},{"$f":"'شهر 10'!J87","v":0},{"$f":"'شهر 10'!K87","v":0},{"$f":"'شهر 10'!L87","v":0},{"$f":"'شهر 10'!M87","v":0},{"$f":"'شهر 10'!N87","v":0},{"$f":"'شهر 10'!O87","v":0},{"$f":"'شهر 10'!P87","v":0},{"$f":"'شهر 10'!Q87","v":0},{"$f":"'شهر 10'!R87","v":0},{"$f":"'شهر 10'!S87","v":0},{"$f":"'شهر 10'!T87","v":0},{"$f":"'شهر 10'!U87","v":0},{"$f":"'شهر 10'!V87","v":0},{"$f":"'شهر 10'!W87","v":0},{"$f":"'شهر 10'!X87","v":0},{"$f":"'شهر 10'!Y87","v":0},{"$f":"'شهر 10'!Z87","v":0},{"$f":"'شهر 10'!AA87","v":0},{"$f":"'شهر 10'!AB87","v":0},{"$f":"'شهر 10'!AC87","v":0},{"$f":"'شهر 10'!AD87","v":0},{"$f":"'شهر 10'!AE87","v":0},{"$f":"'شهر 10'!AF87","v":0},{"$f":"'شهر 10'!AG87","v":0},{"$f":"'شهر 10'!AH87","v":0}]
[null,null,null,null,null,null,{"$f":"'شهر 10'!D88","v":0},{"$f":"'شهر 10'!E88","v":0},{"$f":"'شهر 10'!F88","v":0},{"$f":"'شهر 10'!G88","v":0},{"$f":"'شهر 10'!H88","v":0},{"$f":"'شهر 10'!I88","v":0},{"$f":"'شهر 10'!J88","v":0},{"$f":"'شهر 10'!K88","v":0},{"$f":"'شهر 10'!L88","v":0},{"$f":"'شهر 10'!M88","v":0},{"$f":"'شهر 10'!N88","v":0},{"$f":"'شهر 10'!O88","v":0},{"$f":"'شهر 10'!P88","v":0},{"$f":"'شهر 10'!Q88","v":0},{"$f":"'شهر 10'!R88","v":0},{"$f":"'شهر 10'!S88","v":0},{"$f":"'شهر 10'!T88","v":0},{"$f":"'شهر 10'!U88","v":0},{"$f":"'شهر 10'!V88","v":0},{"$f":"'شهر 10'!W88","v":0},{"$f":"'شهر 10'!X88","v":0},{"$f":"'شهر 10'!Y88","v":0},{"$f":"'شهر 10'!Z88","v":0},{"$f":"'شهر 10'!AA88","v":0},{"$f":"'شهر 10'!AB88","v":0},{"$f":"'شهر 10'!AC88","v":0},{"$f":"'شهر 10'!AD88","v":0},{"$f":"'شهر 10'!AE88","v":0},{"$f":"'شهر 10'!AF88","v":0},{"$f":"'شهر 10'!AG88","v":0},{"$f":"'شهر 10'!AH88","v":0}]
[44,"فارس شاكوش",{"$f":"'شهر 10'!AI89","v":0},{"$f":"'شهر 10'!AJ89","v":0},{"$f":"'شهر 10'!AK89","v":0},null,{"$f":"'شهر 10'!D89","v":0},{"$f":"'شهر 10'!E89","v":0},{"$f":"'شهر 10'!F89","v":0},{"$f":"'شهر 10'!G89","v":0},{"$f":"'شهر 10'!H89","v":0},{"$f":"'شهر 10'!I89","v":0},{"$f":"'شهر 10'!J89","v":0},{"$f":"'شهر 10'!K89","v":0},{"$f":"'شهر 10'!L89","v":0},{"$f":"'شهر 10'!M89","v":0},{"$f":"'شهر 10'!N89","v":0},{"$f":"'شهر 10'!O89","v":0},{"$f":"'شهر 10'!P89","v":0},{"$f":"'شهر 10'!Q89","v":0},{"$f":"'شهر 10'!R89","v":0},{"$f":"'شهر 10'!S89","v":0},{"$f":"'شهر 10'!T89","v":0},{"$f":"'شهر 10'!U89","v":0},{"$f":"'شهر 10'!V89","v":0},{"$f":"'شهر 10'!W89","v":0},{"$f":"'شهر 10'!X89","v":0},{"$f":"'شهر 10'!Y89","v":0},{"$f":"'شهر 10'!Z89","v":0},{"$f":"'شهر 10'!AA89","v":0},{"$f":"'شهر 10'!AB89","v":0},{"$f":"'شهر 10'!AC89","v":0},{"$f":"'شهر 10'!AD89","v":0},{"$f":"'شهر 10'!AE89","v":0},{"$f":"'شهر 10'!AF89","v":0},{"$f":"'شهر 10'!AG89","v":0},{"$f":"'شهر 10'!AH89","v":0}]
[null,null,null,null,null,null,{"$f":"'شهر 10'!D90","v":0},{"$f":"'شهر 10'!E90","v":0},{"$f":"'شهر 10'!F90","v":0},{"$f":"'شهر 10'!G90","v":0},{"$f":"'شهر 10'!H90","v":0},{"$f":"'شهر 10'!I90","v":0},{"$f":"'شهر 10'!J90","v":0},{"$f":"'شهر 10'!K90","v":0},{"$f":"'شهر 10'!L90","v":0},{"$f":"'شهر 10'!M90","v":0},{"$f":"'شهر 10'!N90","v":0},{"$f":"'شهر 10'!O90","v":0},{"$f":"'شهر 10'!P90","v":0},{"$f":"'شهر 10'!Q90","v":0},{"$f":"'شهر 10'!R90","v":0},{"$f":"'شهر 10'!S90","v":0},{"$f":"'شهر 10'!T90","v":0},{"$f":"'شهر 10'!U90","v":0},{"$f":"'شهر 10'!V90","v":0},{"$f":"'شهر 10'!W90","v":0},{"$f":"'شهر 10'!X90","v":0},{"$f":"'شهر 10'!Y90","v":0},{"$f":"'شهر 10'!Z90","v":0},{"$f":"'شهر 10'!AA90","v":0},{"$f":"'شهر 10'!AB90","v":0},{"$f":"'شهر 10'!AC90","v":0},{"$f":"'شهر 10'!AD90","v":0},{"$f":"'شهر 10'!AE90","v":0},{"$f":"'شهر 10'!AF90","v":0},{"$f":"'شهر 10'!AG90","v":0},{"$f":"'شهر 10'!AH90","v":0}]
[45,"عبده عزت",{"$f":"'شهر 10'!AI91","v":0},{"$f":"'شهر 10'!AJ91","v":0},{"$f":"'شهر 10'!AK91","v":0},null,{"$f":"'شهر 10'!D91","v":0},{"$f":"'شهر 10'!E91","v":0},{"$f":"'شهر 10'!F91","v":0},{"$f":"'شهر 10'!G91","v":0},{"$f":"'شهر 10'!H91","v":0},{"$f":"'شهر 10'!I91","v":0},{"$f":"'شهر 10'!J91","v":0},{"$f":"'شهر 10'!K91","v":0},{"$f":"'شهر 10'!L91","v":0},{"$f":"'شهر 10'!M91","v":0},{"$f":"'شهر 10'!N91","v":0},{"$f":"'شهر 10'!O91","v":0},{"$f":"'شهر 10'!P91","v":0},{"$f":"'شهر 10'!Q91","v":0},{"$f":"'شهر 10'!R91","v":0},{"$f":"'شهر 10'!S91","v":0},{"$f":"'شهر 10'!T91","v":0},{"$f":"'شهر 10'!U91","v":0},{"$f":"'شهر 10'!V91","v":0},{"$f":"'شهر 10'!W91","v":0},{"$f":"'شهر 10'!X91","v":0},{"$f":"'شهر 10'!Y91","v":0},{"$f":"'شهر 10'!Z91","v":0},{"$f":"'شهر 10'!AA91","v":0},{"$f":"'شهر 10'!AB91","v":0},{"$f":"'شهر 10'!AC91","v":0},{"$f":"'شهر 10'!AD91","v":0},{"$f":"'شهر 10'!AE91","v":0},{"$f":"'شهر 10'!AF91","v":0},{"$f":"'شهر 10'!AG91","v":0},{"$f":"'شهر 10'!AH91","v":0}]
[null,null,null,null,null,null,{"$f":"'شهر 10'!D92","v":0},{"$f":"'شهر 10'!E92","v":0},{"$f":"'شهر 10'!F92","v":0},{"$f":"'شهر 10'!G92","v":0},{"$f":"'شهر 10'!H92","v":0},{"$f":"'شهر 10'!I92","v":0},{"$f":"'شهر 10'!J92","v":0},{"$f":"'شهر 10'!K92","v":0},{"$f":"'شهر 10'!L92","v":0},{"$f":"'شهر 10'!M92","v":0},{"$f":"'شهر 10'!N92","v":0},{"$f":"'شهر 10'!O92","v":0},{"$f":"'شهر 10'!P92","v":0},{"$f":"'شهر 10'!Q92","v":0},{"$f":"'شهر 10'!R92","v":0},{"$f":"'شهر 10'!S92","v":0},{"$f":"'شهر 10'!T92","v":0},{"$f":"'شهر 10'!U92","v":0},{"$f":"'شهر 10'!V92","v":0},{"$f":"'شهر 10'!W92","v":0},{"$f":"'شهر 10'!X92","v":0},{"$f":"'شهر 10'!Y92","v":0},{"$f":"'شهر 10'!Z92","v":0},{"$f":"'شهر 10'!AA92","v":0},{"$f":"'شهر 10'!AB92","v":0},{"$f":"'شهر 10'!AC92","v":0},{"$f":"'شهر 10'!AD92","v":0},{"$f":"'شهر 10'!AE92","v":0},{"$f":"'شهر 10'!AF92","v":0},{"$f":"'شهر 10'!AG92","v":0},{"$f":"'شهر 10'!AH92","v":0}]
[46,"السيد نشأت",{"$f":"'شهر 10'!AI93","v":0},{"$f":"'شهر 10'!AJ93","v":0},{"$f":"'شهر 10'!AK93","v":0},null,{"$f":"'شهر 10'!D93","v":0},{"$f":"'شهر 10'!E93","v":0},{"$f":"'شهر 10'!F93","v":0},{"$f":"'شهر 10'!G93","v":0},{"$f":"'شهر 10'!H93","v":0},{"$f":"'شهر 10'!I93","v":0},{"$f":"'شهر 10'!J93","v":0},{"$f":"'شهر 10'!K93","v":0},{"$f":"'شهر 10'!L93","v":0},{"$f":"'شهر 10'!M93","v":0},{"$f":"'شهر 10'!N93","v":0},{"$f":"'شهر 10'!O93","v":0},{"$f":"'شهر 10'!P93","v":0},{"$f":"'شهر 10'!Q93","v":0},{"$f":"'شهر 10'!R93","v":0},{"$f":"'شهر 10'!S93","v":0},{"$f":"'شهر 10'!T93","v":0},{"$f":"'شهر 10'!U93","v":0},{"$f":"'شهر 10'!V93","v":0},{"$f":"'شهر 10'!W93","v":0},{"$f":"'شهر 10'!X93","v":0},{"$f":"'شهر 10'!Y93","v":0},{"$f":"'شهر 10'!Z93","v":0},{"$f":"'شهر 10'!AA93","v":0},{"$f":"'شهر 10'!AB93","v":0},{"$f":"'شهر 10'!AC93","v":0},{"$f":"'شهر 10'!AD93","v":0},{"$f":"'شهر 10'!AE93","v":0},{"$f":"'شهر 10'!AF93","v":0},{"$f":"'شهر 10'!AG93","v":0},{"$f":"'شهر 10'!AH93","v":0}]
[null,null,null,null,null,null,{"$f":"'شهر 10'!D94","v":0},{"$f":"'شهر 10'!E94","v":0},{"$f":"'شهر 10'!F94","v":0},{"$f":"'شهر 10'!G94","v":0},{"$f":"'شهر 10'!H94","v":0},{"$f":"'شهر 10'!I94","v":0},{"$f":"'شهر 10'!J94","v":0},{"$f":"'شهر 10'!K94","v":0},{"$f":"'شهر 10'!L94","v":0},{"$f":"'شهر 10'!M94","v":0},{"$f":"'شهر 10'!N94","v":0},{"$f":"'شهر 10'!O94","v":0},{"$f":"'شهر 10'!P94","v":0},{"$f":"'شهر 10'!Q94","v":0},{"$f":"'شهر 10'!R94","v":0},{"$f":"'شهر 10'!S94","v":0},{"$f":"'شهر 10'!T94","v":0},{"$f":"'شهر 10'!U94","v":0},{"$f":"'شهر 10'!V94","v":0},{"$f":"'شهر 10'!W94","v":0},{"$f":"'شهر 10'!X94","v":0},{"$f":"'شهر 10'!Y94","v":0},{"$f":"'شهر 10'!Z94","v":0},{"$f":"'شهر 10'!AA94","v":0},{"$f":"'شهر 10'!AB94","v":0},{"$f":"'شهر 10'!AC94","v":0},{"$f":"'شهر 10'!AD94","v":0},{"$f":"'شهر 10'!AE94","v":0},{"$f":"'شهر 10'!AF94","v":0},{"$f":"'شهر 10'!AG94","v":0},{"$f":"'شهر 10'!AH94","v":0}]
[47,"محمود ابراهيم",{"$f":"'شهر 10'!AI95","v":0},{"$f":"'شهر 10'!AJ95","v":0},{"$f":"'شهر 10'!AK95","v":0},null,{"$f":"'شهر 10'!D95","v":0},{"$f":"'شهر 10'!E95","v":0},{"$f":"'شهر 10'!F95","v":0},{"$f":"'شهر 10'!G95","v":0},{"$f":"'شهر 10'!H95","v":0},{"$f":"'شهر 10'!I95","v":0},{"$f":"'شهر 10'!J95","v":0},{"$f":"'شهر 10'!K95","v":0},{"$f":"'شهر 10'!L95","v":0},{"$f":"'شهر 10'!M95","v":0},{"$f":"'شهر 10'!N95","v":0},{"$f":"'شهر 10'!O95","v":0},{"$f":"'شهر 10'!P95","v":0},{"$f":"'شهر 10'!Q95","v":0},{"$f":"'شهر 10'!R95","v":0},{"$f":"'شهر 10'!S95","v":0},{"$f":"'شهر 10'!T95","v":0},{"$f":"'شهر 10'!U95","v":0},{"$f":"'شهر 10'!V95","v":0},{"$f":"'شهر 10'!W95","v":0},{"$f":"'شهر 10'!X95","v":0},{"$f":"'شهر 10'!Y95","v":0},{"$f":"'شهر 10'!Z95","v":0},{"$f":"'شهر 10'!AA95","v":0},{"$f":"'شهر 10'!AB95","v":0},{"$f":"'شهر 10'!AC95","v":0},{"$f":"'شهر 10'!AD95","v":0},{"$f":"'شهر 10'!AE95","v":0},{"$f":"'شهر 10'!AF95","v":0},{"$f":"'شهر 10'!AG95","v":0},{"$f":"'شهر 10'!AH95","v":0}]
[null,null,null,null,null,null,{"$f":"'شهر 10'!D96","v":0},{"$f":"'شهر 10'!E96","v":0},{"$f":"'شهر 10'!F96","v":0},{"$f":"'شهر 10'!G96","v":0},{"$f":"'شهر 10'!H96","v":0},{"$f":"'شهر 10'!I96","v":0},{"$f":"'شهر 10'!J96","v":0},{"$f":"'شهر 10'!K96","v":0},{"$f":"'شهر 10'!L96","v":0},{"$f":"'شهر 10'!M96","v":0},{"$f":"'شهر 10'!N96","v":0},{"$f":"'شهر 10'!O96","v":0},{"$f":"'شهر 10'!P96","v":0},{"$f":"'شهر 10'!Q96","v":0},{"$f":"'شهر 10'!R96","v":0},{"$f":"'شهر 10'!S96","v":0},{"$f":"'شهر 10'!T96","v":0},{"$f":"'شهر 10'!U96","v":0},{"$f":"'شهر 10'!V96","v":0},{"$f":"'شهر 10'!W96","v":0},{"$f":"'شهر 10'!X96","v":0},{"$f":"'شهر 10'!Y96","v":0},{"$f":"'شهر 10'!Z96","v":0},{"$f":"'شهر 10'!AA96","v":0},{"$f":"'شهر 10'!AB96","v":0},{"$f":"'شهر 10'!AC96","v":0},{"$f":"'شهر 10'!AD96","v":0},{"$f":"'شهر 10'!AE96","v":0},{"$f":"'شهر 10'!AF96","v":0},{"$f":"'شهر 10'!AG96","v":0},{"$f":"'شهر 10'!AH96","v":0}]
[48,"نصراحمد مسعد",{"$f":"'شهر 10'!AI97","v":0},{"$f":"'شهر 10'!AJ97","v":0},{"$f":"'شهر 10'!AK97","v":0},null,{"$f":"'شهر 10'!D97","v":0},{"$f":"'شهر 10'!E97","v":0},{"$f":"'شهر 10'!F97","v":0},{"$f":"'شهر 10'!G97","v":0},{"$f":"'شهر 10'!H97","v":0},{"$f":"'شهر 10'!I97","v":0},{"$f":"'شهر 10'!J97","v":0},{"$f":"'شهر 10'!K97","v":0},{"$f":"'شهر 10'!L97","v":0},{"$f":"'شهر 10'!M97","v":0},{"$f":"'شهر 10'!N97","v":0},{"$f":"'شهر 10'!O97","v":0},{"$f":"'شهر 10'!P97","v":0},{"$f":"'شهر 10'!Q97","v":0},{"$f":"'شهر 10'!R97","v":0},{"$f":"'شهر 10'!S97","v":0},{"$f":"'شهر 10'!T97","v":0},{"$f":"'شهر 10'!U97","v":0},{"$f":"'شهر 10'!V97","v":0},{"$f":"'شهر 10'!W97","v":0},{"$f":"'شهر 10'!X97","v":0},{"$f":"'شهر 10'!Y97","v":0},{"$f":"'شهر 10'!Z97","v":0},{"$f":"'شهر 10'!AA97","v":0},{"$f":"'شهر 10'!AB97","v":0},{"$f":"'شهر 10'!AC97","v":0},{"$f":"'شهر 10'!AD97","v":0},{"$f":"'شهر 10'!AE97","v":0},{"$f":"'شهر 10'!AF97","v":0},{"$f":"'شهر 10'!AG97","v":0},{"$f":"'شهر 10'!AH97","v":0}]
[null,null,null,null,null,null,{"$f":"'شهر 10'!D98","v":0},{"$f":"'شهر 10'!E98","v":0},{"$f":"'شهر 10'!F98","v":0},{"$f":"'شهر 10'!G98","v":0},{"$f":"'شهر 10'!H98","v":0},{"$f":"'شهر 10'!I98","v":0},{"$f":"'شهر 10'!J98","v":0},{"$f":"'شهر 10'!K98","v":0},{"$f":"'شهر 10'!L98","v":0},{"$f":"'شهر 10'!M98","v":0},{"$f":"'شهر 10'!N98","v":0},{"$f":"'شهر 10'!O98","v":0},{"$f":"'شهر 10'!P98","v":0},{"$f":"'شهر 10'!Q98","v":0},{"$f":"'شهر 10'!R98","v":0},{"$f":"'شهر 10'!S98","v":0},{"$f":"'شهر 10'!T98","v":0},{"$f":"'شهر 10'!U98","v":0},{"$f":"'شهر 10'!V98","v":0},{"$f":"'شهر 10'!W98","v":0},{"$f":"'شهر 10'!X98","v":0},{"$f":"'شهر 10'!Y98","v":0},{"$f":"'شهر 10'!Z98","v":0},{"$f":"'شهر 10'!AA98","v":0},{"$f":"'شهر 10'!AB98","v":0},{"$f":"'شهر 10'!AC98","v":0},{"$f":"'شهر 10'!AD98","v":0},{"$f":"'شهر 10'!AE98","v":0},{"$f":"'شهر 10'!AF98","v":0},{"$f":"'شهر 10'!AG98","v":0},{"$f":"'شهر 10'!AH98","v":0}]
[49,"ايمن جمعة ",{"$f":"'شهر 10'!AI99","v":0},{"$f":"'شهر 10'!AJ99","v":0},{"$f":"'شهر 10'!AK99","v":0},null,{"$f":"'شهر 10'!D99","v":0},{"$f":"'شهر 10'!E99","v":0},{"$f":"'شهر 10'!F99","v":0},{"$f":"'شهر 10'!G99","v":0},{"$f":"'شهر 10'!H99","v":0},{"$f":"'شهر 10'!I99","v":0},{"$f":"'شهر 10'!J99","v":0},{"$f":"'شهر 10'!K99","v":0},{"$f":"'شهر 10'!L99","v":0},{"$f":"'شهر 10'!M99","v":0},{"$f":"'شهر 10'!N99","v":0},{"$f":"'شهر 10'!O99","v":0},{"$f":"'شهر 10'!P99","v":0},{"$f":"'شهر 10'!Q99","v":0},{"$f":"'شهر 10'!R99","v":0},{"$f":"'شهر 10'!S99","v":0},{"$f":"'شهر 10'!T99","v":0},{"$f":"'شهر 10'!U99","v":0},{"$f":"'شهر 10'!V99","v":0},{"$f":"'شهر 10'!W99","v":0},{"$f":"'شهر 10'!X99","v":0},{"$f":"'شهر 10'!Y99","v":0},{"$f":"'شهر 10'!Z99","v":0},{"$f":"'شهر 10'!AA99","v":0},{"$f":"'شهر 10'!AB99","v":0},{"$f":"'شهر 10'!AC99","v":0},{"$f":"'شهر 10'!AD99","v":0},{"$f":"'شهر 10'!AE99","v":0},{"$f":"'شهر 10'!AF99","v":0},{"$f":"'شهر 10'!AG99","v":0},{"$f":"'شهر 10'!AH99","v":0}]
[null,null,null,null,null,null,{"$f":"'شهر 10'!D100","v":0},{"$f":"'شهر 10'!E100","v":0},{"$f":"'شهر 10'!F100","v":0},{"$f":"'شهر 10'!G100","v":0},{"$f":"'شهر 10'!H100","v":0},{"$f":"'شهر 10'!I100","v":0},{"$f":"'شهر 10'!J100","v":0},{"$f":"'شهر 10'!K100","v":0},{"$f":"'شهر 10'!L100","v":0},{"$f":"'شهر 10'!M100","v":0},{"$f":"'شهر 10'!N100","v":0},{"$f":"'شهر 10'!O100","v":0},{"$f":"'شهر 10'!P100","v":0},{"$f":"'شهر 10'!Q100","v":0},{"$f":"'شهر 10'!R100","v":0},{"$f":"'شهر 10'!S100","v":0},{"$f":"'شهر 10'!T100","v":0},{"$f":"'شهر 10'!U100","v":0},{"$f":"'شهر 10'!V100","v":0},{"$f":"'شهر 10'!W100","v":0},{"$f":"'شهر 10'!X100","v":0},{"$f":"'شهر 10'!Y100","v":0},{"$f":"'شهر 10'!Z100","v":0},{"$f":"'شهر 10'!AA100","v":0},{"$f":"'شهر 10'!AB100","v":0},{"$f":"'شهر 10'!AC100","v":0},{"$f":"'شهر 10'!AD100","v":0},{"$f":"'شهر 10'!AE100","v":0},{"$f":"'شهر 10'!AF100","v":0},{"$f":"'شهر 10'!AG100","v":0},{"$f":"'شهر 10'!AH100","v":0}]
[50,null,{"$f":"'شهر 10'!AI101","v":0},{"$f":"'شهر 10'!AJ101","v":0},{"$f":"'شهر 10'!AK101","v":0},null,{"$f":"'شهر 10'!D101","v":0},{"$f":"'شهر 10'!E101","v":0},{"$f":"'شهر 10'!F101","v":0},{"$f":"'شهر 10'!G101","v":0},{"$f":"'شهر 10'!H101","v":0},{"$f":"'شهر 10'!I101","v":0},{"$f":"'شهر 10'!J101","v":0},{"$f":"'شهر 10'!K101","v":0},{"$f":"'شهر 10'!L101","v":0},{"$f":"'شهر 10'!M101","v":0},{"$f":"'شهر 10'!N101","v":0},{"$f":"'شهر 10'!O101","v":0},{"$f":"'شهر 10'!P101","v":0},{"$f":"'شهر 10'!Q101","v":0},{"$f":"'شهر 10'!R101","v":0},{"$f":"'شهر 10'!S101","v":0},{"$f":"'شهر 10'!T101","v":0},{"$f":"'شهر 10'!U101","v":0},{"$f":"'شهر 10'!V101","v":0},{"$f":"'شهر 10'!W101","v":0},{"$f":"'شهر 10'!X101","v":0},{"$f":"'شهر 10'!Y101","v":0},{"$f":"'شهر 10'!Z101","v":0},{"$f":"'شهر 10'!AA101","v":0},{"$f":"'شهر 10'!AB101","v":0},{"$f":"'شهر 10'!AC101","v":0},{"$f":"'شهر 10'!AD101","v":0},{"$f":"'شهر 10'!AE101","v":0},{"$f":"'شهر 10'!AF101","v":0},{"$f":"'شهر 10'!AG101","v":0},{"$f":"'شهر 10'!AH101","v":0}]
[null,null,null,null,null,null,{"$f":"'شهر 10'!D102","v":0},{"$f":"'شهر 10'!E102","v":0},{"$f":"'شهر 10'!F102","v":0},{"$f":"'شهر 10'!G102","v":0},{"$f":"'شهر 10'!H102","v":0},{"$f":"'شهر 10'!I102","v":0},{"$f":"'شهر 10'!J102","v":0},{"$f":"'شهر 10'!K102","v":0},{"$f":"'شهر 10'!L102","v":0},{"$f":"'شهر 10'!M102","v":0},{"$f":"'شهر 10'!N102","v":0},{"$f":"'شهر 10'!O102","v":0},{"$f":"'شهر 10'!P102","v":0},{"$f":"'شهر 10'!Q102","v":0},{"$f":"'شهر 10'!R102","v":0},{"$f":"'شهر 10'!S102","v":0},{"$f":"'شهر 10'!T102","v":0},{"$f":"'شهر 10'!U102","v":0},{"$f":"'شهر 10'!V102","v":0},{"$f":"'شهر 10'!W102","v":0},{"$f":"'شهر 10'!X102","v":0},{"$f":"'شهر 10'!Y102","v":0},{"$f":"'شهر 10'!Z102","v":0},{"$f":"'شهر 10'!AA102","v":0},{"$f":"'شهر 10'!AB102","v":0},{"$f":"'شهر 10'!AC102","v":0},{"$f":"'شهر 10'!AD102","v":0},{"$f":"'شهر 10'!AE102","v":0},{"$f":"'شهر 10'!AF102","v":0},{"$f":"'شهر 10'!AG102","v":0},{"$f":"'شهر 10'!AH102","v":0}]
[51,"حسام محسن ابراهيم",{"$f":"'شهر 10'!AI103","v":0},{"$f":"'شهر 10'!AJ103","v":0},{"$f":"'شهر 10'!AK103","v":0},null,{"$f":"'شهر 10'!D103","v":0},{"$f":"'شهر 10'!E103","v":0},{"$f":"'شهر 10'!F103","v":0},{"$f":"'شهر 10'!G103","v":0},{"$f":"'شهر 10'!H103","v":0},{"$f":"'شهر 10'!I103","v":0},{"$f":"'شهر 10'!J103","v":0},{"$f":"'شهر 10'!K103","v":0},{"$f":"'شهر 10'!L103","v":0},{"$f":"'شهر 10'!M103","v":0},{"$f":"'شهر 10'!N103","v":0},{"$f":"'شهر 10'!O103","v":0},{"$f":"'شهر 10'!P103","v":0},{"$f":"'شهر 10'!Q103","v":0},{"$f":"'شهر 10'!R103","v":0},{"$f":"'شهر 10'!S103","v":0},{"$f":"'شهر 10'!T103","v":0},{"$f":"'شهر 10'!U103","v":0},{"$f":"'شهر 10'!V103","v":0},{"$f":"'شهر 10'!W103","v":0},{"$f":"'شهر 10'!X103","v":0},{"$f":"'شهر 10'!Y103","v":0},{"$f":"'شهر 10'!Z103","v":0},{"$f":"'شهر 10'!AA103","v":0},{"$f":"'شهر 10'!AB103","v":0},{"$f":"'شهر 10'!AC103","v":0},{"$f":"'شهر 10'!AD103","v":0},{"$f":"'شهر 10'!AE103","v":0},{"$f":"'شهر 10'!AF103","v":0},{"$f":"'شهر 10'!AG103","v":0},{"$f":"'شهر 10'!AH103","v":0}]
[null,null,null,null,null,null,{"$f":"'شهر 10'!D104","v":0},{"$f":"'شهر 10'!E104","v":0},{"$f":"'شهر 10'!F104","v":0},{"$f":"'شهر 10'!G104","v":0},{"$f":"'شهر 10'!H104","v":0},{"$f":"'شهر 10'!I104","v":0},{"$f":"'شهر 10'!J104","v":0},{"$f":"'شهر 10'!K104","v":0},{"$f":"'شهر 10'!L104","v":0},{"$f":"'شهر 10'!M104","v":0},{"$f":"'شهر 10'!N104","v":0},{"$f":"'شهر 10'!O104","v":0},{"$f":"'شهر 10'!P104","v":0},{"$f":"'شهر 10'!Q104","v":0},{"$f":"'شهر 10'!R104","v":0},{"$f":"'شهر 10'!S104","v":0},{"$f":"'شهر 10'!T104","v":0},{"$f":"'شهر 10'!U104","v":0},{"$f":"'شهر 10'!V104","v":0},{"$f":"'شهر 10'!W104","v":0},{"$f":"'شهر 10'!X104","v":0},{"$f":"'شهر 10'!Y104","v":0},{"$f":"'شهر 10'!Z104","v":0},{"$f":"'شهر 10'!AA104","v":0},{"$f":"'شهر 10'!AB104","v":0},{"$f":"'شهر 10'!AC104","v":0},{"$f":"'شهر 10'!AD104","v":0},{"$f":"'شهر 10'!AE104","v":0},{"$f":"'شهر 10'!AF104","v":0},{"$f":"'شهر 10'!AG104","v":0},{"$f":"'شهر 10'!AH104","v":0}]
[52,"محمد رمضان ابراهيم",{"$f":"'شهر 10'!AI105","v":0},{"$f":"'شهر 10'!AJ105","v":0},{"$f":"'شهر 10'!AK105","v":0},null,{"$f":"'شهر 10'!D105","v":0},{"$f":"'شهر 10'!E105","v":0},{"$f":"'شهر 10'!F105","v":0},{"$f":"'شهر 10'!G105","v":0},{"$f":"'شهر 10'!H105","v":0},{"$f":"'شهر 10'!I105","v":0},{"$f":"'شهر 10'!J105","v":0},{"$f":"'شهر 10'!K105","v":0},{"$f":"'شهر 10'!L105","v":0},{"$f":"'شهر 10'!M105","v":0},{"$f":"'شهر 10'!N105","v":0},{"$f":"'شهر 10'!O105","v":0},{"$f":"'شهر 10'!P105","v":0},{"$f":"'شهر 10'!Q105","v":0},{"$f":"'شهر 10'!R105","v":0},{"$f":"'شهر 10'!S105","v":0},{"$f":"'شهر 10'!T105","v":0},{"$f":"'شهر 10'!U105","v":0},{"$f":"'شهر 10'!V105","v":0},{"$f":"'شهر 10'!W105","v":0},{"$f":"'شهر 10'!X105","v":0},{"$f":"'شهر 10'!Y105","v":0},{"$f":"'شهر 10'!Z105","v":0},{"$f":"'شهر 10'!AA105","v":0},{"$f":"'شهر 10'!AB105","v":0},{"$f":"'شهر 10'!AC105","v":0},{"$f":"'شهر 10'!AD105","v":0},{"$f":"'شهر 10'!AE105","v":0},{"$f":"'شهر 10'!AF105","v":0},{"$f":"'شهر 10'!AG105","v":0},{"$f":"'شهر 10'!AH105","v":0}]
[null,null,null,null,null,null,{"$f":"'شهر 10'!D106","v":0},{"$f":"'شهر 10'!E106","v":0},{"$f":"'شهر 10'!F106","v":0},{"$f":"'شهر 10'!G106","v":0},{"$f":"'شهر 10'!H106","v":0},{"$f":"'شهر 10'!I106","v":0},{"$f":"'شهر 10'!J106","v":0},{"$f":"'شهر 10'!K106","v":0},{"$f":"'شهر 10'!L106","v":0},{"$f":"'شهر 10'!M106","v":0},{"$f":"'شهر 10'!N106","v":0},{"$f":"'شهر 10'!O106","v":0},{"$f":"'شهر 10'!P106","v":0},{"$f":"'شهر 10'!Q106","v":0},{"$f":"'شهر 10'!R106","v":0},{"$f":"'شهر 10'!S106","v":0},{"$f":"'شهر 10'!T106","v":0},{"$f":"'شهر 10'!U106","v":0},{"$f":"'شهر 10'!V106","v":0},{"$f":"'شهر 10'!W106","v":0},{"$f":"'شهر 10'!X106","v":0},{"$f":"'شهر 10'!Y106","v":0},{"$f":"'شهر 10'!Z106","v":0},{"$f":"'شهر 10'!AA106","v":0},{"$f":"'شهر 10'!AB106","v":0},{"$f":"'شهر 10'!AC106","v":0},{"$f":"'شهر 10'!AD106","v":0},{"$f":"'شهر 10'!AE106","v":0},{"$f":"'شهر 10'!AF106","v":0},{"$f":"'شهر 10'!AG106","v":0},{"$f":"'شهر 10'!AH106","v":0}]
[53,"علام السيد",{"$f":"'شهر 10'!AI107","v":0},{"$f":"'شهر 10'!AJ107","v":0},{"$f":"'شهر 10'!AK107","v":0},null,{"$f":"'شهر 10'!D107","v":0},{"$f":"'شهر 10'!E107","v":0},{"$f":"'شهر 10'!F107","v":0},{"$f":"'شهر 10'!G107","v":0},{"$f":"'شهر 10'!H107","v":0},{"$f":"'شهر 10'!I107","v":0},{"$f":"'شهر 10'!J107","v":0},{"$f":"'شهر 10'!K107","v":0},{"$f":"'شهر 10'!L107","v":0},{"$f":"'شهر 10'!M107","v":0},{"$f":"'شهر 10'!N107","v":0},{"$f":"'شهر 10'!O107","v":0},{"$f":"'شهر 10'!P107","v":0},{"$f":"'شهر 10'!Q107","v":0},{"$f":"'شهر 10'!R107","v":0},{"$f":"'شهر 10'!S107","v":0},{"$f":"'شهر 10'!T107","v":0},{"$f":"'شهر 10'!U107","v":0},{"$f":"'شهر 10'!V107","v":0},{"$f":"'شهر 10'!W107","v":0},{"$f":"'شهر 10'!X107","v":0},{"$f":"'شهر 10'!Y107","v":0},{"$f":"'شهر 10'!Z107","v":0},{"$f":"'شهر 10'!AA107","v":0},{"$f":"'شهر 10'!AB107","v":0},{"$f":"'شهر 10'!AC107","v":0},{"$f":"'شهر 10'!AD107","v":0},{"$f":"'شهر 10'!AE107","v":0},{"$f":"'شهر 10'!AF107","v":0},{"$f":"'شهر 10'!AG107","v":0},{"$f":"'شهر 10'!AH107","v":0}]
[null,null,null,null,null,null,{"$f":"'شهر 10'!D108","v":0},{"$f":"'شهر 10'!E108","v":0},{"$f":"'شهر 10'!F108","v":0},{"$f":"'شهر 10'!G108","v":0},{"$f":"'شهر 10'!H108","v":0},{"$f":"'شهر 10'!I108","v":0},{"$f":"'شهر 10'!J108","v":0},{"$f":"'شهر 10'!K108","v":0},{"$f":"'شهر 10'!L108","v":0},{"$f":"'شهر 10'!M108","v":0},{"$f":"'شهر 10'!N108","v":0},{"$f":"'شهر 10'!O108","v":0},{"$f":"'شهر 10'!P108","v":0},{"$f":"'شهر 10'!Q108","v":0},{"$f":"'شهر 10'!R108","v":0},{"$f":"'شهر 10'!S108","v":0},{"$f":"'شهر 10'!T108","v":0},{"$f":"'شهر 10'!U108","v":0},{"$f":"'شهر 10'!V108","v":0},{"$f":"'شهر 10'!W108","v":0},{"$f":"'شهر 10'!X108","v":0},{"$f":"'شهر 10'!Y108","v":0},{"$f":"'شهر 10'!Z108","v":0},{"$f":"'شهر 10'!AA108","v":0},{"$f":"'شهر 10'!AB108","v":0},{"$f":"'شهر 10'!AC108","v":0},{"$f":"'شهر 10'!AD108","v":0},{"$f":"'شهر 10'!AE108","v":0},{"$f":"'شهر 10'!AF108","v":0},{"$f":"'شهر 10'!AG108","v":0},{"$f":"'شهر 10'!AH108","v":0}]
[54,"محمد سكر",{"$f":"'شهر 10'!AI109","v":0},{"$f":"'شهر 10'!AJ109","v":0},{"$f":"'شهر 10'!AK109","v":0},null,{"$f":"'شهر 10'!D109","v":0},{"$f":"'شهر 10'!E109","v":0},{"$f":"'شهر 10'!F109","v":0},{"$f":"'شهر 10'!G109","v":0},{"$f":"'شهر 10'!H109","v":0},{"$f":"'شهر 10'!I109","v":0},{"$f":"'شهر 10'!J109","v":0},{"$f":"'شهر 10'!K109","v":0},{"$f":"'شهر 10'!L109","v":0},{"$f":"'شهر 10'!M109","v":0},{"$f":"'شهر 10'!N109","v":0},{"$f":"'شهر 10'!O109","v":0},{"$f":"'شهر 10'!P109","v":0},{"$f":"'شهر 10'!Q109","v":0},{"$f":"'شهر 10'!R109","v":0},{"$f":"'شهر 10'!S109","v":0},{"$f":"'شهر 10'!T109","v":0},{"$f":"'شهر 10'!U109","v":0},{"$f":"'شهر 10'!V109","v":0},{"$f":"'شهر 10'!W109","v":0},{"$f":"'شهر 10'!X109","v":0},{"$f":"'شهر 10'!Y109","v":0},{"$f":"'شهر 10'!Z109","v":0},{"$f":"'شهر 10'!AA109","v":0},{"$f":"'شهر 10'!AB109","v":0},{"$f":"'شهر 10'!AC109","v":0},{"$f":"'شهر 10'!AD109","v":0},{"$f":"'شهر 10'!AE109","v":0},{"$f":"'شهر 10'!AF109","v":0},{"$f":"'شهر 10'!AG109","v":0},{"$f":"'شهر 10'!AH109","v":0}]
[null,null,null,null,null,null,{"$f":"'شهر 10'!D110","v":0},{"$f":"'شهر 10'!E110","v":0},{"$f":"'شهر 10'!F110","v":0},{"$f":"'شهر 10'!G110","v":0},{"$f":"'شهر 10'!H110","v":0},{"$f":"'شهر 10'!I110","v":0},{"$f":"'شهر 10'!J110","v":0},{"$f":"'شهر 10'!K110","v":0},{"$f":"'شهر 10'!L110","v":0},{"$f":"'شهر 10'!M110","v":0},{"$f":"'شهر 10'!N110","v":0},{"$f":"'شهر 10'!O110","v":0},{"$f":"'شهر 10'!P110","v":0},{"$f":"'شهر 10'!Q110","v":0},{"$f":"'شهر 10'!R110","v":0},{"$f":"'شهر 10'!S110","v":0},{"$f":"'شهر 10'!T110","v":0},{"$f":"'شهر 10'!U110","v":0},{"$f":"'شهر 10'!V110","v":0},{"$f":"'شهر 10'!W110","v":0},{"$f":"'شهر 10'!X110","v":0},{"$f":"'شهر 10'!Y110","v":0},{"$f":"'شهر 10'!Z110","v":0},{"$f":"'شهر 10'!AA110","v":0},{"$f":"'شهر 10'!AB110","v":0},{"$f":"'شهر 10'!AC110","v":0},{"$f":"'شهر 10'!AD110","v":0},{"$f":"'شهر 10'!AE110","v":0},{"$f":"'شهر 10'!AF110","v":0},{"$f":"'شهر 10'!AG110","v":0},{"$f":"'شهر 10'!AH110","v":0}]
[55,"محمد الدمرداش",{"$f":"'شهر 10'!AI111","v":0},{"$f":"'شهر 10'!AJ111","v":0},{"$f":"'شهر 10'!AK111","v":0},null,{"$f":"'شهر 10'!D111","v":0},{"$f":"'شهر 10'!E111","v":0},{"$f":"'شهر 10'!F111","v":0},{"$f":"'شهر 10'!G111","v":0},{"$f":"'شهر 10'!H111","v":0},{"$f":"'شهر 10'!I111","v":0},{"$f":"'شهر 10'!J111","v":0},{"$f":"'شهر 10'!K111","v":0},{"$f":"'شهر 10'!L111","v":0},{"$f":"'شهر 10'!M111","v":0},{"$f":"'شهر 10'!N111","v":0},{"$f":"'شهر 10'!O111","v":0},{"$f":"'شهر 10'!P111","v":0},{"$f":"'شهر 10'!Q111","v":0},{"$f":"'شهر 10'!R111","v":0},{"$f":"'شهر 10'!S111","v":0},{"$f":"'شهر 10'!T111","v":0},{"$f":"'شهر 10'!U111","v":0},{"$f":"'شهر 10'!V111","v":0},{"$f":"'شهر 10'!W111","v":0},{"$f":"'شهر 10'!X111","v":0},{"$f":"'شهر 10'!Y111","v":0},{"$f":"'شهر 10'!Z111","v":0},{"$f":"'شهر 10'!AA111","v":0},{"$f":"'شهر 10'!AB111","v":0},{"$f":"'شهر 10'!AC111","v":0},{"$f":"'شهر 10'!AD111","v":0},{"$f":"'شهر 10'!AE111","v":0},{"$f":"'شهر 10'!AF111","v":0},{"$f":"'شهر 10'!AG111","v":0},{"$f":"'شهر 10'!AH111","v":0}]
[null,null,null,null,null,null,{"$f":"'شهر 10'!D112","v":0},{"$f":"'شهر 10'!E112","v":0},{"$f":"'شهر 10'!F112","v":0},{"$f":"'شهر 10'!G112","v":0},{"$f":"'شهر 10'!H112","v":0},{"$f":"'شهر 10'!I112","v":0},{"$f":"'شهر 10'!J112","v":0},{"$f":"'شهر 10'!K112","v":0},{"$f":"'شهر 10'!L112","v":0},{"$f":"'شهر 10'!M112","v":0},{"$f":"'شهر 10'!N112","v":0},{"$f":"'شهر 10'!O112","v":0},{"$f":"'شهر 10'!P112","v":0},{"$f":"'شهر 10'!Q112","v":0},{"$f":"'شهر 10'!R112","v":0},{"$f":"'شهر 10'!S112","v":0},{"$f":"'شهر 10'!T112","v":0},{"$f":"'شهر 10'!U112","v":0},{"$f":"'شهر 10'!V112","v":0},{"$f":"'شهر 10'!W112","v":0},{"$f":"'شهر 10'!X112","v":0},{"$f":"'شهر 10'!Y112","v":0},{"$f":"'شهر 10'!Z112","v":0},{"$f":"'شهر 10'!AA112","v":0},{"$f":"'شهر 10'!AB112","v":0},{"$f":"'شهر 10'!AC112","v":0},{"$f":"'شهر 10'!AD112","v":0},{"$f":"'شهر 10'!AE112","v":0},{"$f":"'شهر 10'!AF112","v":0},{"$f":"'شهر 10'!AG112","v":0},{"$f":"'شهر 10'!AH112","v":0}]
[56,"عيد المتولى",{"$f":"'شهر 10'!AI113","v":0},{"$f":"'شهر 10'!AJ113","v":0},{"$f":"'شهر 10'!AK113","v":0},null,{"$f":"'شهر 10'!D113","v":0},{"$f":"'شهر 10'!E113","v":0},{"$f":"'شهر 10'!F113","v":0},{"$f":"'شهر 10'!G113","v":0},{"$f":"'شهر 10'!H113","v":0},{"$f":"'شهر 10'!I113","v":0},{"$f":"'شهر 10'!J113","v":0},{"$f":"'شهر 10'!K113","v":0},{"$f":"'شهر 10'!L113","v":0},{"$f":"'شهر 10'!M113","v":0},{"$f":"'شهر 10'!N113","v":0},{"$f":"'شهر 10'!O113","v":0},{"$f":"'شهر 10'!P113","v":0},{"$f":"'شهر 10'!Q113","v":0},{"$f":"'شهر 10'!R113","v":0},{"$f":"'شهر 10'!S113","v":0},{"$f":"'شهر 10'!T113","v":0},{"$f":"'شهر 10'!U113","v":0},{"$f":"'شهر 10'!V113","v":0},{"$f":"'شهر 10'!W113","v":0},{"$f":"'شهر 10'!X113","v":0},{"$f":"'شهر 10'!Y113","v":0},{"$f":"'شهر 10'!Z113","v":0},{"$f":"'شهر 10'!AA113","v":0},{"$f":"'شهر 10'!AB113","v":0},{"$f":"'شهر 10'!AC113","v":0},{"$f":"'شهر 10'!AD113","v":0},{"$f":"'شهر 10'!AE113","v":0},{"$f":"'شهر 10'!AF113","v":0},{"$f":"'شهر 10'!AG113","v":0},{"$f":"'شهر 10'!AH113","v":0}]
[null,null,null,null,null,null,{"$f":"'شهر 10'!D114","v":0},{"$f":"'شهر 10'!E114","v":0},{"$f":"'شهر 10'!F114","v":0},{"$f":"'شهر 10'!G114","v":0},{"$f":"'شهر 10'!H114","v":0},{"$f":"'شهر 10'!I114","v":0},{"$f":"'شهر 10'!J114","v":0},{"$f":"'شهر 10'!K114","v":0},{"$f":"'شهر 10'!L114","v":0},{"$f":"'شهر 10'!M114","v":0},{"$f":"'شهر 10'!N114","v":0},{"$f":"'شهر 10'!O114","v":0},{"$f":"'شهر 10'!P114","v":0},{"$f":"'شهر 10'!Q114","v":0},{"$f":"'شهر 10'!R114","v":0},{"$f":"'شهر 10'!S114","v":0},{"$f":"'شهر 10'!T114","v":0},{"$f":"'شهر 10'!U114","v":0},{"$f":"'شهر 10'!V114","v":0},{"$f":"'شهر 10'!W114","v":0},{"$f":"'شهر 10'!X114","v":0},{"$f":"'شهر 10'!Y114","v":0},{"$f":"'شهر 10'!Z114","v":0},{"$f":"'شهر 10'!AA114","v":0},{"$f":"'شهر 10'!AB114","v":0},{"$f":"'شهر 10'!AC114","v":0},{"$f":"'شهر 10'!AD114","v":0},{"$f":"'شهر 10'!AE114","v":0},{"$f":"'شهر 10'!AF114","v":0},{"$f":"'شهر 10'!AG114","v":0},{"$f":"'شهر 10'!AH114","v":0}]
[57,"سمير الشحات",{"$f":"'شهر 10'!AI115","v":0},{"$f":"'شهر 10'!AJ115","v":0},{"$f":"'شهر 10'!AK115","v":0},null,{"$f":"'شهر 10'!D115","v":0},{"$f":"'شهر 10'!E115","v":0},{"$f":"'شهر 10'!F115","v":0},{"$f":"'شهر 10'!G115","v":0},{"$f":"'شهر 10'!H115","v":0},{"$f":"'شهر 10'!I115","v":0},{"$f":"'شهر 10'!J115","v":0},{"$f":"'شهر 10'!K115","v":0},{"$f":"'شهر 10'!L115","v":0},{"$f":"'شهر 10'!M115","v":0},{"$f":"'شهر 10'!N115","v":0},{"$f":"'شهر 10'!O115","v":0},{"$f":"'شهر 10'!P115","v":0},{"$f":"'شهر 10'!Q115","v":0},{"$f":"'شهر 10'!R115","v":0},{"$f":"'شهر 10'!S115","v":0},{"$f":"'شهر 10'!T115","v":0},{"$f":"'شهر 10'!U115","v":0},{"$f":"'شهر 10'!V115","v":0},{"$f":"'شهر 10'!W115","v":0},{"$f":"'شهر 10'!X115","v":0},{"$f":"'شهر 10'!Y115","v":0},{"$f":"'شهر 10'!Z115","v":0},{"$f":"'شهر 10'!AA115","v":0},{"$f":"'شهر 10'!AB115","v":0},{"$f":"'شهر 10'!AC115","v":0},{"$f":"'شهر 10'!AD115","v":0},{"$f":"'شهر 10'!AE115","v":0},{"$f":"'شهر 10'!AF115","v":0},{"$f":"'شهر 10'!AG115","v":0},{"$f":"'شهر 10'!AH115","v":0}]
[null,null,null,null,null,null,{"$f":"'شهر 10'!D116","v":0},{"$f":"'شهر 10'!E116","v":0},{"$f":"'شهر 10'!F116","v":0},{"$f":"'شهر 10'!G116","v":0},{"$f":"'شهر 10'!H116","v":0},{"$f":"'شهر 10'!I116","v":0},{"$f":"'شهر 10'!J116","v":0},{"$f":"'شهر 10'!K116","v":0},{"$f":"'شهر 10'!L116","v":0},{"$f":"'شهر 10'!M116","v":0},{"$f":"'شهر 10'!N116","v":0},{"$f":"'شهر 10'!O116","v":0},{"$f":"'شهر 10'!P116","v":0},{"$f":"'شهر 10'!Q116","v":0},{"$f":"'شهر 10'!R116","v":0},{"$f":"'شهر 10'!S116","v":0},{"$f":"'شهر 10'!T116","v":0},{"$f":"'شهر 10'!U116","v":0},{"$f":"'شهر 10'!V116","v":0},{"$f":"'شهر 10'!W116","v":0},{"$f":"'شهر 10'!X116","v":0},{"$f":"'شهر 10'!Y116","v":0},{"$f":"'شهر 10'!Z116","v":0},{"$f":"'شهر 10'!AA116","v":0},{"$f":"'شهر 10'!AB116","v":0},{"$f":"'شهر 10'!AC116","v":0},{"$f":"'شهر 10'!AD116","v":0},{"$f":"'شهر 10'!AE116","v":0},{"$f":"'شهر 10'!AF116","v":0},{"$f":"'شهر 10'!AG116","v":0},{"$f":"'شهر 10'!AH116","v":0}]
[58,"حسام حمدان",{"$f":"'شهر 10'!AI117","v":0},{"$f":"'شهر 10'!AJ117","v":0},{"$f":"'شهر 10'!AK117","v":0},null,{"$f":"'شهر 10'!D117","v":0},{"$f":"'شهر 10'!E117","v":0},{"$f":"'شهر 10'!F117","v":0},{"$f":"'شهر 10'!G117","v":0},{"$f":"'شهر 10'!H117","v":0},{"$f":"'شهر 10'!I117","v":0},{"$f":"'شهر 10'!J117","v":0},{"$f":"'شهر 10'!K117","v":0},{"$f":"'شهر 10'!L117","v":0},{"$f":"'شهر 10'!M117","v":0},{"$f":"'شهر 10'!N117","v":0},{"$f":"'شهر 10'!O117","v":0},{"$f":"'شهر 10'!P117","v":0},{"$f":"'شهر 10'!Q117","v":0},{"$f":"'شهر 10'!R117","v":0},{"$f":"'شهر 10'!S117","v":0},{"$f":"'شهر 10'!T117","v":0},{"$f":"'شهر 10'!U117","v":0},{"$f":"'شهر 10'!V117","v":0},{"$f":"'شهر 10'!W117","v":0},{"$f":"'شهر 10'!X117","v":0},{"$f":"'شهر 10'!Y117","v":0},{"$f":"'شهر 10'!Z117","v":0},{"$f":"'شهر 10'!AA117","v":0},{"$f":"'شهر 10'!AB117","v":0},{"$f":"'شهر 10'!AC117","v":0},{"$f":"'شهر 10'!AD117","v":0},{"$f":"'شهر 10'!AE117","v":0},{"$f":"'شهر 10'!AF117","v":0},{"$f":"'شهر 10'!AG117","v":0},{"$f":"'شهر 10'!AH117","v":0}]
[null,null,null,null,null,null,{"$f":"'شهر 10'!D118","v":0},{"$f":"'شهر 10'!E118","v":0},{"$f":"'شهر 10'!F118","v":0},{"$f":"'شهر 10'!G118","v":0},{"$f":"'شهر 10'!H118","v":0},{"$f":"'شهر 10'!I118","v":0},{"$f":"'شهر 10'!J118","v":0},{"$f":"'شهر 10'!K118","v":0},{"$f":"'شهر 10'!L118","v":0},{"$f":"'شهر 10'!M118","v":0},{"$f":"'شهر 10'!N118","v":0},{"$f":"'شهر 10'!O118","v":0},{"$f":"'شهر 10'!P118","v":0},{"$f":"'شهر 10'!Q118","v":0},{"$f":"'شهر 10'!R118","v":0},{"$f":"'شهر 10'!S118","v":0},{"$f":"'شهر 10'!T118","v":0},{"$f":"'شهر 10'!U118","v":0},{"$f":"'شهر 10'!V118","v":0},{"$f":"'شهر 10'!W118","v":0},{"$f":"'شهر 10'!X118","v":0},{"$f":"'شهر 10'!Y118","v":0},{"$f":"'شهر 10'!Z118","v":0},{"$f":"'شهر 10'!AA118","v":0},{"$f":"'شهر 10'!AB118","v":0},{"$f":"'شهر 10'!AC118","v":0},{"$f":"'شهر 10'!AD118","v":0},{"$f":"'شهر 10'!AE118","v":0},{"$f":"'شهر 10'!AF118","v":0},{"$f":"'شهر 10'!AG118","v":0},{"$f":"'شهر 10'!AH118","v":0}]
[59,"رمضان الخميسى",{"$f":"'شهر 10'!AI119","v":0},{"$f":"'شهر 10'!AJ119","v":0},{"$f":"'شهر 10'!AK119","v":0},null,{"$f":"'شهر 10'!D119","v":0},{"$f":"'شهر 10'!E119","v":0},{"$f":"'شهر 10'!F119","v":0},{"$f":"'شهر 10'!G119","v":0},{"$f":"'شهر 10'!H119","v":0},{"$f":"'شهر 10'!I119","v":0},{"$f":"'شهر 10'!J119","v":0},{"$f":"'شهر 10'!K119","v":0},{"$f":"'شهر 10'!L119","v":0},{"$f":"'شهر 10'!M119","v":0},{"$f":"'شهر 10'!N119","v":0},{"$f":"'شهر 10'!O119","v":0},{"$f":"'شهر 10'!P119","v":0},{"$f":"'شهر 10'!Q119","v":0},{"$f":"'شهر 10'!R119","v":0},{"$f":"'شهر 10'!S119","v":0},{"$f":"'شهر 10'!T119","v":0},{"$f":"'شهر 10'!U119","v":0},{"$f":"'شهر 10'!V119","v":0},{"$f":"'شهر 10'!W119","v":0},{"$f":"'شهر 10'!X119","v":0},{"$f":"'شهر 10'!Y119","v":0},{"$f":"'شهر 10'!Z119","v":0},{"$f":"'شهر 10'!AA119","v":0},{"$f":"'شهر 10'!AB119","v":0},{"$f":"'شهر 10'!AC119","v":0},{"$f":"'شهر 10'!AD119","v":0},{"$f":"'شهر 10'!AE119","v":0},{"$f":"'شهر 10'!AF119","v":0},{"$f":"'شهر 10'!AG119","v":0},{"$f":"'شهر 10'!AH119","v":0}]
[null,null,null,null,null,null,{"$f":"'شهر 10'!D120","v":0},{"$f":"'شهر 10'!E120","v":0},{"$f":"'شهر 10'!F120","v":0},{"$f":"'شهر 10'!G120","v":0},{"$f":"'شهر 10'!H120","v":0},{"$f":"'شهر 10'!I120","v":0},{"$f":"'شهر 10'!J120","v":0},{"$f":"'شهر 10'!K120","v":0},{"$f":"'شهر 10'!L120","v":0},{"$f":"'شهر 10'!M120","v":0},{"$f":"'شهر 10'!N120","v":0},{"$f":"'شهر 10'!O120","v":0},{"$f":"'شهر 10'!P120","v":0},{"$f":"'شهر 10'!Q120","v":0},{"$f":"'شهر 10'!R120","v":0},{"$f":"'شهر 10'!S120","v":0},{"$f":"'شهر 10'!T120","v":0},{"$f":"'شهر 10'!U120","v":0},{"$f":"'شهر 10'!V120","v":0},{"$f":"'شهر 10'!W120","v":0},{"$f":"'شهر 10'!X120","v":0},{"$f":"'شهر 10'!Y120","v":0},{"$f":"'شهر 10'!Z120","v":0},{"$f":"'شهر 10'!AA120","v":0},{"$f":"'شهر 10'!AB120","v":0},{"$f":"'شهر 10'!AC120","v":0},{"$f":"'شهر 10'!AD120","v":0},{"$f":"'شهر 10'!AE120","v":0},{"$f":"'شهر 10'!AF120","v":0},{"$f":"'شهر 10'!AG120","v":0},{"$f":"'شهر 10'!AH120","v":0}]
[60,"السيد ذاكى",{"$f":"'شهر 10'!AI121","v":0},{"$f":"'شهر 10'!AJ121","v":0},{"$f":"'شهر 10'!AK121","v":0},null,{"$f":"'شهر 10'!D121","v":0},{"$f":"'شهر 10'!E121","v":0},{"$f":"'شهر 10'!F121","v":0},{"$f":"'شهر 10'!G121","v":0},{"$f":"'شهر 10'!H121","v":0},{"$f":"'شهر 10'!I121","v":0},{"$f":"'شهر 10'!J121","v":0},{"$f":"'شهر 10'!K121","v":0},{"$f":"'شهر 10'!L121","v":0},{"$f":"'شهر 10'!M121","v":0},{"$f":"'شهر 10'!N121","v":0},{"$f":"'شهر 10'!O121","v":0},{"$f":"'شهر 10'!P121","v":0},{"$f":"'شهر 10'!Q121","v":0},{"$f":"'شهر 10'!R121","v":0},{"$f":"'شهر 10'!S121","v":0},{"$f":"'شهر 10'!T121","v":0},{"$f":"'شهر 10'!U121","v":0},{"$f":"'شهر 10'!V121","v":0},{"$f":"'شهر 10'!W121","v":0},{"$f":"'شهر 10'!X121","v":0},{"$f":"'شهر 10'!Y121","v":0},{"$f":"'شهر 10'!Z121","v":0},{"$f":"'شهر 10'!AA121","v":0},{"$f":"'شهر 10'!AB121","v":0},{"$f":"'شهر 10'!AC121","v":0},{"$f":"'شهر 10'!AD121","v":0},{"$f":"'شهر 10'!AE121","v":0},{"$f":"'شهر 10'!AF121","v":0},{"$f":"'شهر 10'!AG121","v":0},{"$f":"'شهر 10'!AH121","v":0}]
[null,null,null,null,null,null,{"$f":"'شهر 10'!D122","v":0},{"$f":"'شهر 10'!E122","v":0},{"$f":"'شهر 10'!F122","v":0},{"$f":"'شهر 10'!G122","v":0},{"$f":"'شهر 10'!H122","v":0},{"$f":"'شهر 10'!I122","v":0},{"$f":"'شهر 10'!J122","v":0},{"$f":"'شهر 10'!K122","v":0},{"$f":"'شهر 10'!L122","v":0},{"$f":"'شهر 10'!M122","v":0},{"$f":"'شهر 10'!N122","v":0},{"$f":"'شهر 10'!O122","v":0},{"$f":"'شهر 10'!P122","v":0},{"$f":"'شهر 10'!Q122","v":0},{"$f":"'شهر 10'!R122","v":0},{"$f":"'شهر 10'!S122","v":0},{"$f":"'شهر 10'!T122","v":0},{"$f":"'شهر 10'!U122","v":0},{"$f":"'شهر 10'!V122","v":0},{"$f":"'شهر 10'!W122","v":0},{"$f":"'شهر 10'!X122","v":0},{"$f":"'شهر 10'!Y122","v":0},{"$f":"'شهر 10'!Z122","v":0},{"$f":"'شهر 10'!AA122","v":0},{"$f":"'شهر 10'!AB122","v":0},{"$f":"'شهر 10'!AC122","v":0},{"$f":"'شهر 10'!AD122","v":0},{"$f":"'شهر 10'!AE122","v":0},{"$f":"'شهر 10'!AF122","v":0},{"$f":"'شهر 10'!AG122","v":0},{"$f":"'شهر 10'!AH122","v":0}]
[61,"احمد فكرى",{"$f":"'شهر 10'!AI123","v":0},{"$f":"'شهر 10'!AJ123","v":0},{"$f":"'شهر 10'!AK123","v":0},null,{"$f":"'شهر 10'!D123","v":0},{"$f":"'شهر 10'!E123","v":0},{"$f":"'شهر 10'!F123","v":0},{"$f":"'شهر 10'!G123","v":0},{"$f":"'شهر 10'!H123","v":0},{"$f":"'شهر 10'!I123","v":0},{"$f":"'شهر 10'!J123","v":0},{"$f":"'شهر 10'!K123","v":0},{"$f":"'شهر 10'!L123","v":0},{"$f":"'شهر 10'!M123","v":0},{"$f":"'شهر 10'!N123","v":0},{"$f":"'شهر 10'!O123","v":0},{"$f":"'شهر 10'!P123","v":0},{"$f":"'شهر 10'!Q123","v":0},{"$f":"'شهر 10'!R123","v":0},{"$f":"'شهر 10'!S123","v":0},{"$f":"'شهر 10'!T123","v":0},{"$f":"'شهر 10'!U123","v":0},{"$f":"'شهر 10'!V123","v":0},{"$f":"'شهر 10'!W123","v":0},{"$f":"'شهر 10'!X123","v":0},{"$f":"'شهر 10'!Y123","v":0},{"$f":"'شهر 10'!Z123","v":0},{"$f":"'شهر 10'!AA123","v":0},{"$f":"'شهر 10'!AB123","v":0},{"$f":"'شهر 10'!AC123","v":0},{"$f":"'شهر 10'!AD123","v":0},{"$f":"'شهر 10'!AE123","v":0},{"$f":"'شهر 10'!AF123","v":0},{"$f":"'شهر 10'!AG123","v":0},{"$f":"'شهر 10'!AH123","v":0}]
[null,null,null,null,null,null,{"$f":"'شهر 10'!D124","v":0},{"$f":"'شهر 10'!E124","v":0},{"$f":"'شهر 10'!F124","v":0},{"$f":"'شهر 10'!G124","v":0},{"$f":"'شهر 10'!H124","v":0},{"$f":"'شهر 10'!I124","v":0},{"$f":"'شهر 10'!J124","v":0},{"$f":"'شهر 10'!K124","v":0},{"$f":"'شهر 10'!L124","v":0},{"$f":"'شهر 10'!M124","v":0},{"$f":"'شهر 10'!N124","v":0},{"$f":"'شهر 10'!O124","v":0},{"$f":"'شهر 10'!P124","v":0},{"$f":"'شهر 10'!Q124","v":0},{"$f":"'شهر 10'!R124","v":0},{"$f":"'شهر 10'!S124","v":0},{"$f":"'شهر 10'!T124","v":0},{"$f":"'شهر 10'!U124","v":0},{"$f":"'شهر 10'!V124","v":0},{"$f":"'شهر 10'!W124","v":0},{"$f":"'شهر 10'!X124","v":0},{"$f":"'شهر 10'!Y124","v":0},{"$f":"'شهر 10'!Z124","v":0},{"$f":"'شهر 10'!AA124","v":0},{"$f":"'شهر 10'!AB124","v":0},{"$f":"'شهر 10'!AC124","v":0},{"$f":"'شهر 10'!AD124","v":0},{"$f":"'شهر 10'!AE124","v":0},{"$f":"'شهر 10'!AF124","v":0},{"$f":"'شهر 10'!AG124","v":0},{"$f":"'شهر 10'!AH124","v":0}]
[62,"محمد سعد",{"$f":"'شهر 10'!AI125","v":0},{"$f":"'شهر 10'!AJ125","v":0},{"$f":"'شهر 10'!AK125","v":0},null,{"$f":"'شهر 10'!D125","v":0},{"$f":"'شهر 10'!E125","v":0},{"$f":"'شهر 10'!F125","v":0},{"$f":"'شهر 10'!G125","v":0},{"$f":"'شهر 10'!H125","v":0},{"$f":"'شهر 10'!I125","v":0},{"$f":"'شهر 10'!J125","v":0},{"$f":"'شهر 10'!K125","v":0},{"$f":"'شهر 10'!L125","v":0},{"$f":"'شهر 10'!M125","v":0},{"$f":"'شهر 10'!N125","v":0},{"$f":"'شهر 10'!O125","v":0},{"$f":"'شهر 10'!P125","v":0},{"$f":"'شهر 10'!Q125","v":0},{"$f":"'شهر 10'!R125","v":0},{"$f":"'شهر 10'!S125","v":0},{"$f":"'شهر 10'!T125","v":0},{"$f":"'شهر 10'!U125","v":0},{"$f":"'شهر 10'!V125","v":0},{"$f":"'شهر 10'!W125","v":0},{"$f":"'شهر 10'!X125","v":0},{"$f":"'شهر 10'!Y125","v":0},{"$f":"'شهر 10'!Z125","v":0},{"$f":"'شهر 10'!AA125","v":0},{"$f":"'شهر 10'!AB125","v":0},{"$f":"'شهر 10'!AC125","v":0},{"$f":"'شهر 10'!AD125","v":0},{"$f":"'شهر 10'!AE125","v":0},{"$f":"'شهر 10'!AF125","v":0},{"$f":"'شهر 10'!AG125","v":0},{"$f":"'شهر 10'!AH125","v":0}]
[null,null,null,null,null,null,{"$f":"'شهر 10'!D126","v":0},{"$f":"'شهر 10'!E126","v":0},{"$f":"'شهر 10'!F126","v":0},{"$f":"'شهر 10'!G126","v":0},{"$f":"'شهر 10'!H126","v":0},{"$f":"'شهر 10'!I126","v":0},{"$f":"'شهر 10'!J126","v":0},{"$f":"'شهر 10'!K126","v":0},{"$f":"'شهر 10'!L126","v":0},{"$f":"'شهر 10'!M126","v":0},{"$f":"'شهر 10'!N126","v":0},{"$f":"'شهر 10'!O126","v":0},{"$f":"'شهر 10'!P126","v":0},{"$f":"'شهر 10'!Q126","v":0},{"$f":"'شهر 10'!R126","v":0},{"$f":"'شهر 10'!S126","v":0},{"$f":"'شهر 10'!T126","v":0},{"$f":"'شهر 10'!U126","v":0},{"$f":"'شهر 10'!V126","v":0},{"$f":"'شهر 10'!W126","v":0},{"$f":"'شهر 10'!X126","v":0},{"$f":"'شهر 10'!Y126","v":0},{"$f":"'شهر 10'!Z126","v":0},{"$f":"'شهر 10'!AA126","v":0},{"$f":"'شهر 10'!AB126","v":0},{"$f":"'شهر 10'!AC126","v":0},{"$f":"'شهر 10'!AD126","v":0},{"$f":"'شهر 10'!AE126","v":0},{"$f":"'شهر 10'!AF126","v":0},{"$f":"'شهر 10'!AG126","v":0},{"$f":"'شهر 10'!AH126","v":0}]
[63,"احمد محمود السعيد",{"$f":"'شهر 10'!AI127","v":0},{"$f":"'شهر 10'!AJ127","v":0},{"$f":"'شهر 10'!AK127","v":0},null,{"$f":"'شهر 10'!D127","v":0},{"$f":"'شهر 10'!E127","v":0},{"$f":"'شهر 10'!F127","v":0},{"$f":"'شهر 10'!G127","v":0},{"$f":"'شهر 10'!H127","v":0},{"$f":"'شهر 10'!I127","v":0},{"$f":"'شهر 10'!J127","v":0},{"$f":"'شهر 10'!K127","v":0},{"$f":"'شهر 10'!L127","v":0},{"$f":"'شهر 10'!M127","v":0},{"$f":"'شهر 10'!N127","v":0},{"$f":"'شهر 10'!O127","v":0},{"$f":"'شهر 10'!P127","v":0},{"$f":"'شهر 10'!Q127","v":0},{"$f":"'شهر 10'!R127","v":0},{"$f":"'شهر 10'!S127","v":0},{"$f":"'شهر 10'!T127","v":0},{"$f":"'شهر 10'!U127","v":0},{"$f":"'شهر 10'!V127","v":0},{"$f":"'شهر 10'!W127","v":0},{"$f":"'شهر 10'!X127","v":0},{"$f":"'شهر 10'!Y127","v":0},{"$f":"'شهر 10'!Z127","v":0},{"$f":"'شهر 10'!AA127","v":0},{"$f":"'شهر 10'!AB127","v":0},{"$f":"'شهر 10'!AC127","v":0},{"$f":"'شهر 10'!AD127","v":0},{"$f":"'شهر 10'!AE127","v":0},{"$f":"'شهر 10'!AF127","v":0},{"$f":"'شهر 10'!AG127","v":0},{"$f":"'شهر 10'!AH127","v":0}]
[null,null,null,null,null,null,{"$f":"'شهر 10'!D128","v":0},{"$f":"'شهر 10'!E128","v":0},{"$f":"'شهر 10'!F128","v":0},{"$f":"'شهر 10'!G128","v":0},{"$f":"'شهر 10'!H128","v":0},{"$f":"'شهر 10'!I128","v":0},{"$f":"'شهر 10'!J128","v":0},{"$f":"'شهر 10'!K128","v":0},{"$f":"'شهر 10'!L128","v":0},{"$f":"'شهر 10'!M128","v":0},{"$f":"'شهر 10'!N128","v":0},{"$f":"'شهر 10'!O128","v":0},{"$f":"'شهر 10'!P128","v":0},{"$f":"'شهر 10'!Q128","v":0},{"$f":"'شهر 10'!R128","v":0},{"$f":"'شهر 10'!S128","v":0},{"$f":"'شهر 10'!T128","v":0},{"$f":"'شهر 10'!U128","v":0},{"$f":"'شهر 10'!V128","v":0},{"$f":"'شهر 10'!W128","v":0},{"$f":"'شهر 10'!X128","v":0},{"$f":"'شهر 10'!Y128","v":0},{"$f":"'شهر 10'!Z128","v":0},{"$f":"'شهر 10'!AA128","v":0},{"$f":"'شهر 10'!AB128","v":0},{"$f":"'شهر 10'!AC128","v":0},{"$f":"'شهر 10'!AD128","v":0},{"$f":"'شهر 10'!AE128","v":0},{"$f":"'شهر 10'!AF128","v":0},{"$f":"'شهر 10'!AG128","v":0},{"$f":"'شهر 10'!AH128","v":0}]
[64,"خالد عزت",{"$f":"'شهر 10'!AI129","v":0},{"$f":"'شهر 10'!AJ129","v":0},{"$f":"'شهر 10'!AK129","v":0},null,{"$f":"'شهر 10'!D129","v":0},{"$f":"'شهر 10'!E129","v":0},{"$f":"'شهر 10'!F129","v":0},{"$f":"'شهر 10'!G129","v":0},{"$f":"'شهر 10'!H129","v":0},{"$f":"'شهر 10'!I129","v":0},{"$f":"'شهر 10'!J129","v":0},{"$f":"'شهر 10'!K129","v":0},{"$f":"'شهر 10'!L129","v":0},{"$f":"'شهر 10'!M129","v":0},{"$f":"'شهر 10'!N129","v":0},{"$f":"'شهر 10'!O129","v":0},{"$f":"'شهر 10'!P129","v":0},{"$f":"'شهر 10'!Q129","v":0},{"$f":"'شهر 10'!R129","v":0},{"$f":"'شهر 10'!S129","v":0},{"$f":"'شهر 10'!T129","v":0},{"$f":"'شهر 10'!U129","v":0},{"$f":"'شهر 10'!V129","v":0},{"$f":"'شهر 10'!W129","v":0},{"$f":"'شهر 10'!X129","v":0},{"$f":"'شهر 10'!Y129","v":0},{"$f":"'شهر 10'!Z129","v":0},{"$f":"'شهر 10'!AA129","v":0},{"$f":"'شهر 10'!AB129","v":0},{"$f":"'شهر 10'!AC129","v":0},{"$f":"'شهر 10'!AD129","v":0},{"$f":"'شهر 10'!AE129","v":0},{"$f":"'شهر 10'!AF129","v":0},{"$f":"'شهر 10'!AG129","v":0},{"$f":"'شهر 10'!AH129","v":0}]
[null,null,null,null,null,null,{"$f":"'شهر 10'!D130","v":0},{"$f":"'شهر 10'!E130","v":0},{"$f":"'شهر 10'!F130","v":0},{"$f":"'شهر 10'!G130","v":0},{"$f":"'شهر 10'!H130","v":0},{"$f":"'شهر 10'!I130","v":0},{"$f":"'شهر 10'!J130","v":0},{"$f":"'شهر 10'!K130","v":0},{"$f":"'شهر 10'!L130","v":0},{"$f":"'شهر 10'!M130","v":0},{"$f":"'شهر 10'!N130","v":0},{"$f":"'شهر 10'!O130","v":0},{"$f":"'شهر 10'!P130","v":0},{"$f":"'شهر 10'!Q130","v":0},{"$f":"'شهر 10'!R130","v":0},{"$f":"'شهر 10'!S130","v":0},{"$f":"'شهر 10'!T130","v":0},{"$f":"'شهر 10'!U130","v":0},{"$f":"'شهر 10'!V130","v":0},{"$f":"'شهر 10'!W130","v":0},{"$f":"'شهر 10'!X130","v":0},{"$f":"'شهر 10'!Y130","v":0},{"$f":"'شهر 10'!Z130","v":0},{"$f":"'شهر 10'!AA130","v":0},{"$f":"'شهر 10'!AB130","v":0},{"$f":"'شهر 10'!AC130","v":0},{"$f":"'شهر 10'!AD130","v":0},{"$f":"'شهر 10'!AE130","v":0},{"$f":"'شهر 10'!AF130","v":0},{"$f":"'شهر 10'!AG130","v":0},{"$f":"'شهر 10'!AH130","v":0}]
[65,"احمد محمد الرشيدى",{"$f":"'شهر 10'!AI131","v":0},{"$f":"'شهر 10'!AJ131","v":0},{"$f":"'شهر 10'!AK131","v":0},null,{"$f":"'شهر 10'!D131","v":0},{"$f":"'شهر 10'!E131","v":0},{"$f":"'شهر 10'!F131","v":0},{"$f":"'شهر 10'!G131","v":0},{"$f":"'شهر 10'!H131","v":0},{"$f":"'شهر 10'!I131","v":0},{"$f":"'شهر 10'!J131","v":0},{"$f":"'شهر 10'!K131","v":0},{"$f":"'شهر 10'!L131","v":0},{"$f":"'شهر 10'!M131","v":0},{"$f":"'شهر 10'!N131","v":0},{"$f":"'شهر 10'!O131","v":0},{"$f":"'شهر 10'!P131","v":0},{"$f":"'شهر 10'!Q131","v":0},{"$f":"'شهر 10'!R131","v":0},{"$f":"'شهر 10'!S131","v":0},{"$f":"'شهر 10'!T131","v":0},{"$f":"'شهر 10'!U131","v":0},{"$f":"'شهر 10'!V131","v":0},{"$f":"'شهر 10'!W131","v":0},{"$f":"'شهر 10'!X131","v":0},{"$f":"'شهر 10'!Y131","v":0},{"$f":"'شهر 10'!Z131","v":0},{"$f":"'شهر 10'!AA131","v":0},{"$f":"'شهر 10'!AB131","v":0},{"$f":"'شهر 10'!AC131","v":0},{"$f":"'شهر 10'!AD131","v":0},{"$f":"'شهر 10'!AE131","v":0},{"$f":"'شهر 10'!AF131","v":0},{"$f":"'شهر 10'!AG131","v":0},{"$f":"'شهر 10'!AH131","v":0}]
[null,null,null,null,null,null,{"$f":"'شهر 10'!D132","v":0},{"$f":"'شهر 10'!E132","v":0},{"$f":"'شهر 10'!F132","v":0},{"$f":"'شهر 10'!G132","v":0},{"$f":"'شهر 10'!H132","v":0},{"$f":"'شهر 10'!I132","v":0},{"$f":"'شهر 10'!J132","v":0},{"$f":"'شهر 10'!K132","v":0},{"$f":"'شهر 10'!L132","v":0},{"$f":"'شهر 10'!M132","v":0},{"$f":"'شهر 10'!N132","v":0},{"$f":"'شهر 10'!O132","v":0},{"$f":"'شهر 10'!P132","v":0},{"$f":"'شهر 10'!Q132","v":0},{"$f":"'شهر 10'!R132","v":0},{"$f":"'شهر 10'!S132","v":0},{"$f":"'شهر 10'!T132","v":0},{"$f":"'شهر 10'!U132","v":0},{"$f":"'شهر 10'!V132","v":0},{"$f":"'شهر 10'!W132","v":0},{"$f":"'شهر 10'!X132","v":0},{"$f":"'شهر 10'!Y132","v":0},{"$f":"'شهر 10'!Z132","v":0},{"$f":"'شهر 10'!AA132","v":0},{"$f":"'شهر 10'!AB132","v":0},{"$f":"'شهر 10'!AC132","v":0},{"$f":"'شهر 10'!AD132","v":0},{"$f":"'شهر 10'!AE132","v":0},{"$f":"'شهر 10'!AF132","v":0},{"$f":"'شهر 10'!AG132","v":0},{"$f":"'شهر 10'!AH132","v":0}]
[66,"خالد وليد",{"$f":"'شهر 10'!AI133","v":0},{"$f":"'شهر 10'!AJ133","v":0},{"$f":"'شهر 10'!AK133","v":0},null,{"$f":"'شهر 10'!D133","v":0},{"$f":"'شهر 10'!E133","v":0},{"$f":"'شهر 10'!F133","v":0},{"$f":"'شهر 10'!G133","v":0},{"$f":"'شهر 10'!H133","v":0},{"$f":"'شهر 10'!I133","v":0},{"$f":"'شهر 10'!J133","v":0},{"$f":"'شهر 10'!K133","v":0},{"$f":"'شهر 10'!L133","v":0},{"$f":"'شهر 10'!M133","v":0},{"$f":"'شهر 10'!N133","v":0},{"$f":"'شهر 10'!O133","v":0},{"$f":"'شهر 10'!P133","v":0},{"$f":"'شهر 10'!Q133","v":0},{"$f":"'شهر 10'!R133","v":0},{"$f":"'شهر 10'!S133","v":0},{"$f":"'شهر 10'!T133","v":0},{"$f":"'شهر 10'!U133","v":0},{"$f":"'شهر 10'!V133","v":0},{"$f":"'شهر 10'!W133","v":0},{"$f":"'شهر 10'!X133","v":0},{"$f":"'شهر 10'!Y133","v":0},{"$f":"'شهر 10'!Z133","v":0},{"$f":"'شهر 10'!AA133","v":0},{"$f":"'شهر 10'!AB133","v":0},{"$f":"'شهر 10'!AC133","v":0},{"$f":"'شهر 10'!AD133","v":0},{"$f":"'شهر 10'!AE133","v":0},{"$f":"'شهر 10'!AF133","v":0},{"$f":"'شهر 10'!AG133","v":0},{"$f":"'شهر 10'!AH133","v":0}]
[null,null,null,null,null,null,{"$f":"'شهر 10'!D134","v":0},{"$f":"'شهر 10'!E134","v":0},{"$f":"'شهر 10'!F134","v":0},{"$f":"'شهر 10'!G134","v":0},{"$f":"'شهر 10'!H134","v":0},{"$f":"'شهر 10'!I134","v":0},{"$f":"'شهر 10'!J134","v":0},{"$f":"'شهر 10'!K134","v":0},{"$f":"'شهر 10'!L134","v":0},{"$f":"'شهر 10'!M134","v":0},{"$f":"'شهر 10'!N134","v":0},{"$f":"'شهر 10'!O134","v":0},{"$f":"'شهر 10'!P134","v":0},{"$f":"'شهر 10'!Q134","v":0},{"$f":"'شهر 10'!R134","v":0},{"$f":"'شهر 10'!S134","v":0},{"$f":"'شهر 10'!T134","v":0},{"$f":"'شهر 10'!U134","v":0},{"$f":"'شهر 10'!V134","v":0},{"$f":"'شهر 10'!W134","v":0},{"$f":"'شهر 10'!X134","v":0},{"$f":"'شهر 10'!Y134","v":0},{"$f":"'شهر 10'!Z134","v":0},{"$f":"'شهر 10'!AA134","v":0},{"$f":"'شهر 10'!AB134","v":0},{"$f":"'شهر 10'!AC134","v":0},{"$f":"'شهر 10'!AD134","v":0},{"$f":"'شهر 10'!AE134","v":0},{"$f":"'شهر 10'!AF134","v":0},{"$f":"'شهر 10'!AG134","v":0},{"$f":"'شهر 10'!AH134","v":0}]
[67,"محمد امر الله",{"$f":"'شهر 10'!AI135","v":0},{"$f":"'شهر 10'!AJ135","v":0},{"$f":"'شهر 10'!AK135","v":0},null,{"$f":"'شهر 10'!D135","v":0},{"$f":"'شهر 10'!E135","v":0},{"$f":"'شهر 10'!F135","v":0},{"$f":"'شهر 10'!G135","v":0},{"$f":"'شهر 10'!H135","v":0},{"$f":"'شهر 10'!I135","v":0},{"$f":"'شهر 10'!J135","v":0},{"$f":"'شهر 10'!K135","v":0},{"$f":"'شهر 10'!L135","v":0},{"$f":"'شهر 10'!M135","v":0},{"$f":"'شهر 10'!N135","v":0},{"$f":"'شهر 10'!O135","v":0},{"$f":"'شهر 10'!P135","v":0},{"$f":"'شهر 10'!Q135","v":0},{"$f":"'شهر 10'!R135","v":0},{"$f":"'شهر 10'!S135","v":0},{"$f":"'شهر 10'!T135","v":0},{"$f":"'شهر 10'!U135","v":0},{"$f":"'شهر 10'!V135","v":0},{"$f":"'شهر 10'!W135","v":0},{"$f":"'شهر 10'!X135","v":0},{"$f":"'شهر 10'!Y135","v":0},{"$f":"'شهر 10'!Z135","v":0},{"$f":"'شهر 10'!AA135","v":0},{"$f":"'شهر 10'!AB135","v":0},{"$f":"'شهر 10'!AC135","v":0},{"$f":"'شهر 10'!AD135","v":0},{"$f":"'شهر 10'!AE135","v":0},{"$f":"'شهر 10'!AF135","v":0},{"$f":"'شهر 10'!AG135","v":0},{"$f":"'شهر 10'!AH135","v":0}]
[null,null,null,null,null,null,{"$f":"'شهر 10'!D136","v":0},{"$f":"'شهر 10'!E136","v":0},{"$f":"'شهر 10'!F136","v":0},{"$f":"'شهر 10'!G136","v":0},{"$f":"'شهر 10'!H136","v":0},{"$f":"'شهر 10'!I136","v":0},{"$f":"'شهر 10'!J136","v":0},{"$f":"'شهر 10'!K136","v":0},{"$f":"'شهر 10'!L136","v":0},{"$f":"'شهر 10'!M136","v":0},{"$f":"'شهر 10'!N136","v":0},{"$f":"'شهر 10'!O136","v":0},{"$f":"'شهر 10'!P136","v":0},{"$f":"'شهر 10'!Q136","v":0},{"$f":"'شهر 10'!R136","v":0},{"$f":"'شهر 10'!S136","v":0},{"$f":"'شهر 10'!T136","v":0},{"$f":"'شهر 10'!U136","v":0},{"$f":"'شهر 10'!V136","v":0},{"$f":"'شهر 10'!W136","v":0},{"$f":"'شهر 10'!X136","v":0},{"$f":"'شهر 10'!Y136","v":0},{"$f":"'شهر 10'!Z136","v":0},{"$f":"'شهر 10'!AA136","v":0},{"$f":"'شهر 10'!AB136","v":0},{"$f":"'شهر 10'!AC136","v":0},{"$f":"'شهر 10'!AD136","v":0},{"$f":"'شهر 10'!AE136","v":0},{"$f":"'شهر 10'!AF136","v":0},{"$f":"'شهر 10'!AG136","v":0},{"$f":"'شهر 10'!AH136","v":0}]
[68,"فايز المحلاوى",{"$f":"'شهر 10'!AI137","v":0},{"$f":"'شهر 10'!AJ137","v":0},{"$f":"'شهر 10'!AK137","v":0},null,{"$f":"'شهر 10'!D137","v":0},{"$f":"'شهر 10'!E137","v":0},{"$f":"'شهر 10'!F137","v":0},{"$f":"'شهر 10'!G137","v":0},{"$f":"'شهر 10'!H137","v":0},{"$f":"'شهر 10'!I137","v":0},{"$f":"'شهر 10'!J137","v":0},{"$f":"'شهر 10'!K137","v":0},{"$f":"'شهر 10'!L137","v":0},{"$f":"'شهر 10'!M137","v":0},{"$f":"'شهر 10'!N137","v":0},{"$f":"'شهر 10'!O137","v":0},{"$f":"'شهر 10'!P137","v":0},{"$f":"'شهر 10'!Q137","v":0},{"$f":"'شهر 10'!R137","v":0},{"$f":"'شهر 10'!S137","v":0},{"$f":"'شهر 10'!T137","v":0},{"$f":"'شهر 10'!U137","v":0},{"$f":"'شهر 10'!V137","v":0},{"$f":"'شهر 10'!W137","v":0},{"$f":"'شهر 10'!X137","v":0},{"$f":"'شهر 10'!Y137","v":0},{"$f":"'شهر 10'!Z137","v":0},{"$f":"'شهر 10'!AA137","v":0},{"$f":"'شهر 10'!AB137","v":0},{"$f":"'شهر 10'!AC137","v":0},{"$f":"'شهر 10'!AD137","v":0},{"$f":"'شهر 10'!AE137","v":0},{"$f":"'شهر 10'!AF137","v":0},{"$f":"'شهر 10'!AG137","v":0},{"$f":"'شهر 10'!AH137","v":0}]
[null,null,null,null,null,null,{"$f":"'شهر 10'!D138","v":0},{"$f":"'شهر 10'!E138","v":0},{"$f":"'شهر 10'!F138","v":0},{"$f":"'شهر 10'!G138","v":0},{"$f":"'شهر 10'!H138","v":0},{"$f":"'شهر 10'!I138","v":0},{"$f":"'شهر 10'!J138","v":0},{"$f":"'شهر 10'!K138","v":0},{"$f":"'شهر 10'!L138","v":0},{"$f":"'شهر 10'!M138","v":0},{"$f":"'شهر 10'!N138","v":0},{"$f":"'شهر 10'!O138","v":0},{"$f":"'شهر 10'!P138","v":0},{"$f":"'شهر 10'!Q138","v":0},{"$f":"'شهر 10'!R138","v":0},{"$f":"'شهر 10'!S138","v":0},{"$f":"'شهر 10'!T138","v":0},{"$f":"'شهر 10'!U138","v":0},{"$f":"'شهر 10'!V138","v":0},{"$f":"'شهر 10'!W138","v":0},{"$f":"'شهر 10'!X138","v":0},{"$f":"'شهر 10'!Y138","v":0},{"$f":"'شهر 10'!Z138","v":0},{"$f":"'شهر 10'!AA138","v":0},{"$f":"'شهر 10'!AB138","v":0},{"$f":"'شهر 10'!AC138","v":0},{"$f":"'شهر 10'!AD138","v":0},{"$f":"'شهر 10'!AE138","v":0},{"$f":"'شهر 10'!AF138","v":0},{"$f":"'شهر 10'!AG138","v":0},{"$f":"'شهر 10'!AH138","v":0}]
[69,"هشام محمود السعيد",{"$f":"'شهر 10'!AI139","v":0},{"$f":"'شهر 10'!AJ139","v":0},{"$f":"'شهر 10'!AK139","v":0},null,{"$f":"'شهر 10'!D139","v":0},{"$f":"'شهر 10'!E139","v":0},{"$f":"'شهر 10'!F139","v":0},{"$f":"'شهر 10'!G139","v":0},{"$f":"'شهر 10'!H139","v":0},{"$f":"'شهر 10'!I139","v":0},{"$f":"'شهر 10'!J139","v":0},{"$f":"'شهر 10'!K139","v":0},{"$f":"'شهر 10'!L139","v":0},{"$f":"'شهر 10'!M139","v":0},{"$f":"'شهر 10'!N139","v":0},{"$f":"'شهر 10'!O139","v":0},{"$f":"'شهر 10'!P139","v":0},{"$f":"'شهر 10'!Q139","v":0},{"$f":"'شهر 10'!R139","v":0},{"$f":"'شهر 10'!S139","v":0},{"$f":"'شهر 10'!T139","v":0},{"$f":"'شهر 10'!U139","v":0},{"$f":"'شهر 10'!V139","v":0},{"$f":"'شهر 10'!W139","v":0},{"$f":"'شهر 10'!X139","v":0},{"$f":"'شهر 10'!Y139","v":0},{"$f":"'شهر 10'!Z139","v":0},{"$f":"'شهر 10'!AA139","v":0},{"$f":"'شهر 10'!AB139","v":0},{"$f":"'شهر 10'!AC139","v":0},{"$f":"'شهر 10'!AD139","v":0},{"$f":"'شهر 10'!AE139","v":0},{"$f":"'شهر 10'!AF139","v":0},{"$f":"'شهر 10'!AG139","v":0},{"$f":"'شهر 10'!AH139","v":0}]
[null,null,null,null,null,null,{"$f":"'شهر 10'!D140","v":0},{"$f":"'شهر 10'!E140","v":0},{"$f":"'شهر 10'!F140","v":0},{"$f":"'شهر 10'!G140","v":0},{"$f":"'شهر 10'!H140","v":0},{"$f":"'شهر 10'!I140","v":0},{"$f":"'شهر 10'!J140","v":0},{"$f":"'شهر 10'!K140","v":0},{"$f":"'شهر 10'!L140","v":0},{"$f":"'شهر 10'!M140","v":0},{"$f":"'شهر 10'!N140","v":0},{"$f":"'شهر 10'!O140","v":0},{"$f":"'شهر 10'!P140","v":0},{"$f":"'شهر 10'!Q140","v":0},{"$f":"'شهر 10'!R140","v":0},{"$f":"'شهر 10'!S140","v":0},{"$f":"'شهر 10'!T140","v":0},{"$f":"'شهر 10'!U140","v":0},{"$f":"'شهر 10'!V140","v":0},{"$f":"'شهر 10'!W140","v":0},{"$f":"'شهر 10'!X140","v":0},{"$f":"'شهر 10'!Y140","v":0},{"$f":"'شهر 10'!Z140","v":0},{"$f":"'شهر 10'!AA140","v":0},{"$f":"'شهر 10'!AB140","v":0},{"$f":"'شهر 10'!AC140","v":0},{"$f":"'شهر 10'!AD140","v":0},{"$f":"'شهر 10'!AE140","v":0},{"$f":"'شهر 10'!AF140","v":0},{"$f":"'شهر 10'!AG140","v":0},{"$f":"'شهر 10'!AH140","v":0}]
[70,"صالح محمد نواره",{"$f":"'شهر 10'!AI141","v":0},{"$f":"'شهر 10'!AJ141","v":0},{"$f":"'شهر 10'!AK141","v":0},null,{"$f":"'شهر 10'!D141","v":0},{"$f":"'شهر 10'!E141","v":0},{"$f":"'شهر 10'!F141","v":0},{"$f":"'شهر 10'!G141","v":0},{"$f":"'شهر 10'!H141","v":0},{"$f":"'شهر 10'!I141","v":0},{"$f":"'شهر 10'!J141","v":0},{"$f":"'شهر 10'!K141","v":0},{"$f":"'شهر 10'!L141","v":0},{"$f":"'شهر 10'!M141","v":0},{"$f":"'شهر 10'!N141","v":0},{"$f":"'شهر 10'!O141","v":0},{"$f":"'شهر 10'!P141","v":0},{"$f":"'شهر 10'!Q141","v":0},{"$f":"'شهر 10'!R141","v":0},{"$f":"'شهر 10'!S141","v":0},{"$f":"'شهر 10'!T141","v":0},{"$f":"'شهر 10'!U141","v":0},{"$f":"'شهر 10'!V141","v":0},{"$f":"'شهر 10'!W141","v":0},{"$f":"'شهر 10'!X141","v":0},{"$f":"'شهر 10'!Y141","v":0},{"$f":"'شهر 10'!Z141","v":0},{"$f":"'شهر 10'!AA141","v":0},{"$f":"'شهر 10'!AB141","v":0},{"$f":"'شهر 10'!AC141","v":0},{"$f":"'شهر 10'!AD141","v":0},{"$f":"'شهر 10'!AE141","v":0},{"$f":"'شهر 10'!AF141","v":0},{"$f":"'شهر 10'!AG141","v":0},{"$f":"'شهر 10'!AH141","v":0}]
[null,null,null,null,null,null,{"$f":"'شهر 10'!D142","v":0},{"$f":"'شهر 10'!E142","v":0},{"$f":"'شهر 10'!F142","v":0},{"$f":"'شهر 10'!G142","v":0},{"$f":"'شهر 10'!H142","v":0},{"$f":"'شهر 10'!I142","v":0},{"$f":"'شهر 10'!J142","v":0},{"$f":"'شهر 10'!K142","v":0},{"$f":"'شهر 10'!L142","v":0},{"$f":"'شهر 10'!M142","v":0},{"$f":"'شهر 10'!N142","v":0},{"$f":"'شهر 10'!O142","v":0},{"$f":"'شهر 10'!P142","v":0},{"$f":"'شهر 10'!Q142","v":0},{"$f":"'شهر 10'!R142","v":0},{"$f":"'شهر 10'!S142","v":0},{"$f":"'شهر 10'!T142","v":0},{"$f":"'شهر 10'!U142","v":0},{"$f":"'شهر 10'!V142","v":0},{"$f":"'شهر 10'!W142","v":0},{"$f":"'شهر 10'!X142","v":0},{"$f":"'شهر 10'!Y142","v":0},{"$f":"'شهر 10'!Z142","v":0},{"$f":"'شهر 10'!AA142","v":0},{"$f":"'شهر 10'!AB142","v":0},{"$f":"'شهر 10'!AC142","v":0},{"$f":"'شهر 10'!AD142","v":0},{"$f":"'شهر 10'!AE142","v":0},{"$f":"'شهر 10'!AF142","v":0},{"$f":"'شهر 10'!AG142","v":0},{"$f":"'شهر 10'!AH142","v":0}]
[71,"محمد السيد السيد",{"$f":"'شهر 10'!AI143","v":0},{"$f":"'شهر 10'!AJ143","v":0},{"$f":"'شهر 10'!AK143","v":0},null,{"$f":"'شهر 10'!D143","v":0},{"$f":"'شهر 10'!E143","v":0},{"$f":"'شهر 10'!F143","v":0},{"$f":"'شهر 10'!G143","v":0},{"$f":"'شهر 10'!H143","v":0},{"$f":"'شهر 10'!I143","v":0},{"$f":"'شهر 10'!J143","v":0},{"$f":"'شهر 10'!K143","v":0},{"$f":"'شهر 10'!L143","v":0},{"$f":"'شهر 10'!M143","v":0},{"$f":"'شهر 10'!N143","v":0},{"$f":"'شهر 10'!O143","v":0},{"$f":"'شهر 10'!P143","v":0},{"$f":"'شهر 10'!Q143","v":0},{"$f":"'شهر 10'!R143","v":0},{"$f":"'شهر 10'!S143","v":0},{"$f":"'شهر 10'!T143","v":0},{"$f":"'شهر 10'!U143","v":0},{"$f":"'شهر 10'!V143","v":0},{"$f":"'شهر 10'!W143","v":0},{"$f":"'شهر 10'!X143","v":0},{"$f":"'شهر 10'!Y143","v":0},{"$f":"'شهر 10'!Z143","v":0},{"$f":"'شهر 10'!AA143","v":0},{"$f":"'شهر 10'!AB143","v":0},{"$f":"'شهر 10'!AC143","v":0},{"$f":"'شهر 10'!AD143","v":0},{"$f":"'شهر 10'!AE143","v":0},{"$f":"'شهر 10'!AF143","v":0},{"$f":"'شهر 10'!AG143","v":0},{"$f":"'شهر 10'!AH143","v":0}]
[null,null,null,null,null,null,{"$f":"'شهر 10'!D144","v":0},{"$f":"'شهر 10'!E144","v":0},{"$f":"'شهر 10'!F144","v":0},{"$f":"'شهر 10'!G144","v":0},{"$f":"'شهر 10'!H144","v":0},{"$f":"'شهر 10'!I144","v":0},{"$f":"'شهر 10'!J144","v":0},{"$f":"'شهر 10'!K144","v":0},{"$f":"'شهر 10'!L144","v":0},{"$f":"'شهر 10'!M144","v":0},{"$f":"'شهر 10'!N144","v":0},{"$f":"'شهر 10'!O144","v":0},{"$f":"'شهر 10'!P144","v":0},{"$f":"'شهر 10'!Q144","v":0},{"$f":"'شهر 10'!R144","v":0},{"$f":"'شهر 10'!S144","v":0},{"$f":"'شهر 10'!T144","v":0},{"$f":"'شهر 10'!U144","v":0},{"$f":"'شهر 10'!V144","v":0},{"$f":"'شهر 10'!W144","v":0},{"$f":"'شهر 10'!X144","v":0},{"$f":"'شهر 10'!Y144","v":0},{"$f":"'شهر 10'!Z144","v":0},{"$f":"'شهر 10'!AA144","v":0},{"$f":"'شهر 10'!AB144","v":0},{"$f":"'شهر 10'!AC144","v":0},{"$f":"'شهر 10'!AD144","v":0},{"$f":"'شهر 10'!AE144","v":0},{"$f":"'شهر 10'!AF144","v":0},{"$f":"'شهر 10'!AG144","v":0},{"$f":"'شهر 10'!AH144","v":0}]
[72,"محمود السيد السيد",{"$f":"'شهر 10'!AI145","v":0},{"$f":"'شهر 10'!AJ145","v":0},{"$f":"'شهر 10'!AK145","v":0},null,{"$f":"'شهر 10'!D145","v":0},{"$f":"'شهر 10'!E145","v":0},{"$f":"'شهر 10'!F145","v":0},{"$f":"'شهر 10'!G145","v":0},{"$f":"'شهر 10'!H145","v":0},{"$f":"'شهر 10'!I145","v":0},{"$f":"'شهر 10'!J145","v":0},{"$f":"'شهر 10'!K145","v":0},{"$f":"'شهر 10'!L145","v":0},{"$f":"'شهر 10'!M145","v":0},{"$f":"'شهر 10'!N145","v":0},{"$f":"'شهر 10'!O145","v":0},{"$f":"'شهر 10'!P145","v":0},{"$f":"'شهر 10'!Q145","v":0},{"$f":"'شهر 10'!R145","v":0},{"$f":"'شهر 10'!S145","v":0},{"$f":"'شهر 10'!T145","v":0},{"$f":"'شهر 10'!U145","v":0},{"$f":"'شهر 10'!V145","v":0},{"$f":"'شهر 10'!W145","v":0},{"$f":"'شهر 10'!X145","v":0},{"$f":"'شهر 10'!Y145","v":0},{"$f":"'شهر 10'!Z145","v":0},{"$f":"'شهر 10'!AA145","v":0},{"$f":"'شهر 10'!AB145","v":0},{"$f":"'شهر 10'!AC145","v":0},{"$f":"'شهر 10'!AD145","v":0},{"$f":"'شهر 10'!AE145","v":0},{"$f":"'شهر 10'!AF145","v":0},{"$f":"'شهر 10'!AG145","v":0},{"$f":"'شهر 10'!AH145","v":0}]
[null,null,null,null,null,null,{"$f":"'شهر 10'!D146","v":0},{"$f":"'شهر 10'!E146","v":0},{"$f":"'شهر 10'!F146","v":0},{"$f":"'شهر 10'!G146","v":0},{"$f":"'شهر 10'!H146","v":0},{"$f":"'شهر 10'!I146","v":0},{"$f":"'شهر 10'!J146","v":0},{"$f":"'شهر 10'!K146","v":0},{"$f":"'شهر 10'!L146","v":0},{"$f":"'شهر 10'!M146","v":0},{"$f":"'شهر 10'!N146","v":0},{"$f":"'شهر 10'!O146","v":0},{"$f":"'شهر 10'!P146","v":0},{"$f":"'شهر 10'!Q146","v":0},{"$f":"'شهر 10'!R146","v":0},{"$f":"'شهر 10'!S146","v":0},{"$f":"'شهر 10'!T146","v":0},{"$f":"'شهر 10'!U146","v":0},{"$f":"'شهر 10'!V146","v":0},{"$f":"'شهر 10'!W146","v":0},{"$f":"'شهر 10'!X146","v":0},{"$f":"'شهر 10'!Y146","v":0},{"$f":"'شهر 10'!Z146","v":0},{"$f":"'شهر 10'!AA146","v":0},{"$f":"'شهر 10'!AB146","v":0},{"$f":"'شهر 10'!AC146","v":0},{"$f":"'شهر 10'!AD146","v":0},{"$f":"'شهر 10'!AE146","v":0},{"$f":"'شهر 10'!AF146","v":0},{"$f":"'شهر 10'!AG146","v":0},{"$f":"'شهر 10'!AH146","v":0}]
[73,"ابراهيم عبد الخالق",{"$f":"'شهر 10'!AI147","v":0},{"$f":"'شهر 10'!AJ147","v":0},{"$f":"'شهر 10'!AK147","v":0},null,{"$f":"'شهر 10'!D147","v":0},{"$f":"'شهر 10'!E147","v":0},{"$f":"'شهر 10'!F147","v":0},{"$f":"'شهر 10'!G147","v":0},{"$f":"'شهر 10'!H147","v":0},{"$f":"'شهر 10'!I147","v":0},{"$f":"'شهر 10'!J147","v":0},{"$f":"'شهر 10'!K147","v":0},{"$f":"'شهر 10'!L147","v":0},{"$f":"'شهر 10'!M147","v":0},{"$f":"'شهر 10'!N147","v":0},{"$f":"'شهر 10'!O147","v":0},{"$f":"'شهر 10'!P147","v":0},{"$f":"'شهر 10'!Q147","v":0},{"$f":"'شهر 10'!R147","v":0},{"$f":"'شهر 10'!S147","v":0},{"$f":"'شهر 10'!T147","v":0},{"$f":"'شهر 10'!U147","v":0},{"$f":"'شهر 10'!V147","v":0},{"$f":"'شهر 10'!W147","v":0},{"$f":"'شهر 10'!X147","v":0},{"$f":"'شهر 10'!Y147","v":0},{"$f":"'شهر 10'!Z147","v":0},{"$f":"'شهر 10'!AA147","v":0},{"$f":"'شهر 10'!AB147","v":0},{"$f":"'شهر 10'!AC147","v":0},{"$f":"'شهر 10'!AD147","v":0},{"$f":"'شهر 10'!AE147","v":0},{"$f":"'شهر 10'!AF147","v":0},{"$f":"'شهر 10'!AG147","v":0},{"$f":"'شهر 10'!AH147","v":0}]
[null,null,null,null,null,null,{"$f":"'شهر 10'!D148","v":0},{"$f":"'شهر 10'!E148","v":0},{"$f":"'شهر 10'!F148","v":0},{"$f":"'شهر 10'!G148","v":0},{"$f":"'شهر 10'!H148","v":0},{"$f":"'شهر 10'!I148","v":0},{"$f":"'شهر 10'!J148","v":0},{"$f":"'شهر 10'!K148","v":0},{"$f":"'شهر 10'!L148","v":0},{"$f":"'شهر 10'!M148","v":0},{"$f":"'شهر 10'!N148","v":0},{"$f":"'شهر 10'!O148","v":0},{"$f":"'شهر 10'!P148","v":0},{"$f":"'شهر 10'!Q148","v":0},{"$f":"'شهر 10'!R148","v":0},{"$f":"'شهر 10'!S148","v":0},{"$f":"'شهر 10'!T148","v":0},{"$f":"'شهر 10'!U148","v":0},{"$f":"'شهر 10'!V148","v":0},{"$f":"'شهر 10'!W148","v":0},{"$f":"'شهر 10'!X148","v":0},{"$f":"'شهر 10'!Y148","v":0},{"$f":"'شهر 10'!Z148","v":0},{"$f":"'شهر 10'!AA148","v":0},{"$f":"'شهر 10'!AB148","v":0},{"$f":"'شهر 10'!AC148","v":0},{"$f":"'شهر 10'!AD148","v":0},{"$f":"'شهر 10'!AE148","v":0},{"$f":"'شهر 10'!AF148","v":0},{"$f":"'شهر 10'!AG148","v":0},{"$f":"'شهر 10'!AH148","v":0}]
[74,"محمد شحاته",{"$f":"'شهر 10'!AI149","v":0},{"$f":"'شهر 10'!AJ149","v":0},{"$f":"'شهر 10'!AK149","v":0},null,{"$f":"'شهر 10'!D149","v":0},{"$f":"'شهر 10'!E149","v":0},{"$f":"'شهر 10'!F149","v":0},{"$f":"'شهر 10'!G149","v":0},{"$f":"'شهر 10'!H149","v":0},{"$f":"'شهر 10'!I149","v":0},{"$f":"'شهر 10'!J149","v":0},{"$f":"'شهر 10'!K149","v":0},{"$f":"'شهر 10'!L149","v":0},{"$f":"'شهر 10'!M149","v":0},{"$f":"'شهر 10'!N149","v":0},{"$f":"'شهر 10'!O149","v":0},{"$f":"'شهر 10'!P149","v":0},{"$f":"'شهر 10'!Q149","v":0},{"$f":"'شهر 10'!R149","v":0},{"$f":"'شهر 10'!S149","v":0},{"$f":"'شهر 10'!T149","v":0},{"$f":"'شهر 10'!U149","v":0},{"$f":"'شهر 10'!V149","v":0},{"$f":"'شهر 10'!W149","v":0},{"$f":"'شهر 10'!X149","v":0},{"$f":"'شهر 10'!Y149","v":0},{"$f":"'شهر 10'!Z149","v":0},{"$f":"'شهر 10'!AA149","v":0},{"$f":"'شهر 10'!AB149","v":0},{"$f":"'شهر 10'!AC149","v":0},{"$f":"'شهر 10'!AD149","v":0},{"$f":"'شهر 10'!AE149","v":0},{"$f":"'شهر 10'!AF149","v":0},{"$f":"'شهر 10'!AG149","v":0},{"$f":"'شهر 10'!AH149","v":0}]
[null,null,null,null,null,null,{"$f":"'شهر 10'!D150","v":0},{"$f":"'شهر 10'!E150","v":0},{"$f":"'شهر 10'!F150","v":0},{"$f":"'شهر 10'!G150","v":0},{"$f":"'شهر 10'!H150","v":0},{"$f":"'شهر 10'!I150","v":0},{"$f":"'شهر 10'!J150","v":0},{"$f":"'شهر 10'!K150","v":0},{"$f":"'شهر 10'!L150","v":0},{"$f":"'شهر 10'!M150","v":0},{"$f":"'شهر 10'!N150","v":0},{"$f":"'شهر 10'!O150","v":0},{"$f":"'شهر 10'!P150","v":0},{"$f":"'شهر 10'!Q150","v":0},{"$f":"'شهر 10'!R150","v":0},{"$f":"'شهر 10'!S150","v":0},{"$f":"'شهر 10'!T150","v":0},{"$f":"'شهر 10'!U150","v":0},{"$f":"'شهر 10'!V150","v":0},{"$f":"'شهر 10'!W150","v":0},{"$f":"'شهر 10'!X150","v":0},{"$f":"'شهر 10'!Y150","v":0},{"$f":"'شهر 10'!Z150","v":0},{"$f":"'شهر 10'!AA150","v":0},{"$f":"'شهر 10'!AB150","v":0},{"$f":"'شهر 10'!AC150","v":0},{"$f":"'شهر 10'!AD150","v":0},{"$f":"'شهر 10'!AE150","v":0},{"$f":"'شهر 10'!AF150","v":0},{"$f":"'شهر 10'!AG150","v":0},{"$f":"'شهر 10'!AH150","v":0}]
[75,"ابراهيم القطب",{"$f":"'شهر 10'!AI151","v":0},{"$f":"'شهر 10'!AJ151","v":0},{"$f":"'شهر 10'!AK151","v":0},null,{"$f":"'شهر 10'!D151","v":0},{"$f":"'شهر 10'!E151","v":0},{"$f":"'شهر 10'!F151","v":0},{"$f":"'شهر 10'!G151","v":0},{"$f":"'شهر 10'!H151","v":0},{"$f":"'شهر 10'!I151","v":0},{"$f":"'شهر 10'!J151","v":0},{"$f":"'شهر 10'!K151","v":0},{"$f":"'شهر 10'!L151","v":0},{"$f":"'شهر 10'!M151","v":0},{"$f":"'شهر 10'!N151","v":0},{"$f":"'شهر 10'!O151","v":0},{"$f":"'شهر 10'!P151","v":0},{"$f":"'شهر 10'!Q151","v":0},{"$f":"'شهر 10'!R151","v":0},{"$f":"'شهر 10'!S151","v":0},{"$f":"'شهر 10'!T151","v":0},{"$f":"'شهر 10'!U151","v":0},{"$f":"'شهر 10'!V151","v":0},{"$f":"'شهر 10'!W151","v":0},{"$f":"'شهر 10'!X151","v":0},{"$f":"'شهر 10'!Y151","v":0},{"$f":"'شهر 10'!Z151","v":0},{"$f":"'شهر 10'!AA151","v":0},{"$f":"'شهر 10'!AB151","v":0},{"$f":"'شهر 10'!AC151","v":0},{"$f":"'شهر 10'!AD151","v":0},{"$f":"'شهر 10'!AE151","v":0},{"$f":"'شهر 10'!AF151","v":0},{"$f":"'شهر 10'!AG151","v":0},{"$f":"'شهر 10'!AH151","v":0}]
[null,null,null,null,null,null,{"$f":"'شهر 10'!D152","v":0},{"$f":"'شهر 10'!E152","v":0},{"$f":"'شهر 10'!F152","v":0},{"$f":"'شهر 10'!G152","v":0},{"$f":"'شهر 10'!H152","v":0},{"$f":"'شهر 10'!I152","v":0},{"$f":"'شهر 10'!J152","v":0},{"$f":"'شهر 10'!K152","v":0},{"$f":"'شهر 10'!L152","v":0},{"$f":"'شهر 10'!M152","v":0},{"$f":"'شهر 10'!N152","v":0},{"$f":"'شهر 10'!O152","v":0},{"$f":"'شهر 10'!P152","v":0},{"$f":"'شهر 10'!Q152","v":0},{"$f":"'شهر 10'!R152","v":0},{"$f":"'شهر 10'!S152","v":0},{"$f":"'شهر 10'!T152","v":0},{"$f":"'شهر 10'!U152","v":0},{"$f":"'شهر 10'!V152","v":0},{"$f":"'شهر 10'!W152","v":0},{"$f":"'شهر 10'!X152","v":0},{"$f":"'شهر 10'!Y152","v":0},{"$f":"'شهر 10'!Z152","v":0},{"$f":"'شهر 10'!AA152","v":0},{"$f":"'شهر 10'!AB152","v":0},{"$f":"'شهر 10'!AC152","v":0},{"$f":"'شهر 10'!AD152","v":0},{"$f":"'شهر 10'!AE152","v":0},{"$f":"'شهر 10'!AF152","v":0},{"$f":"'شهر 10'!AG152","v":0},{"$f":"'شهر 10'!AH152","v":0}]
[76,"محمد احمد الطيب",{"$f":"'شهر 10'!AI153","v":0},{"$f":"'شهر 10'!AJ153","v":0},{"$f":"'شهر 10'!AK153","v":0},null,{"$f":"'شهر 10'!D153","v":0},{"$f":"'شهر 10'!E153","v":0},{"$f":"'شهر 10'!F153","v":0},{"$f":"'شهر 10'!G153","v":0},{"$f":"'شهر 10'!H153","v":0},{"$f":"'شهر 10'!I153","v":0},{"$f":"'شهر 10'!J153","v":0},{"$f":"'شهر 10'!K153","v":0},{"$f":"'شهر 10'!L153","v":0},{"$f":"'شهر 10'!M153","v":0},{"$f":"'شهر 10'!N153","v":0},{"$f":"'شهر 10'!O153","v":0},{"$f":"'شهر 10'!P153","v":0},{"$f":"'شهر 10'!Q153","v":0},{"$f":"'شهر 10'!R153","v":0},{"$f":"'شهر 10'!S153","v":0},{"$f":"'شهر 10'!T153","v":0},{"$f":"'شهر 10'!U153","v":0},{"$f":"'شهر 10'!V153","v":0},{"$f":"'شهر 10'!W153","v":0},{"$f":"'شهر 10'!X153","v":0},{"$f":"'شهر 10'!Y153","v":0},{"$f":"'شهر 10'!Z153","v":0},{"$f":"'شهر 10'!AA153","v":0},{"$f":"'شهر 10'!AB153","v":0},{"$f":"'شهر 10'!AC153","v":0},{"$f":"'شهر 10'!AD153","v":0},{"$f":"'شهر 10'!AE153","v":0},{"$f":"'شهر 10'!AF153","v":0},{"$f":"'شهر 10'!AG153","v":0},{"$f":"'شهر 10'!AH153","v":0}]
[null,null,null,null,null,null,{"$f":"'شهر 10'!D154","v":0},{"$f":"'شهر 10'!E154","v":0},{"$f":"'شهر 10'!F154","v":0},{"$f":"'شهر 10'!G154","v":0},{"$f":"'شهر 10'!H154","v":0},{"$f":"'شهر 10'!I154","v":0},{"$f":"'شهر 10'!J154","v":0},{"$f":"'شهر 10'!K154","v":0},{"$f":"'شهر 10'!L154","v":0},{"$f":"'شهر 10'!M154","v":0},{"$f":"'شهر 10'!N154","v":0},{"$f":"'شهر 10'!O154","v":0},{"$f":"'شهر 10'!P154","v":0},{"$f":"'شهر 10'!Q154","v":0},{"$f":"'شهر 10'!R154","v":0},{"$f":"'شهر 10'!S154","v":0},{"$f":"'شهر 10'!T154","v":0},{"$f":"'شهر 10'!U154","v":0},{"$f":"'شهر 10'!V154","v":0},{"$f":"'شهر 10'!W154","v":0},{"$f":"'شهر 10'!X154","v":0},{"$f":"'شهر 10'!Y154","v":0},{"$f":"'شهر 10'!Z154","v":0},{"$f":"'شهر 10'!AA154","v":0},{"$f":"'شهر 10'!AB154","v":0},{"$f":"'شهر 10'!AC154","v":0},{"$f":"'شهر 10'!AD154","v":0},{"$f":"'شهر 10'!AE154","v":0},{"$f":"'شهر 10'!AF154","v":0},{"$f":"'شهر 10'!AG154","v":0},{"$f":"'شهر 10'!AH154","v":0}]
[77,"حماده عونى",{"$f":"'شهر 10'!AI155","v":0},{"$f":"'شهر 10'!AJ155","v":0},{"$f":"'شهر 10'!AK155","v":0},null,{"$f":"'شهر 10'!D155","v":0},{"$f":"'شهر 10'!E155","v":0},{"$f":"'شهر 10'!F155","v":0},{"$f":"'شهر 10'!G155","v":0},{"$f":"'شهر 10'!H155","v":0},{"$f":"'شهر 10'!I155","v":0},{"$f":"'شهر 10'!J155","v":0},{"$f":"'شهر 10'!K155","v":0},{"$f":"'شهر 10'!L155","v":0},{"$f":"'شهر 10'!M155","v":0},{"$f":"'شهر 10'!N155","v":0},{"$f":"'شهر 10'!O155","v":0},{"$f":"'شهر 10'!P155","v":0},{"$f":"'شهر 10'!Q155","v":0},{"$f":"'شهر 10'!R155","v":0},{"$f":"'شهر 10'!S155","v":0},{"$f":"'شهر 10'!T155","v":0},{"$f":"'شهر 10'!U155","v":0},{"$f":"'شهر 10'!V155","v":0},{"$f":"'شهر 10'!W155","v":0},{"$f":"'شهر 10'!X155","v":0},{"$f":"'شهر 10'!Y155","v":0},{"$f":"'شهر 10'!Z155","v":0},{"$f":"'شهر 10'!AA155","v":0},{"$f":"'شهر 10'!AB155","v":0},{"$f":"'شهر 10'!AC155","v":0},{"$f":"'شهر 10'!AD155","v":0},{"$f":"'شهر 10'!AE155","v":0},{"$f":"'شهر 10'!AF155","v":0},{"$f":"'شهر 10'!AG155","v":0},{"$f":"'شهر 10'!AH155","v":0}]
[null,null,null,null,null,null,{"$f":"'شهر 10'!D156","v":0},{"$f":"'شهر 10'!E156","v":0},{"$f":"'شهر 10'!F156","v":0},{"$f":"'شهر 10'!G156","v":0},{"$f":"'شهر 10'!H156","v":0},{"$f":"'شهر 10'!I156","v":0},{"$f":"'شهر 10'!J156","v":0},{"$f":"'شهر 10'!K156","v":0},{"$f":"'شهر 10'!L156","v":0},{"$f":"'شهر 10'!M156","v":0},{"$f":"'شهر 10'!N156","v":0},{"$f":"'شهر 10'!O156","v":0},{"$f":"'شهر 10'!P156","v":0},{"$f":"'شهر 10'!Q156","v":0},{"$f":"'شهر 10'!R156","v":0},{"$f":"'شهر 10'!S156","v":0},{"$f":"'شهر 10'!T156","v":0},{"$f":"'شهر 10'!U156","v":0},{"$f":"'شهر 10'!V156","v":0},{"$f":"'شهر 10'!W156","v":0},{"$f":"'شهر 10'!X156","v":0},{"$f":"'شهر 10'!Y156","v":0},{"$f":"'شهر 10'!Z156","v":0},{"$f":"'شهر 10'!AA156","v":0},{"$f":"'شهر 10'!AB156","v":0},{"$f":"'شهر 10'!AC156","v":0},{"$f":"'شهر 10'!AD156","v":0},{"$f":"'شهر 10'!AE156","v":0},{"$f":"'شهر 10'!AF156","v":0},{"$f":"'شهر 10'!AG156","v":0},{"$f":"'شهر 10'!AH156","v":0}]
[78,"محمد عادل مرعي",{"$f":"'شهر 10'!AI157","v":0},{"$f":"'شهر 10'!AJ157","v":0},{"$f":"'شهر 10'!AK157","v":0},null,{"$f":"'شهر 10'!D157","v":0},{"$f":"'شهر 10'!E157","v":0},{"$f":"'شهر 10'!F157","v":0},{"$f":"'شهر 10'!G157","v":0},{"$f":"'شهر 10'!H157","v":0},{"$f":"'شهر 10'!I157","v":0},{"$f":"'شهر 10'!J157","v":0},{"$f":"'شهر 10'!K157","v":0},{"$f":"'شهر 10'!L157","v":0},{"$f":"'شهر 10'!M157","v":0},{"$f":"'شهر 10'!N157","v":0},{"$f":"'شهر 10'!O157","v":0},{"$f":"'شهر 10'!P157","v":0},{"$f":"'شهر 10'!Q157","v":0},{"$f":"'شهر 10'!R157","v":0},{"$f":"'شهر 10'!S157","v":0},{"$f":"'شهر 10'!T157","v":0},{"$f":"'شهر 10'!U157","v":0},{"$f":"'شهر 10'!V157","v":0},{"$f":"'شهر 10'!W157","v":0},{"$f":"'شهر 10'!X157","v":0},{"$f":"'شهر 10'!Y157","v":0},{"$f":"'شهر 10'!Z157","v":0},{"$f":"'شهر 10'!AA157","v":0},{"$f":"'شهر 10'!AB157","v":0},{"$f":"'شهر 10'!AC157","v":0},{"$f":"'شهر 10'!AD157","v":0},{"$f":"'شهر 10'!AE157","v":0},{"$f":"'شهر 10'!AF157","v":0},{"$f":"'شهر 10'!AG157","v":0},{"$f":"'شهر 10'!AH157","v":0}]
[null,null,null,null,null,null,{"$f":"'شهر 10'!D158","v":0},{"$f":"'شهر 10'!E158","v":0},{"$f":"'شهر 10'!F158","v":0},{"$f":"'شهر 10'!G158","v":0},{"$f":"'شهر 10'!H158","v":0},{"$f":"'شهر 10'!I158","v":0},{"$f":"'شهر 10'!J158","v":0},{"$f":"'شهر 10'!K158","v":0},{"$f":"'شهر 10'!L158","v":0},{"$f":"'شهر 10'!M158","v":0},{"$f":"'شهر 10'!N158","v":0},{"$f":"'شهر 10'!O158","v":0},{"$f":"'شهر 10'!P158","v":0},{"$f":"'شهر 10'!Q158","v":0},{"$f":"'شهر 10'!R158","v":0},{"$f":"'شهر 10'!S158","v":0},{"$f":"'شهر 10'!T158","v":0},{"$f":"'شهر 10'!U158","v":0},{"$f":"'شهر 10'!V158","v":0},{"$f":"'شهر 10'!W158","v":0},{"$f":"'شهر 10'!X158","v":0},{"$f":"'شهر 10'!Y158","v":0},{"$f":"'شهر 10'!Z158","v":0},{"$f":"'شهر 10'!AA158","v":0},{"$f":"'شهر 10'!AB158","v":0},{"$f":"'شهر 10'!AC158","v":0},{"$f":"'شهر 10'!AD158","v":0},{"$f":"'شهر 10'!AE158","v":0},{"$f":"'شهر 10'!AF158","v":0},{"$f":"'شهر 10'!AG158","v":0},{"$f":"'شهر 10'!AH158","v":0}]
[79,"محمد اسعد",{"$f":"'شهر 10'!AI159","v":0},{"$f":"'شهر 10'!AJ159","v":0},{"$f":"'شهر 10'!AK159","v":0},null,{"$f":"'شهر 10'!D159","v":0},{"$f":"'شهر 10'!E159","v":0},{"$f":"'شهر 10'!F159","v":0},{"$f":"'شهر 10'!G159","v":0},{"$f":"'شهر 10'!H159","v":0},{"$f":"'شهر 10'!I159","v":0},{"$f":"'شهر 10'!J159","v":0},{"$f":"'شهر 10'!K159","v":0},{"$f":"'شهر 10'!L159","v":0},{"$f":"'شهر 10'!M159","v":0},{"$f":"'شهر 10'!N159","v":0},{"$f":"'شهر 10'!O159","v":0},{"$f":"'شهر 10'!P159","v":0},{"$f":"'شهر 10'!Q159","v":0},{"$f":"'شهر 10'!R159","v":0},{"$f":"'شهر 10'!S159","v":0},{"$f":"'شهر 10'!T159","v":0},{"$f":"'شهر 10'!U159","v":0},{"$f":"'شهر 10'!V159","v":0},{"$f":"'شهر 10'!W159","v":0},{"$f":"'شهر 10'!X159","v":0},{"$f":"'شهر 10'!Y159","v":0},{"$f":"'شهر 10'!Z159","v":0},{"$f":"'شهر 10'!AA159","v":0},{"$f":"'شهر 10'!AB159","v":0},{"$f":"'شهر 10'!AC159","v":0},{"$f":"'شهر 10'!AD159","v":0},{"$f":"'شهر 10'!AE159","v":0},{"$f":"'شهر 10'!AF159","v":0},{"$f":"'شهر 10'!AG159","v":0},{"$f":"'شهر 10'!AH159","v":0}]
[null,null,null,null,null,null,{"$f":"'شهر 10'!D160","v":0},{"$f":"'شهر 10'!E160","v":0},{"$f":"'شهر 10'!F160","v":0},{"$f":"'شهر 10'!G160","v":0},{"$f":"'شهر 10'!H160","v":0},{"$f":"'شهر 10'!I160","v":0},{"$f":"'شهر 10'!J160","v":0},{"$f":"'شهر 10'!K160","v":0},{"$f":"'شهر 10'!L160","v":0},{"$f":"'شهر 10'!M160","v":0},{"$f":"'شهر 10'!N160","v":0},{"$f":"'شهر 10'!O160","v":0},{"$f":"'شهر 10'!P160","v":0},{"$f":"'شهر 10'!Q160","v":0},{"$f":"'شهر 10'!R160","v":0},{"$f":"'شهر 10'!S160","v":0},{"$f":"'شهر 10'!T160","v":0},{"$f":"'شهر 10'!U160","v":0},{"$f":"'شهر 10'!V160","v":0},{"$f":"'شهر 10'!W160","v":0},{"$f":"'شهر 10'!X160","v":0},{"$f":"'شهر 10'!Y160","v":0},{"$f":"'شهر 10'!Z160","v":0},{"$f":"'شهر 10'!AA160","v":0},{"$f":"'شهر 10'!AB160","v":0},{"$f":"'شهر 10'!AC160","v":0},{"$f":"'شهر 10'!AD160","v":0},{"$f":"'شهر 10'!AE160","v":0},{"$f":"'شهر 10'!AF160","v":0},{"$f":"'شهر 10'!AG160","v":0},{"$f":"'شهر 10'!AH160","v":0}]
[80,"المتولى محمد شحاتة",{"$f":"'شهر 10'!AI161","v":0},{"$f":"'شهر 10'!AJ161","v":0},{"$f":"'شهر 10'!AK161","v":0},null,{"$f":"'شهر 10'!D161","v":0},{"$f":"'شهر 10'!E161","v":0},{"$f":"'شهر 10'!F161","v":0},{"$f":"'شهر 10'!G161","v":0},{"$f":"'شهر 10'!H161","v":0},{"$f":"'شهر 10'!I161","v":0},{"$f":"'شهر 10'!J161","v":0},{"$f":"'شهر 10'!K161","v":0},{"$f":"'شهر 10'!L161","v":0},{"$f":"'شهر 10'!M161","v":0},{"$f":"'شهر 10'!N161","v":0},{"$f":"'شهر 10'!O161","v":0},{"$f":"'شهر 10'!P161","v":0},{"$f":"'شهر 10'!Q161","v":0},{"$f":"'شهر 10'!R161","v":0},{"$f":"'شهر 10'!S161","v":0},{"$f":"'شهر 10'!T161","v":0},{"$f":"'شهر 10'!U161","v":0},{"$f":"'شهر 10'!V161","v":0},{"$f":"'شهر 10'!W161","v":0},{"$f":"'شهر 10'!X161","v":0},{"$f":"'شهر 10'!Y161","v":0},{"$f":"'شهر 10'!Z161","v":0},{"$f":"'شهر 10'!AA161","v":0},{"$f":"'شهر 10'!AB161","v":0},{"$f":"'شهر 10'!AC161","v":0},{"$f":"'شهر 10'!AD161","v":0},{"$f":"'شهر 10'!AE161","v":0},{"$f":"'شهر 10'!AF161","v":0},{"$f":"'شهر 10'!AG161","v":0},{"$f":"'شهر 10'!AH161","v":0}]
[null,null,null,null,null,null,{"$f":"'شهر 10'!D162","v":0},{"$f":"'شهر 10'!E162","v":0},{"$f":"'شهر 10'!F162","v":0},{"$f":"'شهر 10'!G162","v":0},{"$f":"'شهر 10'!H162","v":0},{"$f":"'شهر 10'!I162","v":0},{"$f":"'شهر 10'!J162","v":0},{"$f":"'شهر 10'!K162","v":0},{"$f":"'شهر 10'!L162","v":0},{"$f":"'شهر 10'!M162","v":0},{"$f":"'شهر 10'!N162","v":0},{"$f":"'شهر 10'!O162","v":0},{"$f":"'شهر 10'!P162","v":0},{"$f":"'شهر 10'!Q162","v":0},{"$f":"'شهر 10'!R162","v":0},{"$f":"'شهر 10'!S162","v":0},{"$f":"'شهر 10'!T162","v":0},{"$f":"'شهر 10'!U162","v":0},{"$f":"'شهر 10'!V162","v":0},{"$f":"'شهر 10'!W162","v":0},{"$f":"'شهر 10'!X162","v":0},{"$f":"'شهر 10'!Y162","v":0},{"$f":"'شهر 10'!Z162","v":0},{"$f":"'شهر 10'!AA162","v":0},{"$f":"'شهر 10'!AB162","v":0},{"$f":"'شهر 10'!AC162","v":0},{"$f":"'شهر 10'!AD162","v":0},{"$f":"'شهر 10'!AE162","v":0},{"$f":"'شهر 10'!AF162","v":0},{"$f":"'شهر 10'!AG162","v":0},{"$f":"'شهر 10'!AH162","v":0}]
[81,"محمد عوضين الدكش",{"$f":"'شهر 10'!AI163","v":0},{"$f":"'شهر 10'!AJ163","v":0},{"$f":"'شهر 10'!AK163","v":0},null,{"$f":"'شهر 10'!D163","v":0},{"$f":"'شهر 10'!E163","v":0},{"$f":"'شهر 10'!F163","v":0},{"$f":"'شهر 10'!G163","v":0},{"$f":"'شهر 10'!H163","v":0},{"$f":"'شهر 10'!I163","v":0},{"$f":"'شهر 10'!J163","v":0},{"$f":"'شهر 10'!K163","v":0},{"$f":"'شهر 10'!L163","v":0},{"$f":"'شهر 10'!M163","v":0},{"$f":"'شهر 10'!N163","v":0},{"$f":"'شهر 10'!O163","v":0},{"$f":"'شهر 10'!P163","v":0},{"$f":"'شهر 10'!Q163","v":0},{"$f":"'شهر 10'!R163","v":0},{"$f":"'شهر 10'!S163","v":0},{"$f":"'شهر 10'!T163","v":0},{"$f":"'شهر 10'!U163","v":0},{"$f":"'شهر 10'!V163","v":0},{"$f":"'شهر 10'!W163","v":0},{"$f":"'شهر 10'!X163","v":0},{"$f":"'شهر 10'!Y163","v":0},{"$f":"'شهر 10'!Z163","v":0},{"$f":"'شهر 10'!AA163","v":0},{"$f":"'شهر 10'!AB163","v":0},{"$f":"'شهر 10'!AC163","v":0},{"$f":"'شهر 10'!AD163","v":0},{"$f":"'شهر 10'!AE163","v":0},{"$f":"'شهر 10'!AF163","v":0},{"$f":"'شهر 10'!AG163","v":0},{"$f":"'شهر 10'!AH163","v":0}]
[null,null,null,null,null,null,{"$f":"'شهر 10'!D164","v":0},{"$f":"'شهر 10'!E164","v":0},{"$f":"'شهر 10'!F164","v":0},{"$f":"'شهر 10'!G164","v":0},{"$f":"'شهر 10'!H164","v":0},{"$f":"'شهر 10'!I164","v":0},{"$f":"'شهر 10'!J164","v":0},{"$f":"'شهر 10'!K164","v":0},{"$f":"'شهر 10'!L164","v":0},{"$f":"'شهر 10'!M164","v":0},{"$f":"'شهر 10'!N164","v":0},{"$f":"'شهر 10'!O164","v":0},{"$f":"'شهر 10'!P164","v":0},{"$f":"'شهر 10'!Q164","v":0},{"$f":"'شهر 10'!R164","v":0},{"$f":"'شهر 10'!S164","v":0},{"$f":"'شهر 10'!T164","v":0},{"$f":"'شهر 10'!U164","v":0},{"$f":"'شهر 10'!V164","v":0},{"$f":"'شهر 10'!W164","v":0},{"$f":"'شهر 10'!X164","v":0},{"$f":"'شهر 10'!Y164","v":0},{"$f":"'شهر 10'!Z164","v":0},{"$f":"'شهر 10'!AA164","v":0},{"$f":"'شهر 10'!AB164","v":0},{"$f":"'شهر 10'!AC164","v":0},{"$f":"'شهر 10'!AD164","v":0},{"$f":"'شهر 10'!AE164","v":0},{"$f":"'شهر 10'!AF164","v":0},{"$f":"'شهر 10'!AG164","v":0},{"$f":"'شهر 10'!AH164","v":0}]
[82,"رجب الشحات",{"$f":"'شهر 10'!AI165","v":0},{"$f":"'شهر 10'!AJ165","v":0},{"$f":"'شهر 10'!AK165","v":0},null,{"$f":"'شهر 10'!D165","v":0},{"$f":"'شهر 10'!E165","v":0},{"$f":"'شهر 10'!F165","v":0},{"$f":"'شهر 10'!G165","v":0},{"$f":"'شهر 10'!H165","v":0},{"$f":"'شهر 10'!I165","v":0},{"$f":"'شهر 10'!J165","v":0},{"$f":"'شهر 10'!K165","v":0},{"$f":"'شهر 10'!L165","v":0},{"$f":"'شهر 10'!M165","v":0},{"$f":"'شهر 10'!N165","v":0},{"$f":"'شهر 10'!O165","v":0},{"$f":"'شهر 10'!P165","v":0},{"$f":"'شهر 10'!Q165","v":0},{"$f":"'شهر 10'!R165","v":0},{"$f":"'شهر 10'!S165","v":0},{"$f":"'شهر 10'!T165","v":0},{"$f":"'شهر 10'!U165","v":0},{"$f":"'شهر 10'!V165","v":0},{"$f":"'شهر 10'!W165","v":0},{"$f":"'شهر 10'!X165","v":0},{"$f":"'شهر 10'!Y165","v":0},{"$f":"'شهر 10'!Z165","v":0},{"$f":"'شهر 10'!AA165","v":0},{"$f":"'شهر 10'!AB165","v":0},{"$f":"'شهر 10'!AC165","v":0},{"$f":"'شهر 10'!AD165","v":0},{"$f":"'شهر 10'!AE165","v":0},{"$f":"'شهر 10'!AF165","v":0},{"$f":"'شهر 10'!AG165","v":0},{"$f":"'شهر 10'!AH165","v":0}]
[null,null,null,null,null,null,{"$f":"'شهر 10'!D166","v":0},{"$f":"'شهر 10'!E166","v":0},{"$f":"'شهر 10'!F166","v":0},{"$f":"'شهر 10'!G166","v":0},{"$f":"'شهر 10'!H166","v":0},{"$f":"'شهر 10'!I166","v":0},{"$f":"'شهر 10'!J166","v":0},{"$f":"'شهر 10'!K166","v":0},{"$f":"'شهر 10'!L166","v":0},{"$f":"'شهر 10'!M166","v":0},{"$f":"'شهر 10'!N166","v":0},{"$f":"'شهر 10'!O166","v":0},{"$f":"'شهر 10'!P166","v":0},{"$f":"'شهر 10'!Q166","v":0},{"$f":"'شهر 10'!R166","v":0},{"$f":"'شهر 10'!S166","v":0},{"$f":"'شهر 10'!T166","v":0},{"$f":"'شهر 10'!U166","v":0},{"$f":"'شهر 10'!V166","v":0},{"$f":"'شهر 10'!W166","v":0},{"$f":"'شهر 10'!X166","v":0},{"$f":"'شهر 10'!Y166","v":0},{"$f":"'شهر 10'!Z166","v":0},{"$f":"'شهر 10'!AA166","v":0},{"$f":"'شهر 10'!AB166","v":0},{"$f":"'شهر 10'!AC166","v":0},{"$f":"'شهر 10'!AD166","v":0},{"$f":"'شهر 10'!AE166","v":0},{"$f":"'شهر 10'!AF166","v":0},{"$f":"'شهر 10'!AG166","v":0},{"$f":"'شهر 10'!AH166","v":0}]
[83,"احمد عبد السلام المتبولى",{"$f":"'شهر 10'!AI167","v":0},{"$f":"'شهر 10'!AJ167","v":0},{"$f":"'شهر 10'!AK167","v":0},null,{"$f":"'شهر 10'!D167","v":0},{"$f":"'شهر 10'!E167","v":0},{"$f":"'شهر 10'!F167","v":0},{"$f":"'شهر 10'!G167","v":0},{"$f":"'شهر 10'!H167","v":0},{"$f":"'شهر 10'!I167","v":0},{"$f":"'شهر 10'!J167","v":0},{"$f":"'شهر 10'!K167","v":0},{"$f":"'شهر 10'!L167","v":0},{"$f":"'شهر 10'!M167","v":0},{"$f":"'شهر 10'!N167","v":0},{"$f":"'شهر 10'!O167","v":0},{"$f":"'شهر 10'!P167","v":0},{"$f":"'شهر 10'!Q167","v":0},{"$f":"'شهر 10'!R167","v":0},{"$f":"'شهر 10'!S167","v":0},{"$f":"'شهر 10'!T167","v":0},{"$f":"'شهر 10'!U167","v":0},{"$f":"'شهر 10'!V167","v":0},{"$f":"'شهر 10'!W167","v":0},{"$f":"'شهر 10'!X167","v":0},{"$f":"'شهر 10'!Y167","v":0},{"$f":"'شهر 10'!Z167","v":0},{"$f":"'شهر 10'!AA167","v":0},{"$f":"'شهر 10'!AB167","v":0},{"$f":"'شهر 10'!AC167","v":0},{"$f":"'شهر 10'!AD167","v":0},{"$f":"'شهر 10'!AE167","v":0},{"$f":"'شهر 10'!AF167","v":0},{"$f":"'شهر 10'!AG167","v":0},{"$f":"'شهر 10'!AH167","v":0}]
[null,null,null,null,null,null,{"$f":"'شهر 10'!D168","v":0},{"$f":"'شهر 10'!E168","v":0},{"$f":"'شهر 10'!F168","v":0},{"$f":"'شهر 10'!G168","v":0},{"$f":"'شهر 10'!H168","v":0},{"$f":"'شهر 10'!I168","v":0},{"$f":"'شهر 10'!J168","v":0},{"$f":"'شهر 10'!K168","v":0},{"$f":"'شهر 10'!L168","v":0},{"$f":"'شهر 10'!M168","v":0},{"$f":"'شهر 10'!N168","v":0},{"$f":"'شهر 10'!O168","v":0},{"$f":"'شهر 10'!P168","v":0},{"$f":"'شهر 10'!Q168","v":0},{"$f":"'شهر 10'!R168","v":0},{"$f":"'شهر 10'!S168","v":0},{"$f":"'شهر 10'!T168","v":0},{"$f":"'شهر 10'!U168","v":0},{"$f":"'شهر 10'!V168","v":0},{"$f":"'شهر 10'!W168","v":0},{"$f":"'شهر 10'!X168","v":0},{"$f":"'شهر 10'!Y168","v":0},{"$f":"'شهر 10'!Z168","v":0},{"$f":"'شهر 10'!AA168","v":0},{"$f":"'شهر 10'!AB168","v":0},{"$f":"'شهر 10'!AC168","v":0},{"$f":"'شهر 10'!AD168","v":0},{"$f":"'شهر 10'!AE168","v":0},{"$f":"'شهر 10'!AF168","v":0},{"$f":"'شهر 10'!AG168","v":0},{"$f":"'شهر 10'!AH168","v":0}]
[84,"كريم شريف المتبولى",{"$f":"'شهر 10'!AI169","v":0},{"$f":"'شهر 10'!AJ169","v":0},{"$f":"'شهر 10'!AK169","v":0},null,{"$f":"'شهر 10'!D169","v":0},{"$f":"'شهر 10'!E169","v":0},{"$f":"'شهر 10'!F169","v":0},{"$f":"'شهر 10'!G169","v":0},{"$f":"'شهر 10'!H169","v":0},{"$f":"'شهر 10'!I169","v":0},{"$f":"'شهر 10'!J169","v":0},{"$f":"'شهر 10'!K169","v":0},{"$f":"'شهر 10'!L169","v":0},{"$f":"'شهر 10'!M169","v":0},{"$f":"'شهر 10'!N169","v":0},{"$f":"'شهر 10'!O169","v":0},{"$f":"'شهر 10'!P169","v":0},{"$f":"'شهر 10'!Q169","v":0},{"$f":"'شهر 10'!R169","v":0},{"$f":"'شهر 10'!S169","v":0},{"$f":"'شهر 10'!T169","v":0},{"$f":"'شهر 10'!U169","v":0},{"$f":"'شهر 10'!V169","v":0},{"$f":"'شهر 10'!W169","v":0},{"$f":"'شهر 10'!X169","v":0},{"$f":"'شهر 10'!Y169","v":0},{"$f":"'شهر 10'!Z169","v":0},{"$f":"'شهر 10'!AA169","v":0},{"$f":"'شهر 10'!AB169","v":0},{"$f":"'شهر 10'!AC169","v":0},{"$f":"'شهر 10'!AD169","v":0},{"$f":"'شهر 10'!AE169","v":0},{"$f":"'شهر 10'!AF169","v":0},{"$f":"'شهر 10'!AG169","v":0},{"$f":"'شهر 10'!AH169","v":0}]
[null,null,null,null,null,null,{"$f":"'شهر 10'!D170","v":0},{"$f":"'شهر 10'!E170","v":0},{"$f":"'شهر 10'!F170","v":0},{"$f":"'شهر 10'!G170","v":0},{"$f":"'شهر 10'!H170","v":0},{"$f":"'شهر 10'!I170","v":0},{"$f":"'شهر 10'!J170","v":0},{"$f":"'شهر 10'!K170","v":0},{"$f":"'شهر 10'!L170","v":0},{"$f":"'شهر 10'!M170","v":0},{"$f":"'شهر 10'!N170","v":0},{"$f":"'شهر 10'!O170","v":0},{"$f":"'شهر 10'!P170","v":0},{"$f":"'شهر 10'!Q170","v":0},{"$f":"'شهر 10'!R170","v":0},{"$f":"'شهر 10'!S170","v":0},{"$f":"'شهر 10'!T170","v":0},{"$f":"'شهر 10'!U170","v":0},{"$f":"'شهر 10'!V170","v":0},{"$f":"'شهر 10'!W170","v":0},{"$f":"'شهر 10'!X170","v":0},{"$f":"'شهر 10'!Y170","v":0},{"$f":"'شهر 10'!Z170","v":0},{"$f":"'شهر 10'!AA170","v":0},{"$f":"'شهر 10'!AB170","v":0},{"$f":"'شهر 10'!AC170","v":0},{"$f":"'شهر 10'!AD170","v":0},{"$f":"'شهر 10'!AE170","v":0},{"$f":"'شهر 10'!AF170","v":0},{"$f":"'شهر 10'!AG170","v":0},{"$f":"'شهر 10'!AH170","v":0}]
[85,"ابراهيم العيسوى",{"$f":"'شهر 10'!AI171","v":0},{"$f":"'شهر 10'!AJ171","v":0},{"$f":"'شهر 10'!AK171","v":0},null,{"$f":"'شهر 10'!D171","v":0},{"$f":"'شهر 10'!E171","v":0},{"$f":"'شهر 10'!F171","v":0},{"$f":"'شهر 10'!G171","v":0},{"$f":"'شهر 10'!H171","v":0},{"$f":"'شهر 10'!I171","v":0},{"$f":"'شهر 10'!J171","v":0},{"$f":"'شهر 10'!K171","v":0},{"$f":"'شهر 10'!L171","v":0},{"$f":"'شهر 10'!M171","v":0},{"$f":"'شهر 10'!N171","v":0},{"$f":"'شهر 10'!O171","v":0},{"$f":"'شهر 10'!P171","v":0},{"$f":"'شهر 10'!Q171","v":0},{"$f":"'شهر 10'!R171","v":0},{"$f":"'شهر 10'!S171","v":0},{"$f":"'شهر 10'!T171","v":0},{"$f":"'شهر 10'!U171","v":0},{"$f":"'شهر 10'!V171","v":0},{"$f":"'شهر 10'!W171","v":0},{"$f":"'شهر 10'!X171","v":0},{"$f":"'شهر 10'!Y171","v":0},{"$f":"'شهر 10'!Z171","v":0},{"$f":"'شهر 10'!AA171","v":0},{"$f":"'شهر 10'!AB171","v":0},{"$f":"'شهر 10'!AC171","v":0},{"$f":"'شهر 10'!AD171","v":0},{"$f":"'شهر 10'!AE171","v":0},{"$f":"'شهر 10'!AF171","v":0},{"$f":"'شهر 10'!AG171","v":0},{"$f":"'شهر 10'!AH171","v":0}]
[null,null,null,null,null,null,{"$f":"'شهر 10'!D172","v":0},{"$f":"'شهر 10'!E172","v":0},{"$f":"'شهر 10'!F172","v":0},{"$f":"'شهر 10'!G172","v":0},{"$f":"'شهر 10'!H172","v":0},{"$f":"'شهر 10'!I172","v":0},{"$f":"'شهر 10'!J172","v":0},{"$f":"'شهر 10'!K172","v":0},{"$f":"'شهر 10'!L172","v":0},{"$f":"'شهر 10'!M172","v":0},{"$f":"'شهر 10'!N172","v":0},{"$f":"'شهر 10'!O172","v":0},{"$f":"'شهر 10'!P172","v":0},{"$f":"'شهر 10'!Q172","v":0},{"$f":"'شهر 10'!R172","v":0},{"$f":"'شهر 10'!S172","v":0},{"$f":"'شهر 10'!T172","v":0},{"$f":"'شهر 10'!U172","v":0},{"$f":"'شهر 10'!V172","v":0},{"$f":"'شهر 10'!W172","v":0},{"$f":"'شهر 10'!X172","v":0},{"$f":"'شهر 10'!Y172","v":0},{"$f":"'شهر 10'!Z172","v":0},{"$f":"'شهر 10'!AA172","v":0},{"$f":"'شهر 10'!AB172","v":0},{"$f":"'شهر 10'!AC172","v":0},{"$f":"'شهر 10'!AD172","v":0},{"$f":"'شهر 10'!AE172","v":0},{"$f":"'شهر 10'!AF172","v":0},{"$f":"'شهر 10'!AG172","v":0},{"$f":"'شهر 10'!AH172","v":0}]
[86,"محمود محمد ياسين",{"$f":"'شهر 10'!AI173","v":0},{"$f":"'شهر 10'!AJ173","v":0},{"$f":"'شهر 10'!AK173","v":0},null,{"$f":"'شهر 10'!D173","v":0},{"$f":"'شهر 10'!E173","v":0},{"$f":"'شهر 10'!F173","v":0},{"$f":"'شهر 10'!G173","v":0},{"$f":"'شهر 10'!H173","v":0},{"$f":"'شهر 10'!I173","v":0},{"$f":"'شهر 10'!J173","v":0},{"$f":"'شهر 10'!K173","v":0},{"$f":"'شهر 10'!L173","v":0},{"$f":"'شهر 10'!M173","v":0},{"$f":"'شهر 10'!N173","v":0},{"$f":"'شهر 10'!O173","v":0},{"$f":"'شهر 10'!P173","v":0},{"$f":"'شهر 10'!Q173","v":0},{"$f":"'شهر 10'!R173","v":0},{"$f":"'شهر 10'!S173","v":0},{"$f":"'شهر 10'!T173","v":0},{"$f":"'شهر 10'!U173","v":0},{"$f":"'شهر 10'!V173","v":0},{"$f":"'شهر 10'!W173","v":0},{"$f":"'شهر 10'!X173","v":0},{"$f":"'شهر 10'!Y173","v":0},{"$f":"'شهر 10'!Z173","v":0},{"$f":"'شهر 10'!AA173","v":0},{"$f":"'شهر 10'!AB173","v":0},{"$f":"'شهر 10'!AC173","v":0},{"$f":"'شهر 10'!AD173","v":0},{"$f":"'شهر 10'!AE173","v":0},{"$f":"'شهر 10'!AF173","v":0},{"$f":"'شهر 10'!AG173","v":0},{"$f":"'شهر 10'!AH173","v":0}]
[null,null,null,null,null,null,{"$f":"'شهر 10'!D174","v":0},{"$f":"'شهر 10'!E174","v":0},{"$f":"'شهر 10'!F174","v":0},{"$f":"'شهر 10'!G174","v":0},{"$f":"'شهر 10'!H174","v":0},{"$f":"'شهر 10'!I174","v":0},{"$f":"'شهر 10'!J174","v":0},{"$f":"'شهر 10'!K174","v":0},{"$f":"'شهر 10'!L174","v":0},{"$f":"'شهر 10'!M174","v":0},{"$f":"'شهر 10'!N174","v":0},{"$f":"'شهر 10'!O174","v":0},{"$f":"'شهر 10'!P174","v":0},{"$f":"'شهر 10'!Q174","v":0},{"$f":"'شهر 10'!R174","v":0},{"$f":"'شهر 10'!S174","v":0},{"$f":"'شهر 10'!T174","v":0},{"$f":"'شهر 10'!U174","v":0},{"$f":"'شهر 10'!V174","v":0},{"$f":"'شهر 10'!W174","v":0},{"$f":"'شهر 10'!X174","v":0},{"$f":"'شهر 10'!Y174","v":0},{"$f":"'شهر 10'!Z174","v":0},{"$f":"'شهر 10'!AA174","v":0},{"$f":"'شهر 10'!AB174","v":0},{"$f":"'شهر 10'!AC174","v":0},{"$f":"'شهر 10'!AD174","v":0},{"$f":"'شهر 10'!AE174","v":0},{"$f":"'شهر 10'!AF174","v":0},{"$f":"'شهر 10'!AG174","v":0},{"$f":"'شهر 10'!AH174","v":0}]
[87,"شعبان ابراهيم (القاهرة)",{"$f":"'شهر 10'!AI175","v":0},{"$f":"'شهر 10'!AJ175","v":0},{"$f":"'شهر 10'!AK175","v":0},null,{"$f":"'شهر 10'!D175","v":0},{"$f":"'شهر 10'!E175","v":0},{"$f":"'شهر 10'!F175","v":0},{"$f":"'شهر 10'!G175","v":0},{"$f":"'شهر 10'!H175","v":0},{"$f":"'شهر 10'!I175","v":0},{"$f":"'شهر 10'!J175","v":0},{"$f":"'شهر 10'!K175","v":0},{"$f":"'شهر 10'!L175","v":0},{"$f":"'شهر 10'!M175","v":0},{"$f":"'شهر 10'!N175","v":0},{"$f":"'شهر 10'!O175","v":0},{"$f":"'شهر 10'!P175","v":0},{"$f":"'شهر 10'!Q175","v":0},{"$f":"'شهر 10'!R175","v":0},{"$f":"'شهر 10'!S175","v":0},{"$f":"'شهر 10'!T175","v":0},{"$f":"'شهر 10'!U175","v":0},{"$f":"'شهر 10'!V175","v":0},{"$f":"'شهر 10'!W175","v":0},{"$f":"'شهر 10'!X175","v":0},{"$f":"'شهر 10'!Y175","v":0},{"$f":"'شهر 10'!Z175","v":0},{"$f":"'شهر 10'!AA175","v":0},{"$f":"'شهر 10'!AB175","v":0},{"$f":"'شهر 10'!AC175","v":0},{"$f":"'شهر 10'!AD175","v":0},{"$f":"'شهر 10'!AE175","v":0},{"$f":"'شهر 10'!AF175","v":0},{"$f":"'شهر 10'!AG175","v":0},{"$f":"'شهر 10'!AH175","v":0}]
[null,null,null,null,null,null,{"$f":"'شهر 10'!D176","v":0},{"$f":"'شهر 10'!E176","v":0},{"$f":"'شهر 10'!F176","v":0},{"$f":"'شهر 10'!G176","v":0},{"$f":"'شهر 10'!H176","v":0},{"$f":"'شهر 10'!I176","v":0},{"$f":"'شهر 10'!J176","v":0},{"$f":"'شهر 10'!K176","v":0},{"$f":"'شهر 10'!L176","v":0},{"$f":"'شهر 10'!M176","v":0},{"$f":"'شهر 10'!N176","v":0},{"$f":"'شهر 10'!O176","v":0},{"$f":"'شهر 10'!P176","v":0},{"$f":"'شهر 10'!Q176","v":0},{"$f":"'شهر 10'!R176","v":0},{"$f":"'شهر 10'!S176","v":0},{"$f":"'شهر 10'!T176","v":0},{"$f":"'شهر 10'!U176","v":0},{"$f":"'شهر 10'!V176","v":0},{"$f":"'شهر 10'!W176","v":0},{"$f":"'شهر 10'!X176","v":0},{"$f":"'شهر 10'!Y176","v":0},{"$f":"'شهر 10'!Z176","v":0},{"$f":"'شهر 10'!AA176","v":0},{"$f":"'شهر 10'!AB176","v":0},{"$f":"'شهر 10'!AC176","v":0},{"$f":"'شهر 10'!AD176","v":0},{"$f":"'شهر 10'!AE176","v":0},{"$f":"'شهر 10'!AF176","v":0},{"$f":"'شهر 10'!AG176","v":0},{"$f":"'شهر 10'!AH176","v":0}]
[88,null,{"$f":"'شهر 10'!AI177","v":0},{"$f":"'شهر 10'!AJ177","v":0},{"$f":"'شهر 10'!AK177","v":0},null,{"$f":"'شهر 10'!D177","v":0},{"$f":"'شهر 10'!E177","v":0},{"$f":"'شهر 10'!F177","v":0},{"$f":"'شهر 10'!G177","v":0},{"$f":"'شهر 10'!H177","v":0},{"$f":"'شهر 10'!I177","v":0},{"$f":"'شهر 10'!J177","v":0},{"$f":"'شهر 10'!K177","v":0},{"$f":"'شهر 10'!L177","v":0},{"$f":"'شهر 10'!M177","v":0},{"$f":"'شهر 10'!N177","v":0},{"$f":"'شهر 10'!O177","v":0},{"$f":"'شهر 10'!P177","v":0},{"$f":"'شهر 10'!Q177","v":0},{"$f":"'شهر 10'!R177","v":0},{"$f":"'شهر 10'!S177","v":0},{"$f":"'شهر 10'!T177","v":0},{"$f":"'شهر 10'!U177","v":0},{"$f":"'شهر 10'!V177","v":0},{"$f":"'شهر 10'!W177","v":0},{"$f":"'شهر 10'!X177","v":0},{"$f":"'شهر 10'!Y177","v":0},{"$f":"'شهر 10'!Z177","v":0},{"$f":"'شهر 10'!AA177","v":0},{"$f":"'شهر 10'!AB177","v":0},{"$f":"'شهر 10'!AC177","v":0},{"$f":"'شهر 10'!AD177","v":0},{"$f":"'شهر 10'!AE177","v":0},{"$f":"'شهر 10'!AF177","v":0},{"$f":"'شهر 10'!AG177","v":0},{"$f":"'شهر 10'!AH177","v":0}]
[null,null,null,null,null,null,{"$f":"'شهر 10'!D178","v":0},{"$f":"'شهر 10'!E178","v":0},{"$f":"'شهر 10'!F178","v":0},{"$f":"'شهر 10'!G178","v":0},{"$f":"'شهر 10'!H178","v":0},{"$f":"'شهر 10'!I178","v":0},{"$f":"'شهر 10'!J178","v":0},{"$f":"'شهر 10'!K178","v":0},{"$f":"'شهر 10'!L178","v":0},{"$f":"'شهر 10'!M178","v":0},{"$f":"'شهر 10'!N178","v":0},{"$f":"'شهر 10'!O178","v":0},{"$f":"'شهر 10'!P178","v":0},{"$f":"'شهر 10'!Q178","v":0},{"$f":"'شهر 10'!R178","v":0},{"$f":"'شهر 10'!S178","v":0},{"$f":"'شهر 10'!T178","v":0},{"$f":"'شهر 10'!U178","v":0},{"$f":"'شهر 10'!V178","v":0},{"$f":"'شهر 10'!W178","v":0},{"$f":"'شهر 10'!X178","v":0},{"$f":"'شهر 10'!Y178","v":0},{"$f":"'شهر 10'!Z178","v":0},{"$f":"'شهر 10'!AA178","v":0},{"$f":"'شهر 10'!AB178","v":0},{"$f":"'شهر 10'!AC178","v":0},{"$f":"'شهر 10'!AD178","v":0},{"$f":"'شهر 10'!AE178","v":0},{"$f":"'شهر 10'!AF178","v":0},{"$f":"'شهر 10'!AG178","v":0},{"$f":"'شهر 10'!AH178","v":0}]
[89,null,{"$f":"'شهر 10'!AI179","v":0},{"$f":"'شهر 10'!AJ179","v":0},{"$f":"'شهر 10'!AK179","v":0},null,{"$f":"'شهر 10'!D179","v":0},{"$f":"'شهر 10'!E179","v":0},{"$f":"'شهر 10'!F179","v":0},{"$f":"'شهر 10'!G179","v":0},{"$f":"'شهر 10'!H179","v":0},{"$f":"'شهر 10'!I179","v":0},{"$f":"'شهر 10'!J179","v":0},{"$f":"'شهر 10'!K179","v":0},{"$f":"'شهر 10'!L179","v":0},{"$f":"'شهر 10'!M179","v":0},{"$f":"'شهر 10'!N179","v":0},{"$f":"'شهر 10'!O179","v":0},{"$f":"'شهر 10'!P179","v":0},{"$f":"'شهر 10'!Q179","v":0},{"$f":"'شهر 10'!R179","v":0},{"$f":"'شهر 10'!S179","v":0},{"$f":"'شهر 10'!T179","v":0},{"$f":"'شهر 10'!U179","v":0},{"$f":"'شهر 10'!V179","v":0},{"$f":"'شهر 10'!W179","v":0},{"$f":"'شهر 10'!X179","v":0},{"$f":"'شهر 10'!Y179","v":0},{"$f":"'شهر 10'!Z179","v":0},{"$f":"'شهر 10'!AA179","v":0},{"$f":"'شهر 10'!AB179","v":0},{"$f":"'شهر 10'!AC179","v":0},{"$f":"'شهر 10'!AD179","v":0},{"$f":"'شهر 10'!AE179","v":0},{"$f":"'شهر 10'!AF179","v":0},{"$f":"'شهر 10'!AG179","v":0},{"$f":"'شهر 10'!AH179","v":0}]
[null,null,null,null,null,null,{"$f":"'شهر 10'!D180","v":0},{"$f":"'شهر 10'!E180","v":0},{"$f":"'شهر 10'!F180","v":0},{"$f":"'شهر 10'!G180","v":0},{"$f":"'شهر 10'!H180","v":0},{"$f":"'شهر 10'!I180","v":0},{"$f":"'شهر 10'!J180","v":0},{"$f":"'شهر 10'!K180","v":0},{"$f":"'شهر 10'!L180","v":0},{"$f":"'شهر 10'!M180","v":0},{"$f":"'شهر 10'!N180","v":0},{"$f":"'شهر 10'!O180","v":0},{"$f":"'شهر 10'!P180","v":0},{"$f":"'شهر 10'!Q180","v":0},{"$f":"'شهر 10'!R180","v":0},{"$f":"'شهر 10'!S180","v":0},{"$f":"'شهر 10'!T180","v":0},{"$f":"'شهر 10'!U180","v":0},{"$f":"'شهر 10'!V180","v":0},{"$f":"'شهر 10'!W180","v":0},{"$f":"'شهر 10'!X180","v":0},{"$f":"'شهر 10'!Y180","v":0},{"$f":"'شهر 10'!Z180","v":0},{"$f":"'شهر 10'!AA180","v":0},{"$f":"'شهر 10'!AB180","v":0},{"$f":"'شهر 10'!AC180","v":0},{"$f":"'شهر 10'!AD180","v":0},{"$f":"'شهر 10'!AE180","v":0},{"$f":"'شهر 10'!AF180","v":0},{"$f":"'شهر 10'!AG180","v":0},{"$f":"'شهر 10'!AH180","v":0}]
[90,null,{"$f":"'شهر 10'!AI181","v":0},{"$f":"'شهر 10'!AJ181","v":0},{"$f":"'شهر 10'!AK181","v":0},null,{"$f":"'شهر 10'!D181","v":0},{"$f":"'شهر 10'!E181","v":0},{"$f":"'شهر 10'!F181","v":0},{"$f":"'شهر 10'!G181","v":0},{"$f":"'شهر 10'!H181","v":0},{"$f":"'شهر 10'!I181","v":0},{"$f":"'شهر 10'!J181","v":0},{"$f":"'شهر 10'!K181","v":0},{"$f":"'شهر 10'!L181","v":0},{"$f":"'شهر 10'!M181","v":0},{"$f":"'شهر 10'!N181","v":0},{"$f":"'شهر 10'!O181","v":0},{"$f":"'شهر 10'!P181","v":0},{"$f":"'شهر 10'!Q181","v":0},{"$f":"'شهر 10'!R181","v":0},{"$f":"'شهر 10'!S181","v":0},{"$f":"'شهر 10'!T181","v":0},{"$f":"'شهر 10'!U181","v":0},{"$f":"'شهر 10'!V181","v":0},{"$f":"'شهر 10'!W181","v":0},{"$f":"'شهر 10'!X181","v":0},{"$f":"'شهر 10'!Y181","v":0},{"$f":"'شهر 10'!Z181","v":0},{"$f":"'شهر 10'!AA181","v":0},{"$f":"'شهر 10'!AB181","v":0},{"$f":"'شهر 10'!AC181","v":0},{"$f":"'شهر 10'!AD181","v":0},{"$f":"'شهر 10'!AE181","v":0},{"$f":"'شهر 10'!AF181","v":0},{"$f":"'شهر 10'!AG181","v":0},{"$f":"'شهر 10'!AH181","v":0}]
[null,null,null,null,null,null,{"$f":"'شهر 10'!D182","v":0},{"$f":"'شهر 10'!E182","v":0},{"$f":"'شهر 10'!F182","v":0},{"$f":"'شهر 10'!G182","v":0},{"$f":"'شهر 10'!H182","v":0},{"$f":"'شهر 10'!I182","v":0},{"$f":"'شهر 10'!J182","v":0},{"$f":"'شهر 10'!K182","v":0},{"$f":"'شهر 10'!L182","v":0},{"$f":"'شهر 10'!M182","v":0},{"$f":"'شهر 10'!N182","v":0},{"$f":"'شهر 10'!O182","v":0},{"$f":"'شهر 10'!P182","v":0},{"$f":"'شهر 10'!Q182","v":0},{"$f":"'شهر 10'!R182","v":0},{"$f":"'شهر 10'!S182","v":0},{"$f":"'شهر 10'!T182","v":0},{"$f":"'شهر 10'!U182","v":0},{"$f":"'شهر 10'!V182","v":0},{"$f":"'شهر 10'!W182","v":0},{"$f":"'شهر 10'!X182","v":0},{"$f":"'شهر 10'!Y182","v":0},{"$f":"'شهر 10'!Z182","v":0},{"$f":"'شهر 10'!AA182","v":0},{"$f":"'شهر 10'!AB182","v":0},{"$f":"'شهر 10'!AC182","v":0},{"$f":"'شهر 10'!AD182","v":0},{"$f":"'شهر 10'!AE182","v":0},{"$f":"'شهر 10'!AF182","v":0},{"$f":"'شهر 10'!AG182","v":0},{"$f":"'شهر 10'!AH182","v":0}]
[91,null,{"$f":"'شهر 10'!AI183","v":0},{"$f":"'شهر 10'!AJ183","v":0},{"$f":"'شهر 10'!AK183","v":0},null,{"$f":"'شهر 10'!D183","v":0},{"$f":"'شهر 10'!E183","v":0},{"$f":"'شهر 10'!F183","v":0},{"$f":"'شهر 10'!G183","v":0},{"$f":"'شهر 10'!H183","v":0},{"$f":"'شهر 10'!I183","v":0},{"$f":"'شهر 10'!J183","v":0},{"$f":"'شهر 10'!K183","v":0},{"$f":"'شهر 10'!L183","v":0},{"$f":"'شهر 10'!M183","v":0},{"$f":"'شهر 10'!N183","v":0},{"$f":"'شهر 10'!O183","v":0},{"$f":"'شهر 10'!P183","v":0},{"$f":"'شهر 10'!Q183","v":0},{"$f":"'شهر 10'!R183","v":0},{"$f":"'شهر 10'!S183","v":0},{"$f":"'شهر 10'!T183","v":0},{"$f":"'شهر 10'!U183","v":0},{"$f":"'شهر 10'!V183","v":0},{"$f":"'شهر 10'!W183","v":0},{"$f":"'شهر 10'!X183","v":0},{"$f":"'شهر 10'!Y183","v":0},{"$f":"'شهر 10'!Z183","v":0},{"$f":"'شهر 10'!AA183","v":0},{"$f":"'شهر 10'!AB183","v":0},{"$f":"'شهر 10'!AC183","v":0},{"$f":"'شهر 10'!AD183","v":0},{"$f":"'شهر 10'!AE183","v":0},{"$f":"'شهر 10'!AF183","v":0},{"$f":"'شهر 10'!AG183","v":0},{"$f":"'شهر 10'!AH183","v":0}]
[null,null,null,null,null,null,{"$f":"'شهر 10'!D184","v":0},{"$f":"'شهر 10'!E184","v":0},{"$f":"'شهر 10'!F184","v":0},{"$f":"'شهر 10'!G184","v":0},{"$f":"'شهر 10'!H184","v":0},{"$f":"'شهر 10'!I184","v":0},{"$f":"'شهر 10'!J184","v":0},{"$f":"'شهر 10'!K184","v":0},{"$f":"'شهر 10'!L184","v":0},{"$f":"'شهر 10'!M184","v":0},{"$f":"'شهر 10'!N184","v":0},{"$f":"'شهر 10'!O184","v":0},{"$f":"'شهر 10'!P184","v":0},{"$f":"'شهر 10'!Q184","v":0},{"$f":"'شهر 10'!R184","v":0},{"$f":"'شهر 10'!S184","v":0},{"$f":"'شهر 10'!T184","v":0},{"$f":"'شهر 10'!U184","v":0},{"$f":"'شهر 10'!V184","v":0},{"$f":"'شهر 10'!W184","v":0},{"$f":"'شهر 10'!X184","v":0},{"$f":"'شهر 10'!Y184","v":0},{"$f":"'شهر 10'!Z184","v":0},{"$f":"'شهر 10'!AA184","v":0},{"$f":"'شهر 10'!AB184","v":0},{"$f":"'شهر 10'!AC184","v":0},{"$f":"'شهر 10'!AD184","v":0},{"$f":"'شهر 10'!AE184","v":0},{"$f":"'شهر 10'!AF184","v":0},{"$f":"'شهر 10'!AG184","v":0},{"$f":"'شهر 10'!AH184","v":0}]
[92,null,{"$f":"'شهر 10'!AI185","v":0},{"$f":"'شهر 10'!AJ185","v":0},{"$f":"'شهر 10'!AK185","v":0},null,{"$f":"'شهر 10'!D185","v":0},{"$f":"'شهر 10'!E185","v":0},{"$f":"'شهر 10'!F185","v":0},{"$f":"'شهر 10'!G185","v":0},{"$f":"'شهر 10'!H185","v":0},{"$f":"'شهر 10'!I185","v":0},{"$f":"'شهر 10'!J185","v":0},{"$f":"'شهر 10'!K185","v":0},{"$f":"'شهر 10'!L185","v":0},{"$f":"'شهر 10'!M185","v":0},{"$f":"'شهر 10'!N185","v":0},{"$f":"'شهر 10'!O185","v":0},{"$f":"'شهر 10'!P185","v":0},{"$f":"'شهر 10'!Q185","v":0},{"$f":"'شهر 10'!R185","v":0},{"$f":"'شهر 10'!S185","v":0},{"$f":"'شهر 10'!T185","v":0},{"$f":"'شهر 10'!U185","v":0},{"$f":"'شهر 10'!V185","v":0},{"$f":"'شهر 10'!W185","v":0},{"$f":"'شهر 10'!X185","v":0},{"$f":"'شهر 10'!Y185","v":0},{"$f":"'شهر 10'!Z185","v":0},{"$f":"'شهر 10'!AA185","v":0},{"$f":"'شهر 10'!AB185","v":0},{"$f":"'شهر 10'!AC185","v":0},{"$f":"'شهر 10'!AD185","v":0},{"$f":"'شهر 10'!AE185","v":0},{"$f":"'شهر 10'!AF185","v":0},{"$f":"'شهر 10'!AG185","v":0},{"$f":"'شهر 10'!AH185","v":0}]
[null,null,null,null,null,null,{"$f":"'شهر 10'!D186","v":0},{"$f":"'شهر 10'!E186","v":0},{"$f":"'شهر 10'!F186","v":0},{"$f":"'شهر 10'!G186","v":0},{"$f":"'شهر 10'!H186","v":0},{"$f":"'شهر 10'!I186","v":0},{"$f":"'شهر 10'!J186","v":0},{"$f":"'شهر 10'!K186","v":0},{"$f":"'شهر 10'!L186","v":0},{"$f":"'شهر 10'!M186","v":0},{"$f":"'شهر 10'!N186","v":0},{"$f":"'شهر 10'!O186","v":0},{"$f":"'شهر 10'!P186","v":0},{"$f":"'شهر 10'!Q186","v":0},{"$f":"'شهر 10'!R186","v":0},{"$f":"'شهر 10'!S186","v":0},{"$f":"'شهر 10'!T186","v":0},{"$f":"'شهر 10'!U186","v":0},{"$f":"'شهر 10'!V186","v":0},{"$f":"'شهر 10'!W186","v":0},{"$f":"'شهر 10'!X186","v":0},{"$f":"'شهر 10'!Y186","v":0},{"$f":"'شهر 10'!Z186","v":0},{"$f":"'شهر 10'!AA186","v":0},{"$f":"'شهر 10'!AB186","v":0},{"$f":"'شهر 10'!AC186","v":0},{"$f":"'شهر 10'!AD186","v":0},{"$f":"'شهر 10'!AE186","v":0},{"$f":"'شهر 10'!AF186","v":0},{"$f":"'شهر 10'!AG186","v":0},{"$f":"'شهر 10'!AH186","v":0}]
[93,null,{"$f":"'شهر 10'!AI187","v":0},{"$f":"'شهر 10'!AJ187","v":0},{"$f":"'شهر 10'!AK187","v":0},null,{"$f":"'شهر 10'!D187","v":0},{"$f":"'شهر 10'!E187","v":0},{"$f":"'شهر 10'!F187","v":0},{"$f":"'شهر 10'!G187","v":0},{"$f":"'شهر 10'!H187","v":0},{"$f":"'شهر 10'!I187","v":0},{"$f":"'شهر 10'!J187","v":0},{"$f":"'شهر 10'!K187","v":0},{"$f":"'شهر 10'!L187","v":0},{"$f":"'شهر 10'!M187","v":0},{"$f":"'شهر 10'!N187","v":0},{"$f":"'شهر 10'!O187","v":0},{"$f":"'شهر 10'!P187","v":0},{"$f":"'شهر 10'!Q187","v":0},{"$f":"'شهر 10'!R187","v":0},{"$f":"'شهر 10'!S187","v":0},{"$f":"'شهر 10'!T187","v":0},{"$f":"'شهر 10'!U187","v":0},{"$f":"'شهر 10'!V187","v":0},{"$f":"'شهر 10'!W187","v":0},{"$f":"'شهر 10'!X187","v":0},{"$f":"'شهر 10'!Y187","v":0},{"$f":"'شهر 10'!Z187","v":0},{"$f":"'شهر 10'!AA187","v":0},{"$f":"'شهر 10'!AB187","v":0},{"$f":"'شهر 10'!AC187","v":0},{"$f":"'شهر 10'!AD187","v":0},{"$f":"'شهر 10'!AE187","v":0},{"$f":"'شهر 10'!AF187","v":0},{"$f":"'شهر 10'!AG187","v":0},{"$f":"'شهر 10'!AH187","v":0}]
[null,null,null,null,null,null,{"$f":"'شهر 10'!D188","v":0},{"$f":"'شهر 10'!E188","v":0},{"$f":"'شهر 10'!F188","v":0},{"$f":"'شهر 10'!G188","v":0},{"$f":"'شهر 10'!H188","v":0},{"$f":"'شهر 10'!I188","v":0},{"$f":"'شهر 10'!J188","v":0},{"$f":"'شهر 10'!K188","v":0},{"$f":"'شهر 10'!L188","v":0},{"$f":"'شهر 10'!M188","v":0},{"$f":"'شهر 10'!N188","v":0},{"$f":"'شهر 10'!O188","v":0},{"$f":"'شهر 10'!P188","v":0},{"$f":"'شهر 10'!Q188","v":0},{"$f":"'شهر 10'!R188","v":0},{"$f":"'شهر 10'!S188","v":0},{"$f":"'شهر 10'!T188","v":0},{"$f":"'شهر 10'!U188","v":0},{"$f":"'شهر 10'!V188","v":0},{"$f":"'شهر 10'!W188","v":0},{"$f":"'شهر 10'!X188","v":0},{"$f":"'شهر 10'!Y188","v":0},{"$f":"'شهر 10'!Z188","v":0},{"$f":"'شهر 10'!AA188","v":0},{"$f":"'شهر 10'!AB188","v":0},{"$f":"'شهر 10'!AC188","v":0},{"$f":"'شهر 10'!AD188","v":0},{"$f":"'شهر 10'!AE188","v":0},{"$f":"'شهر 10'!AF188","v":0},{"$f":"'شهر 10'!AG188","v":0},{"$f":"'شهر 10'!AH188","v":0}]
[94,null,{"$f":"'شهر 10'!AI189","v":0},{"$f":"'شهر 10'!AJ189","v":0},{"$f":"'شهر 10'!AK189","v":0},null,{"$f":"'شهر 10'!D189","v":0},{"$f":"'شهر 10'!E189","v":0},{"$f":"'شهر 10'!F189","v":0},{"$f":"'شهر 10'!G189","v":0},{"$f":"'شهر 10'!H189","v":0},{"$f":"'شهر 10'!I189","v":0},{"$f":"'شهر 10'!J189","v":0},{"$f":"'شهر 10'!K189","v":0},{"$f":"'شهر 10'!L189","v":0},{"$f":"'شهر 10'!M189","v":0},{"$f":"'شهر 10'!N189","v":0},{"$f":"'شهر 10'!O189","v":0},{"$f":"'شهر 10'!P189","v":0},{"$f":"'شهر 10'!Q189","v":0},{"$f":"'شهر 10'!R189","v":0},{"$f":"'شهر 10'!S189","v":0},{"$f":"'شهر 10'!T189","v":0},{"$f":"'شهر 10'!U189","v":0},{"$f":"'شهر 10'!V189","v":0},{"$f":"'شهر 10'!W189","v":0},{"$f":"'شهر 10'!X189","v":0},{"$f":"'شهر 10'!Y189","v":0},{"$f":"'شهر 10'!Z189","v":0},{"$f":"'شهر 10'!AA189","v":0},{"$f":"'شهر 10'!AB189","v":0},{"$f":"'شهر 10'!AC189","v":0},{"$f":"'شهر 10'!AD189","v":0},{"$f":"'شهر 10'!AE189","v":0},{"$f":"'شهر 10'!AF189","v":0},{"$f":"'شهر 10'!AG189","v":0},{"$f":"'شهر 10'!AH189","v":0}]
[null,null,null,null,null,null,{"$f":"'شهر 10'!D190","v":0},{"$f":"'شهر 10'!E190","v":0},{"$f":"'شهر 10'!F190","v":0},{"$f":"'شهر 10'!G190","v":0},{"$f":"'شهر 10'!H190","v":0},{"$f":"'شهر 10'!I190","v":0},{"$f":"'شهر 10'!J190","v":0},{"$f":"'شهر 10'!K190","v":0},{"$f":"'شهر 10'!L190","v":0},{"$f":"'شهر 10'!M190","v":0},{"$f":"'شهر 10'!N190","v":0},{"$f":"'شهر 10'!O190","v":0},{"$f":"'شهر 10'!P190","v":0},{"$f":"'شهر 10'!Q190","v":0},{"$f":"'شهر 10'!R190","v":0},{"$f":"'شهر 10'!S190","v":0},{"$f":"'شهر 10'!T190","v":0},{"$f":"'شهر 10'!U190","v":0},{"$f":"'شهر 10'!V190","v":0},{"$f":"'شهر 10'!W190","v":0},{"$f":"'شهر 10'!X190","v":0},{"$f":"'شهر 10'!Y190","v":0},{"$f":"'شهر 10'!Z190","v":0},{"$f":"'شهر 10'!AA190","v":0},{"$f":"'شهر 10'!AB190","v":0},{"$f":"'شهر 10'!AC190","v":0},{"$f":"'شهر 10'!AD190","v":0},{"$f":"'شهر 10'!AE190","v":0},{"$f":"'شهر 10'!AF190","v":0},{"$f":"'شهر 10'!AG190","v":0},{"$f":"'شهر 10'!AH190","v":0}]
[95,null,{"$f":"'شهر 10'!AI191","v":0},{"$f":"'شهر 10'!AJ191","v":0},{"$f":"'شهر 10'!AK191","v":0},null,{"$f":"'شهر 10'!D191","v":0},{"$f":"'شهر 10'!E191","v":0},{"$f":"'شهر 10'!F191","v":0},{"$f":"'شهر 10'!G191","v":0},{"$f":"'شهر 10'!H191","v":0},{"$f":"'شهر 10'!I191","v":0},{"$f":"'شهر 10'!J191","v":0},{"$f":"'شهر 10'!K191","v":0},{"$f":"'شهر 10'!L191","v":0},{"$f":"'شهر 10'!M191","v":0},{"$f":"'شهر 10'!N191","v":0},{"$f":"'شهر 10'!O191","v":0},{"$f":"'شهر 10'!P191","v":0},{"$f":"'شهر 10'!Q191","v":0},{"$f":"'شهر 10'!R191","v":0},{"$f":"'شهر 10'!S191","v":0},{"$f":"'شهر 10'!T191","v":0},{"$f":"'شهر 10'!U191","v":0},{"$f":"'شهر 10'!V191","v":0},{"$f":"'شهر 10'!W191","v":0},{"$f":"'شهر 10'!X191","v":0},{"$f":"'شهر 10'!Y191","v":0},{"$f":"'شهر 10'!Z191","v":0},{"$f":"'شهر 10'!AA191","v":0},{"$f":"'شهر 10'!AB191","v":0},{"$f":"'شهر 10'!AC191","v":0},{"$f":"'شهر 10'!AD191","v":0},{"$f":"'شهر 10'!AE191","v":0},{"$f":"'شهر 10'!AF191","v":0},{"$f":"'شهر 10'!AG191","v":0},{"$f":"'شهر 10'!AH191","v":0}]
[null,null,null,null,null,null,{"$f":"'شهر 10'!D192","v":0},{"$f":"'شهر 10'!E192","v":0},{"$f":"'شهر 10'!F192","v":0},{"$f":"'شهر 10'!G192","v":0},{"$f":"'شهر 10'!H192","v":0},{"$f":"'شهر 10'!I192","v":0},{"$f":"'شهر 10'!J192","v":0},{"$f":"'شهر 10'!K192","v":0},{"$f":"'شهر 10'!L192","v":0},{"$f":"'شهر 10'!M192","v":0},{"$f":"'شهر 10'!N192","v":0},{"$f":"'شهر 10'!O192","v":0},{"$f":"'شهر 10'!P192","v":0},{"$f":"'شهر 10'!Q192","v":0},{"$f":"'شهر 10'!R192","v":0},{"$f":"'شهر 10'!S192","v":0},{"$f":"'شهر 10'!T192","v":0},{"$f":"'شهر 10'!U192","v":0},{"$f":"'شهر 10'!V192","v":0},{"$f":"'شهر 10'!W192","v":0},{"$f":"'شهر 10'!X192","v":0},{"$f":"'شهر 10'!Y192","v":0},{"$f":"'شهر 10'!Z192","v":0},{"$f":"'شهر 10'!AA192","v":0},{"$f":"'شهر 10'!AB192","v":0},{"$f":"'شهر 10'!AC192","v":0},{"$f":"'شهر 10'!AD192","v":0},{"$f":"'شهر 10'!AE192","v":0},{"$f":"'شهر 10'!AF192","v":0},{"$f":"'شهر 10'!AG192","v":0},{"$f":"'شهر 10'!AH192","v":0}]
[96,null,{"$f":"'شهر 10'!AI193","v":0},{"$f":"'شهر 10'!AJ193","v":0},{"$f":"'شهر 10'!AK193","v":0},null,{"$f":"'شهر 10'!D193","v":0},{"$f":"'شهر 10'!E193","v":0},{"$f":"'شهر 10'!F193","v":0},{"$f":"'شهر 10'!G193","v":0},{"$f":"'شهر 10'!H193","v":0},{"$f":"'شهر 10'!I193","v":0},{"$f":"'شهر 10'!J193","v":0},{"$f":"'شهر 10'!K193","v":0},{"$f":"'شهر 10'!L193","v":0},{"$f":"'شهر 10'!M193","v":0},{"$f":"'شهر 10'!N193","v":0},{"$f":"'شهر 10'!O193","v":0},{"$f":"'شهر 10'!P193","v":0},{"$f":"'شهر 10'!Q193","v":0},{"$f":"'شهر 10'!R193","v":0},{"$f":"'شهر 10'!S193","v":0},{"$f":"'شهر 10'!T193","v":0},{"$f":"'شهر 10'!U193","v":0},{"$f":"'شهر 10'!V193","v":0},{"$f":"'شهر 10'!W193","v":0},{"$f":"'شهر 10'!X193","v":0},{"$f":"'شهر 10'!Y193","v":0},{"$f":"'شهر 10'!Z193","v":0},{"$f":"'شهر 10'!AA193","v":0},{"$f":"'شهر 10'!AB193","v":0},{"$f":"'شهر 10'!AC193","v":0},{"$f":"'شهر 10'!AD193","v":0},{"$f":"'شهر 10'!AE193","v":0},{"$f":"'شهر 10'!AF193","v":0},{"$f":"'شهر 10'!AG193","v":0},{"$f":"'شهر 10'!AH193","v":0}]
[null,null,null,null,null,null,{"$f":"'شهر 10'!D194","v":0},{"$f":"'شهر 10'!E194","v":0},{"$f":"'شهر 10'!F194","v":0},{"$f":"'شهر 10'!G194","v":0},{"$f":"'شهر 10'!H194","v":0},{"$f":"'شهر 10'!I194","v":0},{"$f":"'شهر 10'!J194","v":0},{"$f":"'شهر 10'!K194","v":0},{"$f":"'شهر 10'!L194","v":0},{"$f":"'شهر 10'!M194","v":0},{"$f":"'شهر 10'!N194","v":0},{"$f":"'شهر 10'!O194","v":0},{"$f":"'شهر 10'!P194","v":0},{"$f":"'شهر 10'!Q194","v":0},{"$f":"'شهر 10'!R194","v":0},{"$f":"'شهر 10'!S194","v":0},{"$f":"'شهر 10'!T194","v":0},{"$f":"'شهر 10'!U194","v":0},{"$f":"'شهر 10'!V194","v":0},{"$f":"'شهر 10'!W194","v":0},{"$f":"'شهر 10'!X194","v":0},{"$f":"'شهر 10'!Y194","v":0},{"$f":"'شهر 10'!Z194","v":0},{"$f":"'شهر 10'!AA194","v":0},{"$f":"'شهر 10'!AB194","v":0},{"$f":"'شهر 10'!AC194","v":0},{"$f":"'شهر 10'!AD194","v":0},{"$f":"'شهر 10'!AE194","v":0},{"$f":"'شهر 10'!AF194","v":0},{"$f":"'شهر 10'!AG194","v":0},{"$f":"'شهر 10'!AH194","v":0}]
[97,null,{"$f":"'شهر 10'!AI195","v":0},{"$f":"'شهر 10'!AJ195","v":0},{"$f":"'شهر 10'!AK195","v":0},null,{"$f":"'شهر 10'!D195","v":0},{"$f":"'شهر 10'!E195","v":0},{"$f":"'شهر 10'!F195","v":0},{"$f":"'شهر 10'!G195","v":0},{"$f":"'شهر 10'!H195","v":0},{"$f":"'شهر 10'!I195","v":0},{"$f":"'شهر 10'!J195","v":0},{"$f":"'شهر 10'!K195","v":0},{"$f":"'شهر 10'!L195","v":0},{"$f":"'شهر 10'!M195","v":0},{"$f":"'شهر 10'!N195","v":0},{"$f":"'شهر 10'!O195","v":0},{"$f":"'شهر 10'!P195","v":0},{"$f":"'شهر 10'!Q195","v":0},{"$f":"'شهر 10'!R195","v":0},{"$f":"'شهر 10'!S195","v":0},{"$f":"'شهر 10'!T195","v":0},{"$f":"'شهر 10'!U195","v":0},{"$f":"'شهر 10'!V195","v":0},{"$f":"'شهر 10'!W195","v":0},{"$f":"'شهر 10'!X195","v":0},{"$f":"'شهر 10'!Y195","v":0},{"$f":"'شهر 10'!Z195","v":0},{"$f":"'شهر 10'!AA195","v":0},{"$f":"'شهر 10'!AB195","v":0},{"$f":"'شهر 10'!AC195","v":0},{"$f":"'شهر 10'!AD195","v":0},{"$f":"'شهر 10'!AE195","v":0},{"$f":"'شهر 10'!AF195","v":0},{"$f":"'شهر 10'!AG195","v":0},{"$f":"'شهر 10'!AH195","v":0}]
[null,null,null,null,null,null,{"$f":"'شهر 10'!D196","v":0},{"$f":"'شهر 10'!E196","v":0},{"$f":"'شهر 10'!F196","v":0},{"$f":"'شهر 10'!G196","v":0},{"$f":"'شهر 10'!H196","v":0},{"$f":"'شهر 10'!I196","v":0},{"$f":"'شهر 10'!J196","v":0},{"$f":"'شهر 10'!K196","v":0},{"$f":"'شهر 10'!L196","v":0},{"$f":"'شهر 10'!M196","v":0},{"$f":"'شهر 10'!N196","v":0},{"$f":"'شهر 10'!O196","v":0},{"$f":"'شهر 10'!P196","v":0},{"$f":"'شهر 10'!Q196","v":0},{"$f":"'شهر 10'!R196","v":0},{"$f":"'شهر 10'!S196","v":0},{"$f":"'شهر 10'!T196","v":0},{"$f":"'شهر 10'!U196","v":0},{"$f":"'شهر 10'!V196","v":0},{"$f":"'شهر 10'!W196","v":0},{"$f":"'شهر 10'!X196","v":0},{"$f":"'شهر 10'!Y196","v":0},{"$f":"'شهر 10'!Z196","v":0},{"$f":"'شهر 10'!AA196","v":0},{"$f":"'شهر 10'!AB196","v":0},{"$f":"'شهر 10'!AC196","v":0},{"$f":"'شهر 10'!AD196","v":0},{"$f":"'شهر 10'!AE196","v":0},{"$f":"'شهر 10'!AF196","v":0},{"$f":"'شهر 10'!AG196","v":0},{"$f":"'شهر 10'!AH196","v":0}]
[98,null,{"$f":"'شهر 10'!AI197","v":0},{"$f":"'شهر 10'!AJ197","v":0},{"$f":"'شهر 10'!AK197","v":0},null,{"$f":"'شهر 10'!D197","v":0},{"$f":"'شهر 10'!E197","v":0},{"$f":"'شهر 10'!F197","v":0},{"$f":"'شهر 10'!G197","v":0},{"$f":"'شهر 10'!H197","v":0},{"$f":"'شهر 10'!I197","v":0},{"$f":"'شهر 10'!J197","v":0},{"$f":"'شهر 10'!K197","v":0},{"$f":"'شهر 10'!L197","v":0},{"$f":"'شهر 10'!M197","v":0},{"$f":"'شهر 10'!N197","v":0},{"$f":"'شهر 10'!O197","v":0},{"$f":"'شهر 10'!P197","v":0},{"$f":"'شهر 10'!Q197","v":0},{"$f":"'شهر 10'!R197","v":0},{"$f":"'شهر 10'!S197","v":0},{"$f":"'شهر 10'!T197","v":0},{"$f":"'شهر 10'!U197","v":0},{"$f":"'شهر 10'!V197","v":0},{"$f":"'شهر 10'!W197","v":0},{"$f":"'شهر 10'!X197","v":0},{"$f":"'شهر 10'!Y197","v":0},{"$f":"'شهر 10'!Z197","v":0},{"$f":"'شهر 10'!AA197","v":0},{"$f":"'شهر 10'!AB197","v":0},{"$f":"'شهر 10'!AC197","v":0},{"$f":"'شهر 10'!AD197","v":0},{"$f":"'شهر 10'!AE197","v":0},{"$f":"'شهر 10'!AF197","v":0},{"$f":"'شهر 10'!AG197","v":0},{"$f":"'شهر 10'!AH197","v":0}]
[null,null,null,null,null,null,{"$f":"'شهر 10'!D198","v":0},{"$f":"'شهر 10'!E198","v":0},{"$f":"'شهر 10'!F198","v":0},{"$f":"'شهر 10'!G198","v":0},{"$f":"'شهر 10'!H198","v":0},{"$f":"'شهر 10'!I198","v":0},{"$f":"'شهر 10'!J198","v":0},{"$f":"'شهر 10'!K198","v":0},{"$f":"'شهر 10'!L198","v":0},{"$f":"'شهر 10'!M198","v":0},{"$f":"'شهر 10'!N198","v":0},{"$f":"'شهر 10'!O198","v":0},{"$f":"'شهر 10'!P198","v":0},{"$f":"'شهر 10'!Q198","v":0},{"$f":"'شهر 10'!R198","v":0},{"$f":"'شهر 10'!S198","v":0},{"$f":"'شهر 10'!T198","v":0},{"$f":"'شهر 10'!U198","v":0},{"$f":"'شهر 10'!V198","v":0},{"$f":"'شهر 10'!W198","v":0},{"$f":"'شهر 10'!X198","v":0},{"$f":"'شهر 10'!Y198","v":0},{"$f":"'شهر 10'!Z198","v":0},{"$f":"'شهر 10'!AA198","v":0},{"$f":"'شهر 10'!AB198","v":0},{"$f":"'شهر 10'!AC198","v":0},{"$f":"'شهر 10'!AD198","v":0},{"$f":"'شهر 10'!AE198","v":0},{"$f":"'شهر 10'!AF198","v":0},{"$f":"'شهر 10'!AG198","v":0},{"$f":"'شهر 10'!AH198","v":0}]
[99,null,{"$f":"'شهر 10'!AI199","v":0},{"$f":"'شهر 10'!AJ199","v":0},{"$f":"'شهر 10'!AK199","v":0},null,{"$f":"'شهر 10'!D199","v":0},{"$f":"'شهر 10'!E199","v":0},{"$f":"'شهر 10'!F199","v":0},{"$f":"'شهر 10'!G199","v":0},{"$f":"'شهر 10'!H199","v":0},{"$f":"'شهر 10'!I199","v":0},{"$f":"'شهر 10'!J199","v":0},{"$f":"'شهر 10'!K199","v":0},{"$f":"'شهر 10'!L199","v":0},{"$f":"'شهر 10'!M199","v":0},{"$f":"'شهر 10'!N199","v":0},{"$f":"'شهر 10'!O199","v":0},{"$f":"'شهر 10'!P199","v":0},{"$f":"'شهر 10'!Q199","v":0},{"$f":"'شهر 10'!R199","v":0},{"$f":"'شهر 10'!S199","v":0},{"$f":"'شهر 10'!T199","v":0},{"$f":"'شهر 10'!U199","v":0},{"$f":"'شهر 10'!V199","v":0},{"$f":"'شهر 10'!W199","v":0},{"$f":"'شهر 10'!X199","v":0},{"$f":"'شهر 10'!Y199","v":0},{"$f":"'شهر 10'!Z199","v":0},{"$f":"'شهر 10'!AA199","v":0},{"$f":"'شهر 10'!AB199","v":0},{"$f":"'شهر 10'!AC199","v":0},{"$f":"'شهر 10'!AD199","v":0},{"$f":"'شهر 10'!AE199","v":0},{"$f":"'شهر 10'!AF199","v":0},{"$f":"'شهر 10'!AG199","v":0},{"$f":"'شهر 10'!AH199","v":0}]
[null,null,null,null,null,null,{"$f":"'شهر 10'!D200","v":0},{"$f":"'شهر 10'!E200","v":0},{"$f":"'شهر 10'!F200","v":0},{"$f":"'شهر 10'!G200","v":0},{"$f":"'شهر 10'!H200","v":0},{"$f":"'شهر 10'!I200","v":0},{"$f":"'شهر 10'!J200","v":0},{"$f":"'شهر 10'!K200","v":0},{"$f":"'شهر 10'!L200","v":0},{"$f":"'شهر 10'!M200","v":0},{"$f":"'شهر 10'!N200","v":0},{"$f":"'شهر 10'!O200","v":0},{"$f":"'شهر 10'!P200","v":0},{"$f":"'شهر 10'!Q200","v":0},{"$f":"'شهر 10'!R200","v":0},{"$f":"'شهر 10'!S200","v":0},{"$f":"'شهر 10'!T200","v":0},{"$f":"'شهر 10'!U200","v":0},{"$f":"'شهر 10'!V200","v":0},{"$f":"'شهر 10'!W200","v":0},{"$f":"'شهر 10'!X200","v":0},{"$f":"'شهر 10'!Y200","v":0},{"$f":"'شهر 10'!Z200","v":0},{"$f":"'شهر 10'!AA200","v":0},{"$f":"'شهر 10'!AB200","v":0},{"$f":"'شهر 10'!AC200","v":0},{"$f":"'شهر 10'!AD200","v":0},{"$f":"'شهر 10'!AE200","v":0},{"$f":"'شهر 10'!AF200","v":0},{"$f":"'شهر 10'!AG200","v":0},{"$f":"'شهر 10'!AH200","v":0}]
[100,null,{"$f":"'شهر 10'!AI201","v":0},{"$f":"'شهر 10'!AJ201","v":0},{"$f":"'شهر 10'!AK201","v":0},null,{"$f":"'شهر 10'!D201","v":0},{"$f":"'شهر 10'!E201","v":0},{"$f":"'شهر 10'!F201","v":0},{"$f":"'شهر 10'!G201","v":0},{"$f":"'شهر 10'!H201","v":0},{"$f":"'شهر 10'!I201","v":0},{"$f":"'شهر 10'!J201","v":0},{"$f":"'شهر 10'!K201","v":0},{"$f":"'شهر 10'!L201","v":0},{"$f":"'شهر 10'!M201","v":0},{"$f":"'شهر 10'!N201","v":0},{"$f":"'شهر 10'!O201","v":0},{"$f":"'شهر 10'!P201","v":0},{"$f":"'شهر 10'!Q201","v":0},{"$f":"'شهر 10'!R201","v":0},{"$f":"'شهر 10'!S201","v":0},{"$f":"'شهر 10'!T201","v":0},{"$f":"'شهر 10'!U201","v":0},{"$f":"'شهر 10'!V201","v":0},{"$f":"'شهر 10'!W201","v":0},{"$f":"'شهر 10'!X201","v":0},{"$f":"'شهر 10'!Y201","v":0},{"$f":"'شهر 10'!Z201","v":0},{"$f":"'شهر 10'!AA201","v":0},{"$f":"'شهر 10'!AB201","v":0},{"$f":"'شهر 10'!AC201","v":0},{"$f":"'شهر 10'!AD201","v":0},{"$f":"'شهر 10'!AE201","v":0},{"$f":"'شهر 10'!AF201","v":0},{"$f":"'شهر 10'!AG201","v":0},{"$f":"'شهر 10'!AH201","v":0}]
[null,null,null,null,null,null,{"$f":"'شهر 10'!D202","v":0},{"$f":"'شهر 10'!E202","v":0},{"$f":"'شهر 10'!F202","v":0},{"$f":"'شهر 10'!G202","v":0},{"$f":"'شهر 10'!H202","v":0},{"$f":"'شهر 10'!I202","v":0},{"$f":"'شهر 10'!J202","v":0},{"$f":"'شهر 10'!K202","v":0},{"$f":"'شهر 10'!L202","v":0},{"$f":"'شهر 10'!M202","v":0},{"$f":"'شهر 10'!N202","v":0},{"$f":"'شهر 10'!O202","v":0},{"$f":"'شهر 10'!P202","v":0},{"$f":"'شهر 10'!Q202","v":0},{"$f":"'شهر 10'!R202","v":0},{"$f":"'شهر 10'!S202","v":0},{"$f":"'شهر 10'!T202","v":0},{"$f":"'شهر 10'!U202","v":0},{"$f":"'شهر 10'!V202","v":0},{"$f":"'شهر 10'!W202","v":0},{"$f":"'شهر 10'!X202","v":0},{"$f":"'شهر 10'!Y202","v":0},{"$f":"'شهر 10'!Z202","v":0},{"$f":"'شهر 10'!AA202","v":0},{"$f":"'شهر 10'!AB202","v":0},{"$f":"'شهر 10'!AC202","v":0},{"$f":"'شهر 10'!AD202","v":0},{"$f":"'شهر 10'!AE202","v":0},{"$f":"'شهر 10'!AF202","v":0},{"$f":"'شهر 10'!AG202","v":0},{"$f":"'شهر 10'!AH202","v":0}]
[101,null,{"$f":"'شهر 10'!AI203","v":0},{"$f":"'شهر 10'!AJ203","v":0},{"$f":"'شهر 10'!AK203","v":0},null,{"$f":"'شهر 10'!D203","v":0},{"$f":"'شهر 10'!E203","v":0},{"$f":"'شهر 10'!F203","v":0},{"$f":"'شهر 10'!G203","v":0},{"$f":"'شهر 10'!H203","v":0},{"$f":"'شهر 10'!I203","v":0},{"$f":"'شهر 10'!J203","v":0},{"$f":"'شهر 10'!K203","v":0},{"$f":"'شهر 10'!L203","v":0},{"$f":"'شهر 10'!M203","v":0},{"$f":"'شهر 10'!N203","v":0},{"$f":"'شهر 10'!O203","v":0},{"$f":"'شهر 10'!P203","v":0},{"$f":"'شهر 10'!Q203","v":0},{"$f":"'شهر 10'!R203","v":0},{"$f":"'شهر 10'!S203","v":0},{"$f":"'شهر 10'!T203","v":0},{"$f":"'شهر 10'!U203","v":0},{"$f":"'شهر 10'!V203","v":0},{"$f":"'شهر 10'!W203","v":0},{"$f":"'شهر 10'!X203","v":0},{"$f":"'شهر 10'!Y203","v":0},{"$f":"'شهر 10'!Z203","v":0},{"$f":"'شهر 10'!AA203","v":0},{"$f":"'شهر 10'!AB203","v":0},{"$f":"'شهر 10'!AC203","v":0},{"$f":"'شهر 10'!AD203","v":0},{"$f":"'شهر 10'!AE203","v":0},{"$f":"'شهر 10'!AF203","v":0},{"$f":"'شهر 10'!AG203","v":0},{"$f":"'شهر 10'!AH203","v":0}]
[null,null,null,null,null,null,{"$f":"'شهر 10'!D204","v":0},{"$f":"'شهر 10'!E204","v":0},{"$f":"'شهر 10'!F204","v":0},{"$f":"'شهر 10'!G204","v":0},{"$f":"'شهر 10'!H204","v":0},{"$f":"'شهر 10'!I204","v":0},{"$f":"'شهر 10'!J204","v":0},{"$f":"'شهر 10'!K204","v":0},{"$f":"'شهر 10'!L204","v":0},{"$f":"'شهر 10'!M204","v":0},{"$f":"'شهر 10'!N204","v":0},{"$f":"'شهر 10'!O204","v":0},{"$f":"'شهر 10'!P204","v":0},{"$f":"'شهر 10'!Q204","v":0},{"$f":"'شهر 10'!R204","v":0},{"$f":"'شهر 10'!S204","v":0},{"$f":"'شهر 10'!T204","v":0},{"$f":"'شهر 10'!U204","v":0},{"$f":"'شهر 10'!V204","v":0},{"$f":"'شهر 10'!W204","v":0},{"$f":"'شهر 10'!X204","v":0},{"$f":"'شهر 10'!Y204","v":0},{"$f":"'شهر 10'!Z204","v":0},{"$f":"'شهر 10'!AA204","v":0},{"$f":"'شهر 10'!AB204","v":0},{"$f":"'شهر 10'!AC204","v":0},{"$f":"'شهر 10'!AD204","v":0},{"$f":"'شهر 10'!AE204","v":0},{"$f":"'شهر 10'!AF204","v":0},{"$f":"'شهر 10'!AG204","v":0},{"$f":"'شهر 10'!AH204","v":0}]
[102,null,{"$f":"'شهر 10'!AI205","v":0},{"$f":"'شهر 10'!AJ205","v":0},{"$f":"'شهر 10'!AK205","v":0},null,{"$f":"'شهر 10'!D205","v":0},{"$f":"'شهر 10'!E205","v":0},{"$f":"'شهر 10'!F205","v":0},{"$f":"'شهر 10'!G205","v":0},{"$f":"'شهر 10'!H205","v":0},{"$f":"'شهر 10'!I205","v":0},{"$f":"'شهر 10'!J205","v":0},{"$f":"'شهر 10'!K205","v":0},{"$f":"'شهر 10'!L205","v":0},{"$f":"'شهر 10'!M205","v":0},{"$f":"'شهر 10'!N205","v":0},{"$f":"'شهر 10'!O205","v":0},{"$f":"'شهر 10'!P205","v":0},{"$f":"'شهر 10'!Q205","v":0},{"$f":"'شهر 10'!R205","v":0},{"$f":"'شهر 10'!S205","v":0},{"$f":"'شهر 10'!T205","v":0},{"$f":"'شهر 10'!U205","v":0},{"$f":"'شهر 10'!V205","v":0},{"$f":"'شهر 10'!W205","v":0},{"$f":"'شهر 10'!X205","v":0},{"$f":"'شهر 10'!Y205","v":0},{"$f":"'شهر 10'!Z205","v":0},{"$f":"'شهر 10'!AA205","v":0},{"$f":"'شهر 10'!AB205","v":0},{"$f":"'شهر 10'!AC205","v":0},{"$f":"'شهر 10'!AD205","v":0},{"$f":"'شهر 10'!AE205","v":0},{"$f":"'شهر 10'!AF205","v":0},{"$f":"'شهر 10'!AG205","v":0},{"$f":"'شهر 10'!AH205","v":0}]
[null,null,null,null,null,null,{"$f":"'شهر 10'!D206","v":0},{"$f":"'شهر 10'!E206","v":0},{"$f":"'شهر 10'!F206","v":0},{"$f":"'شهر 10'!G206","v":0},{"$f":"'شهر 10'!H206","v":0},{"$f":"'شهر 10'!I206","v":0},{"$f":"'شهر 10'!J206","v":0},{"$f":"'شهر 10'!K206","v":0},{"$f":"'شهر 10'!L206","v":0},{"$f":"'شهر 10'!M206","v":0},{"$f":"'شهر 10'!N206","v":0},{"$f":"'شهر 10'!O206","v":0},{"$f":"'شهر 10'!P206","v":0},{"$f":"'شهر 10'!Q206","v":0},{"$f":"'شهر 10'!R206","v":0},{"$f":"'شهر 10'!S206","v":0},{"$f":"'شهر 10'!T206","v":0},{"$f":"'شهر 10'!U206","v":0},{"$f":"'شهر 10'!V206","v":0},{"$f":"'شهر 10'!W206","v":0},{"$f":"'شهر 10'!X206","v":0},{"$f":"'شهر 10'!Y206","v":0},{"$f":"'شهر 10'!Z206","v":0},{"$f":"'شهر 10'!AA206","v":0},{"$f":"'شهر 10'!AB206","v":0},{"$f":"'شهر 10'!AC206","v":0},{"$f":"'شهر 10'!AD206","v":0},{"$f":"'شهر 10'!AE206","v":0},{"$f":"'شهر 10'!AF206","v":0},{"$f":"'شهر 10'!AG206","v":0},{"$f":"'شهر 10'!AH206","v":0}]
[103,null,{"$f":"'شهر 10'!AI207","v":0},{"$f":"'شهر 10'!AJ207","v":0},{"$f":"'شهر 10'!AK207","v":0},null,{"$f":"'شهر 10'!D207","v":0},{"$f":"'شهر 10'!E207","v":0},{"$f":"'شهر 10'!F207","v":0},{"$f":"'شهر 10'!G207","v":0},{"$f":"'شهر 10'!H207","v":0},{"$f":"'شهر 10'!I207","v":0},{"$f":"'شهر 10'!J207","v":0},{"$f":"'شهر 10'!K207","v":0},{"$f":"'شهر 10'!L207","v":0},{"$f":"'شهر 10'!M207","v":0},{"$f":"'شهر 10'!N207","v":0},{"$f":"'شهر 10'!O207","v":0},{"$f":"'شهر 10'!P207","v":0},{"$f":"'شهر 10'!Q207","v":0},{"$f":"'شهر 10'!R207","v":0},{"$f":"'شهر 10'!S207","v":0},{"$f":"'شهر 10'!T207","v":0},{"$f":"'شهر 10'!U207","v":0},{"$f":"'شهر 10'!V207","v":0},{"$f":"'شهر 10'!W207","v":0},{"$f":"'شهر 10'!X207","v":0},{"$f":"'شهر 10'!Y207","v":0},{"$f":"'شهر 10'!Z207","v":0},{"$f":"'شهر 10'!AA207","v":0},{"$f":"'شهر 10'!AB207","v":0},{"$f":"'شهر 10'!AC207","v":0},{"$f":"'شهر 10'!AD207","v":0},{"$f":"'شهر 10'!AE207","v":0},{"$f":"'شهر 10'!AF207","v":0},{"$f":"'شهر 10'!AG207","v":0},{"$f":"'شهر 10'!AH207","v":0}]
[null,null,null,null,null,null,{"$f":"'شهر 10'!D208","v":0},{"$f":"'شهر 10'!E208","v":0},{"$f":"'شهر 10'!F208","v":0},{"$f":"'شهر 10'!G208","v":0},{"$f":"'شهر 10'!H208","v":0},{"$f":"'شهر 10'!I208","v":0},{"$f":"'شهر 10'!J208","v":0},{"$f":"'شهر 10'!K208","v":0},{"$f":"'شهر 10'!L208","v":0},{"$f":"'شهر 10'!M208","v":0},{"$f":"'شهر 10'!N208","v":0},{"$f":"'شهر 10'!O208","v":0},{"$f":"'شهر 10'!P208","v":0},{"$f":"'شهر 10'!Q208","v":0},{"$f":"'شهر 10'!R208","v":0},{"$f":"'شهر 10'!S208","v":0},{"$f":"'شهر 10'!T208","v":0},{"$f":"'شهر 10'!U208","v":0},{"$f":"'شهر 10'!V208","v":0},{"$f":"'شهر 10'!W208","v":0},{"$f":"'شهر 10'!X208","v":0},{"$f":"'شهر 10'!Y208","v":0},{"$f":"'شهر 10'!Z208","v":0},{"$f":"'شهر 10'!AA208","v":0},{"$f":"'شهر 10'!AB208","v":0},{"$f":"'شهر 10'!AC208","v":0},{"$f":"'شهر 10'!AD208","v":0},{"$f":"'شهر 10'!AE208","v":0},{"$f":"'شهر 10'!AF208","v":0},{"$f":"'شهر 10'!AG208","v":0},{"$f":"'شهر 10'!AH208","v":0}]
[104,null,{"$f":"'شهر 10'!AI209","v":0},{"$f":"'شهر 10'!AJ209","v":0},{"$f":"'شهر 10'!AK209","v":0},null,{"$f":"'شهر 10'!D209","v":0},{"$f":"'شهر 10'!E209","v":0},{"$f":"'شهر 10'!F209","v":0},{"$f":"'شهر 10'!G209","v":0},{"$f":"'شهر 10'!H209","v":0},{"$f":"'شهر 10'!I209","v":0},{"$f":"'شهر 10'!J209","v":0},{"$f":"'شهر 10'!K209","v":0},{"$f":"'شهر 10'!L209","v":0},{"$f":"'شهر 10'!M209","v":0},{"$f":"'شهر 10'!N209","v":0},{"$f":"'شهر 10'!O209","v":0},{"$f":"'شهر 10'!P209","v":0},{"$f":"'شهر 10'!Q209","v":0},{"$f":"'شهر 10'!R209","v":0},{"$f":"'شهر 10'!S209","v":0},{"$f":"'شهر 10'!T209","v":0},{"$f":"'شهر 10'!U209","v":0},{"$f":"'شهر 10'!V209","v":0},{"$f":"'شهر 10'!W209","v":0},{"$f":"'شهر 10'!X209","v":0},{"$f":"'شهر 10'!Y209","v":0},{"$f":"'شهر 10'!Z209","v":0},{"$f":"'شهر 10'!AA209","v":0},{"$f":"'شهر 10'!AB209","v":0},{"$f":"'شهر 10'!AC209","v":0},{"$f":"'شهر 10'!AD209","v":0},{"$f":"'شهر 10'!AE209","v":0},{"$f":"'شهر 10'!AF209","v":0},{"$f":"'شهر 10'!AG209","v":0},{"$f":"'شهر 10'!AH209","v":0}]
[null,null,null,null,null,null,{"$f":"'شهر 10'!D210","v":0},{"$f":"'شهر 10'!E210","v":0},{"$f":"'شهر 10'!F210","v":0},{"$f":"'شهر 10'!G210","v":0},{"$f":"'شهر 10'!H210","v":0},{"$f":"'شهر 10'!I210","v":0},{"$f":"'شهر 10'!J210","v":0},{"$f":"'شهر 10'!K210","v":0},{"$f":"'شهر 10'!L210","v":0},{"$f":"'شهر 10'!M210","v":0},{"$f":"'شهر 10'!N210","v":0},{"$f":"'شهر 10'!O210","v":0},{"$f":"'شهر 10'!P210","v":0},{"$f":"'شهر 10'!Q210","v":0},{"$f":"'شهر 10'!R210","v":0},{"$f":"'شهر 10'!S210","v":0},{"$f":"'شهر 10'!T210","v":0},{"$f":"'شهر 10'!U210","v":0},{"$f":"'شهر 10'!V210","v":0},{"$f":"'شهر 10'!W210","v":0},{"$f":"'شهر 10'!X210","v":0},{"$f":"'شهر 10'!Y210","v":0},{"$f":"'شهر 10'!Z210","v":0},{"$f":"'شهر 10'!AA210","v":0},{"$f":"'شهر 10'!AB210","v":0},{"$f":"'شهر 10'!AC210","v":0},{"$f":"'شهر 10'!AD210","v":0},{"$f":"'شهر 10'!AE210","v":0},{"$f":"'شهر 10'!AF210","v":0},{"$f":"'شهر 10'!AG210","v":0},{"$f":"'شهر 10'!AH210","v":0}]
[105,null,{"$f":"'شهر 10'!AI211","v":0},{"$f":"'شهر 10'!AJ211","v":0},{"$f":"'شهر 10'!AK211","v":0},null,{"$f":"'شهر 10'!D211","v":0},{"$f":"'شهر 10'!E211","v":0},{"$f":"'شهر 10'!F211","v":0},{"$f":"'شهر 10'!G211","v":0},{"$f":"'شهر 10'!H211","v":0},{"$f":"'شهر 10'!I211","v":0},{"$f":"'شهر 10'!J211","v":0},{"$f":"'شهر 10'!K211","v":0},{"$f":"'شهر 10'!L211","v":0},{"$f":"'شهر 10'!M211","v":0},{"$f":"'شهر 10'!N211","v":0},{"$f":"'شهر 10'!O211","v":0},{"$f":"'شهر 10'!P211","v":0},{"$f":"'شهر 10'!Q211","v":0},{"$f":"'شهر 10'!R211","v":0},{"$f":"'شهر 10'!S211","v":0},{"$f":"'شهر 10'!T211","v":0},{"$f":"'شهر 10'!U211","v":0},{"$f":"'شهر 10'!V211","v":0},{"$f":"'شهر 10'!W211","v":0},{"$f":"'شهر 10'!X211","v":0},{"$f":"'شهر 10'!Y211","v":0},{"$f":"'شهر 10'!Z211","v":0},{"$f":"'شهر 10'!AA211","v":0},{"$f":"'شهر 10'!AB211","v":0},{"$f":"'شهر 10'!AC211","v":0},{"$f":"'شهر 10'!AD211","v":0},{"$f":"'شهر 10'!AE211","v":0},{"$f":"'شهر 10'!AF211","v":0},{"$f":"'شهر 10'!AG211","v":0},{"$f":"'شهر 10'!AH211","v":0}]
[null,null,null,null,null,null,{"$f":"'شهر 10'!D212","v":0},{"$f":"'شهر 10'!E212","v":0},{"$f":"'شهر 10'!F212","v":0},{"$f":"'شهر 10'!G212","v":0},{"$f":"'شهر 10'!H212","v":0},{"$f":"'شهر 10'!I212","v":0},{"$f":"'شهر 10'!J212","v":0},{"$f":"'شهر 10'!K212","v":0},{"$f":"'شهر 10'!L212","v":0},{"$f":"'شهر 10'!M212","v":0},{"$f":"'شهر 10'!N212","v":0},{"$f":"'شهر 10'!O212","v":0},{"$f":"'شهر 10'!P212","v":0},{"$f":"'شهر 10'!Q212","v":0},{"$f":"'شهر 10'!R212","v":0},{"$f":"'شهر 10'!S212","v":0},{"$f":"'شهر 10'!T212","v":0},{"$f":"'شهر 10'!U212","v":0},{"$f":"'شهر 10'!V212","v":0},{"$f":"'شهر 10'!W212","v":0},{"$f":"'شهر 10'!X212","v":0},{"$f":"'شهر 10'!Y212","v":0},{"$f":"'شهر 10'!Z212","v":0},{"$f":"'شهر 10'!AA212","v":0},{"$f":"'شهر 10'!AB212","v":0},{"$f":"'شهر 10'!AC212","v":0},{"$f":"'شهر 10'!AD212","v":0},{"$f":"'شهر 10'!AE212","v":0},{"$f":"'شهر 10'!AF212","v":0},{"$f":"'شهر 10'!AG212","v":0},{"$f":"'شهر 10'!AH212","v":0}]
[106,null,{"$f":"'شهر 10'!AI213","v":0},{"$f":"'شهر 10'!AJ213","v":0},{"$f":"'شهر 10'!AK213","v":0},null,{"$f":"'شهر 10'!D213","v":0},{"$f":"'شهر 10'!E213","v":0},{"$f":"'شهر 10'!F213","v":0},{"$f":"'شهر 10'!G213","v":0},{"$f":"'شهر 10'!H213","v":0},{"$f":"'شهر 10'!I213","v":0},{"$f":"'شهر 10'!J213","v":0},{"$f":"'شهر 10'!K213","v":0},{"$f":"'شهر 10'!L213","v":0},{"$f":"'شهر 10'!M213","v":0},{"$f":"'شهر 10'!N213","v":0},{"$f":"'شهر 10'!O213","v":0},{"$f":"'شهر 10'!P213","v":0},{"$f":"'شهر 10'!Q213","v":0},{"$f":"'شهر 10'!R213","v":0},{"$f":"'شهر 10'!S213","v":0},{"$f":"'شهر 10'!T213","v":0},{"$f":"'شهر 10'!U213","v":0},{"$f":"'شهر 10'!V213","v":0},{"$f":"'شهر 10'!W213","v":0},{"$f":"'شهر 10'!X213","v":0},{"$f":"'شهر 10'!Y213","v":0},{"$f":"'شهر 10'!Z213","v":0},{"$f":"'شهر 10'!AA213","v":0},{"$f":"'شهر 10'!AB213","v":0},{"$f":"'شهر 10'!AC213","v":0},{"$f":"'شهر 10'!AD213","v":0},{"$f":"'شهر 10'!AE213","v":0},{"$f":"'شهر 10'!AF213","v":0},{"$f":"'شهر 10'!AG213","v":0},{"$f":"'شهر 10'!AH213","v":0}]
[null,null,null,null,null,null,{"$f":"'شهر 10'!D214","v":0},{"$f":"'شهر 10'!E214","v":0},{"$f":"'شهر 10'!F214","v":0},{"$f":"'شهر 10'!G214","v":0},{"$f":"'شهر 10'!H214","v":0},{"$f":"'شهر 10'!I214","v":0},{"$f":"'شهر 10'!J214","v":0},{"$f":"'شهر 10'!K214","v":0},{"$f":"'شهر 10'!L214","v":0},{"$f":"'شهر 10'!M214","v":0},{"$f":"'شهر 10'!N214","v":0},{"$f":"'شهر 10'!O214","v":0},{"$f":"'شهر 10'!P214","v":0},{"$f":"'شهر 10'!Q214","v":0},{"$f":"'شهر 10'!R214","v":0},{"$f":"'شهر 10'!S214","v":0},{"$f":"'شهر 10'!T214","v":0},{"$f":"'شهر 10'!U214","v":0},{"$f":"'شهر 10'!V214","v":0},{"$f":"'شهر 10'!W214","v":0},{"$f":"'شهر 10'!X214","v":0},{"$f":"'شهر 10'!Y214","v":0},{"$f":"'شهر 10'!Z214","v":0},{"$f":"'شهر 10'!AA214","v":0},{"$f":"'شهر 10'!AB214","v":0},{"$f":"'شهر 10'!AC214","v":0},{"$f":"'شهر 10'!AD214","v":0},{"$f":"'شهر 10'!AE214","v":0},{"$f":"'شهر 10'!AF214","v":0},{"$f":"'شهر 10'!AG214","v":0},{"$f":"'شهر 10'!AH214","v":0}]
[107,null,{"$f":"'شهر 10'!AI215","v":0},{"$f":"'شهر 10'!AJ215","v":0},{"$f":"'شهر 10'!AK215","v":0},null,{"$f":"'شهر 10'!D215","v":0},{"$f":"'شهر 10'!E215","v":0},{"$f":"'شهر 10'!F215","v":0},{"$f":"'شهر 10'!G215","v":0},{"$f":"'شهر 10'!H215","v":0},{"$f":"'شهر 10'!I215","v":0},{"$f":"'شهر 10'!J215","v":0},{"$f":"'شهر 10'!K215","v":0},{"$f":"'شهر 10'!L215","v":0},{"$f":"'شهر 10'!M215","v":0},{"$f":"'شهر 10'!N215","v":0},{"$f":"'شهر 10'!O215","v":0},{"$f":"'شهر 10'!P215","v":0},{"$f":"'شهر 10'!Q215","v":0},{"$f":"'شهر 10'!R215","v":0},{"$f":"'شهر 10'!S215","v":0},{"$f":"'شهر 10'!T215","v":0},{"$f":"'شهر 10'!U215","v":0},{"$f":"'شهر 10'!V215","v":0},{"$f":"'شهر 10'!W215","v":0},{"$f":"'شهر 10'!X215","v":0},{"$f":"'شهر 10'!Y215","v":0},{"$f":"'شهر 10'!Z215","v":0},{"$f":"'شهر 10'!AA215","v":0},{"$f":"'شهر 10'!AB215","v":0},{"$f":"'شهر 10'!AC215","v":0},{"$f":"'شهر 10'!AD215","v":0},{"$f":"'شهر 10'!AE215","v":0},{"$f":"'شهر 10'!AF215","v":0},{"$f":"'شهر 10'!AG215","v":0},{"$f":"'شهر 10'!AH215","v":0}]
[null,null,null,null,null,null,{"$f":"'شهر 10'!D216","v":0},{"$f":"'شهر 10'!E216","v":0},{"$f":"'شهر 10'!F216","v":0},{"$f":"'شهر 10'!G216","v":0},{"$f":"'شهر 10'!H216","v":0},{"$f":"'شهر 10'!I216","v":0},{"$f":"'شهر 10'!J216","v":0},{"$f":"'شهر 10'!K216","v":0},{"$f":"'شهر 10'!L216","v":0},{"$f":"'شهر 10'!M216","v":0},{"$f":"'شهر 10'!N216","v":0},{"$f":"'شهر 10'!O216","v":0},{"$f":"'شهر 10'!P216","v":0},{"$f":"'شهر 10'!Q216","v":0},{"$f":"'شهر 10'!R216","v":0},{"$f":"'شهر 10'!S216","v":0},{"$f":"'شهر 10'!T216","v":0},{"$f":"'شهر 10'!U216","v":0},{"$f":"'شهر 10'!V216","v":0},{"$f":"'شهر 10'!W216","v":0},{"$f":"'شهر 10'!X216","v":0},{"$f":"'شهر 10'!Y216","v":0},{"$f":"'شهر 10'!Z216","v":0},{"$f":"'شهر 10'!AA216","v":0},{"$f":"'شهر 10'!AB216","v":0},{"$f":"'شهر 10'!AC216","v":0},{"$f":"'شهر 10'!AD216","v":0},{"$f":"'شهر 10'!AE216","v":0},{"$f":"'شهر 10'!AF216","v":0},{"$f":"'شهر 10'!AG216","v":0},{"$f":"'شهر 10'!AH216","v":0}]
[108,null,{"$f":"'شهر 10'!AI217","v":0},{"$f":"'شهر 10'!AJ217","v":0},{"$f":"'شهر 10'!AK217","v":0},null,{"$f":"'شهر 10'!D217","v":0},{"$f":"'شهر 10'!E217","v":0},{"$f":"'شهر 10'!F217","v":0},{"$f":"'شهر 10'!G217","v":0},{"$f":"'شهر 10'!H217","v":0},{"$f":"'شهر 10'!I217","v":0},{"$f":"'شهر 10'!J217","v":0},{"$f":"'شهر 10'!K217","v":0},{"$f":"'شهر 10'!L217","v":0},{"$f":"'شهر 10'!M217","v":0},{"$f":"'شهر 10'!N217","v":0},{"$f":"'شهر 10'!O217","v":0},{"$f":"'شهر 10'!P217","v":0},{"$f":"'شهر 10'!Q217","v":0},{"$f":"'شهر 10'!R217","v":0},{"$f":"'شهر 10'!S217","v":0},{"$f":"'شهر 10'!T217","v":0},{"$f":"'شهر 10'!U217","v":0},{"$f":"'شهر 10'!V217","v":0},{"$f":"'شهر 10'!W217","v":0},{"$f":"'شهر 10'!X217","v":0},{"$f":"'شهر 10'!Y217","v":0},{"$f":"'شهر 10'!Z217","v":0},{"$f":"'شهر 10'!AA217","v":0},{"$f":"'شهر 10'!AB217","v":0},{"$f":"'شهر 10'!AC217","v":0},{"$f":"'شهر 10'!AD217","v":0},{"$f":"'شهر 10'!AE217","v":0},{"$f":"'شهر 10'!AF217","v":0},{"$f":"'شهر 10'!AG217","v":0},{"$f":"'شهر 10'!AH217","v":0}]
[null,null,null,null,null,null,{"$f":"'شهر 10'!D218","v":0},{"$f":"'شهر 10'!E218","v":0},{"$f":"'شهر 10'!F218","v":0},{"$f":"'شهر 10'!G218","v":0},{"$f":"'شهر 10'!H218","v":0},{"$f":"'شهر 10'!I218","v":0},{"$f":"'شهر 10'!J218","v":0},{"$f":"'شهر 10'!K218","v":0},{"$f":"'شهر 10'!L218","v":0},{"$f":"'شهر 10'!M218","v":0},{"$f":"'شهر 10'!N218","v":0},{"$f":"'شهر 10'!O218","v":0},{"$f":"'شهر 10'!P218","v":0},{"$f":"'شهر 10'!Q218","v":0},{"$f":"'شهر 10'!R218","v":0},{"$f":"'شهر 10'!S218","v":0},{"$f":"'شهر 10'!T218","v":0},{"$f":"'شهر 10'!U218","v":0},{"$f":"'شهر 10'!V218","v":0},{"$f":"'شهر 10'!W218","v":0},{"$f":"'شهر 10'!X218","v":0},{"$f":"'شهر 10'!Y218","v":0},{"$f":"'شهر 10'!Z218","v":0},{"$f":"'شهر 10'!AA218","v":0},{"$f":"'شهر 10'!AB218","v":0},{"$f":"'شهر 10'!AC218","v":0},{"$f":"'شهر 10'!AD218","v":0},{"$f":"'شهر 10'!AE218","v":0},{"$f":"'شهر 10'!AF218","v":0},{"$f":"'شهر 10'!AG218","v":0},{"$f":"'شهر 10'!AH218","v":0}]
[109,null,{"$f":"'شهر 10'!AI219","v":0},{"$f":"'شهر 10'!AJ219","v":0},{"$f":"'شهر 10'!AK219","v":0},null,{"$f":"'شهر 10'!D219","v":0},{"$f":"'شهر 10'!E219","v":0},{"$f":"'شهر 10'!F219","v":0},{"$f":"'شهر 10'!G219","v":0},{"$f":"'شهر 10'!H219","v":0},{"$f":"'شهر 10'!I219","v":0},{"$f":"'شهر 10'!J219","v":0},{"$f":"'شهر 10'!K219","v":0},{"$f":"'شهر 10'!L219","v":0},{"$f":"'شهر 10'!M219","v":0},{"$f":"'شهر 10'!N219","v":0},{"$f":"'شهر 10'!O219","v":0},{"$f":"'شهر 10'!P219","v":0},{"$f":"'شهر 10'!Q219","v":0},{"$f":"'شهر 10'!R219","v":0},{"$f":"'شهر 10'!S219","v":0},{"$f":"'شهر 10'!T219","v":0},{"$f":"'شهر 10'!U219","v":0},{"$f":"'شهر 10'!V219","v":0},{"$f":"'شهر 10'!W219","v":0},{"$f":"'شهر 10'!X219","v":0},{"$f":"'شهر 10'!Y219","v":0},{"$f":"'شهر 10'!Z219","v":0},{"$f":"'شهر 10'!AA219","v":0},{"$f":"'شهر 10'!AB219","v":0},{"$f":"'شهر 10'!AC219","v":0},{"$f":"'شهر 10'!AD219","v":0},{"$f":"'شهر 10'!AE219","v":0},{"$f":"'شهر 10'!AF219","v":0},{"$f":"'شهر 10'!AG219","v":0},{"$f":"'شهر 10'!AH219","v":0}]
[null,null,null,null,null,null,{"$f":"'شهر 10'!D220","v":0},{"$f":"'شهر 10'!E220","v":0},{"$f":"'شهر 10'!F220","v":0},{"$f":"'شهر 10'!G220","v":0},{"$f":"'شهر 10'!H220","v":0},{"$f":"'شهر 10'!I220","v":0},{"$f":"'شهر 10'!J220","v":0},{"$f":"'شهر 10'!K220","v":0},{"$f":"'شهر 10'!L220","v":0},{"$f":"'شهر 10'!M220","v":0},{"$f":"'شهر 10'!N220","v":0},{"$f":"'شهر 10'!O220","v":0},{"$f":"'شهر 10'!P220","v":0},{"$f":"'شهر 10'!Q220","v":0},{"$f":"'شهر 10'!R220","v":0},{"$f":"'شهر 10'!S220","v":0},{"$f":"'شهر 10'!T220","v":0},{"$f":"'شهر 10'!U220","v":0},{"$f":"'شهر 10'!V220","v":0},{"$f":"'شهر 10'!W220","v":0},{"$f":"'شهر 10'!X220","v":0},{"$f":"'شهر 10'!Y220","v":0},{"$f":"'شهر 10'!Z220","v":0},{"$f":"'شهر 10'!AA220","v":0},{"$f":"'شهر 10'!AB220","v":0},{"$f":"'شهر 10'!AC220","v":0},{"$f":"'شهر 10'!AD220","v":0},{"$f":"'شهر 10'!AE220","v":0},{"$f":"'شهر 10'!AF220","v":0},{"$f":"'شهر 10'!AG220","v":0},{"$f":"'شهر 10'!AH220","v":0}]
[110,null,{"$f":"'شهر 10'!AI221","v":0},{"$f":"'شهر 10'!AJ221","v":0},{"$f":"'شهر 10'!AK221","v":0},null,{"$f":"'شهر 10'!D221","v":0},{"$f":"'شهر 10'!E221","v":0},{"$f":"'شهر 10'!F221","v":0},{"$f":"'شهر 10'!G221","v":0},{"$f":"'شهر 10'!H221","v":0},{"$f":"'شهر 10'!I221","v":0},{"$f":"'شهر 10'!J221","v":0},{"$f":"'شهر 10'!K221","v":0},{"$f":"'شهر 10'!L221","v":0},{"$f":"'شهر 10'!M221","v":0},{"$f":"'شهر 10'!N221","v":0},{"$f":"'شهر 10'!O221","v":0},{"$f":"'شهر 10'!P221","v":0},{"$f":"'شهر 10'!Q221","v":0},{"$f":"'شهر 10'!R221","v":0},{"$f":"'شهر 10'!S221","v":0},{"$f":"'شهر 10'!T221","v":0},{"$f":"'شهر 10'!U221","v":0},{"$f":"'شهر 10'!V221","v":0},{"$f":"'شهر 10'!W221","v":0},{"$f":"'شهر 10'!X221","v":0},{"$f":"'شهر 10'!Y221","v":0},{"$f":"'شهر 10'!Z221","v":0},{"$f":"'شهر 10'!AA221","v":0},{"$f":"'شهر 10'!AB221","v":0},{"$f":"'شهر 10'!AC221","v":0},{"$f":"'شهر 10'!AD221","v":0},{"$f":"'شهر 10'!AE221","v":0},{"$f":"'شهر 10'!AF221","v":0},{"$f":"'شهر 10'!AG221","v":0},{"$f":"'شهر 10'!AH221","v":0}]
[null,null,null,null,null,null,{"$f":"'شهر 10'!D222","v":0},{"$f":"'شهر 10'!E222","v":0},{"$f":"'شهر 10'!F222","v":0},{"$f":"'شهر 10'!G222","v":0},{"$f":"'شهر 10'!H222","v":0},{"$f":"'شهر 10'!I222","v":0},{"$f":"'شهر 10'!J222","v":0},{"$f":"'شهر 10'!K222","v":0},{"$f":"'شهر 10'!L222","v":0},{"$f":"'شهر 10'!M222","v":0},{"$f":"'شهر 10'!N222","v":0},{"$f":"'شهر 10'!O222","v":0},{"$f":"'شهر 10'!P222","v":0},{"$f":"'شهر 10'!Q222","v":0},{"$f":"'شهر 10'!R222","v":0},{"$f":"'شهر 10'!S222","v":0},{"$f":"'شهر 10'!T222","v":0},{"$f":"'شهر 10'!U222","v":0},{"$f":"'شهر 10'!V222","v":0},{"$f":"'شهر 10'!W222","v":0},{"$f":"'شهر 10'!X222","v":0},{"$f":"'شهر 10'!Y222","v":0},{"$f":"'شهر 10'!Z222","v":0},{"$f":"'شهر 10'!AA222","v":0},{"$f":"'شهر 10'!AB222","v":0},{"$f":"'شهر 10'!AC222","v":0},{"$f":"'شهر 10'!AD222","v":0},{"$f":"'شهر 10'!AE222","v":0},{"$f":"'شهر 10'!AF222","v":0},{"$f":"'شهر 10'!AG222","v":0},{"$f":"'شهر 10'!AH222","v":0}]
[111,null,{"$f":"'شهر 10'!AI223","v":0},{"$f":"'شهر 10'!AJ223","v":0},{"$f":"'شهر 10'!AK223","v":0},null,{"$f":"'شهر 10'!D223","v":0},{"$f":"'شهر 10'!E223","v":0},{"$f":"'شهر 10'!F223","v":0},{"$f":"'شهر 10'!G223","v":0},{"$f":"'شهر 10'!H223","v":0},{"$f":"'شهر 10'!I223","v":0},{"$f":"'شهر 10'!J223","v":0},{"$f":"'شهر 10'!K223","v":0},{"$f":"'شهر 10'!L223","v":0},{"$f":"'شهر 10'!M223","v":0},{"$f":"'شهر 10'!N223","v":0},{"$f":"'شهر 10'!O223","v":0},{"$f":"'شهر 10'!P223","v":0},{"$f":"'شهر 10'!Q223","v":0},{"$f":"'شهر 10'!R223","v":0},{"$f":"'شهر 10'!S223","v":0},{"$f":"'شهر 10'!T223","v":0},{"$f":"'شهر 10'!U223","v":0},{"$f":"'شهر 10'!V223","v":0},{"$f":"'شهر 10'!W223","v":0},{"$f":"'شهر 10'!X223","v":0},{"$f":"'شهر 10'!Y223","v":0},{"$f":"'شهر 10'!Z223","v":0},{"$f":"'شهر 10'!AA223","v":0},{"$f":"'شهر 10'!AB223","v":0},{"$f":"'شهر 10'!AC223","v":0},{"$f":"'شهر 10'!AD223","v":0},{"$f":"'شهر 10'!AE223","v":0},{"$f":"'شهر 10'!AF223","v":0},{"$f":"'شهر 10'!AG223","v":0},{"$f":"'شهر 10'!AH223","v":0}]
[null,null,null,null,null,null,{"$f":"'شهر 10'!D224","v":0},{"$f":"'شهر 10'!E224","v":0},{"$f":"'شهر 10'!F224","v":0},{"$f":"'شهر 10'!G224","v":0},{"$f":"'شهر 10'!H224","v":0},{"$f":"'شهر 10'!I224","v":0},{"$f":"'شهر 10'!J224","v":0},{"$f":"'شهر 10'!K224","v":0},{"$f":"'شهر 10'!L224","v":0},{"$f":"'شهر 10'!M224","v":0},{"$f":"'شهر 10'!N224","v":0},{"$f":"'شهر 10'!O224","v":0},{"$f":"'شهر 10'!P224","v":0},{"$f":"'شهر 10'!Q224","v":0},{"$f":"'شهر 10'!R224","v":0},{"$f":"'شهر 10'!S224","v":0},{"$f":"'شهر 10'!T224","v":0},{"$f":"'شهر 10'!U224","v":0},{"$f":"'شهر 10'!V224","v":0},{"$f":"'شهر 10'!W224","v":0},{"$f":"'شهر 10'!X224","v":0},{"$f":"'شهر 10'!Y224","v":0},{"$f":"'شهر 10'!Z224","v":0},{"$f":"'شهر 10'!AA224","v":0},{"$f":"'شهر 10'!AB224","v":0},{"$f":"'شهر 10'!AC224","v":0},{"$f":"'شهر 10'!AD224","v":0},{"$f":"'شهر 10'!AE224","v":0},{"$f":"'شهر 10'!AF224","v":0},{"$f":"'شهر 10'!AG224","v":0},{"$f":"'شهر 10'!AH224","v":0}]
[112,null,{"$f":"'شهر 10'!AI225","v":0},{"$f":"'شهر 10'!AJ225","v":0},{"$f":"'شهر 10'!AK225","v":0},null,{"$f":"'شهر 10'!D225","v":0},{"$f":"'شهر 10'!E225","v":0},{"$f":"'شهر 10'!F225","v":0},{"$f":"'شهر 10'!G225","v":0},{"$f":"'شهر 10'!H225","v":0},{"$f":"'شهر 10'!I225","v":0},{"$f":"'شهر 10'!J225","v":0},{"$f":"'شهر 10'!K225","v":0},{"$f":"'شهر 10'!L225","v":0},{"$f":"'شهر 10'!M225","v":0},{"$f":"'شهر 10'!N225","v":0},{"$f":"'شهر 10'!O225","v":0},{"$f":"'شهر 10'!P225","v":0},{"$f":"'شهر 10'!Q225","v":0},{"$f":"'شهر 10'!R225","v":0},{"$f":"'شهر 10'!S225","v":0},{"$f":"'شهر 10'!T225","v":0},{"$f":"'شهر 10'!U225","v":0},{"$f":"'شهر 10'!V225","v":0},{"$f":"'شهر 10'!W225","v":0},{"$f":"'شهر 10'!X225","v":0},{"$f":"'شهر 10'!Y225","v":0},{"$f":"'شهر 10'!Z225","v":0},{"$f":"'شهر 10'!AA225","v":0},{"$f":"'شهر 10'!AB225","v":0},{"$f":"'شهر 10'!AC225","v":0},{"$f":"'شهر 10'!AD225","v":0},{"$f":"'شهر 10'!AE225","v":0},{"$f":"'شهر 10'!AF225","v":0},{"$f":"'شهر 10'!AG225","v":0},{"$f":"'شهر 10'!AH225","v":0}]
[null,null,null,null,null,null,{"$f":"'شهر 10'!D226","v":0},{"$f":"'شهر 10'!E226","v":0},{"$f":"'شهر 10'!F226","v":0},{"$f":"'شهر 10'!G226","v":0},{"$f":"'شهر 10'!H226","v":0},{"$f":"'شهر 10'!I226","v":0},{"$f":"'شهر 10'!J226","v":0},{"$f":"'شهر 10'!K226","v":0},{"$f":"'شهر 10'!L226","v":0},{"$f":"'شهر 10'!M226","v":0},{"$f":"'شهر 10'!N226","v":0},{"$f":"'شهر 10'!O226","v":0},{"$f":"'شهر 10'!P226","v":0},{"$f":"'شهر 10'!Q226","v":0},{"$f":"'شهر 10'!R226","v":0},{"$f":"'شهر 10'!S226","v":0},{"$f":"'شهر 10'!T226","v":0},{"$f":"'شهر 10'!U226","v":0},{"$f":"'شهر 10'!V226","v":0},{"$f":"'شهر 10'!W226","v":0},{"$f":"'شهر 10'!X226","v":0},{"$f":"'شهر 10'!Y226","v":0},{"$f":"'شهر 10'!Z226","v":0},{"$f":"'شهر 10'!AA226","v":0},{"$f":"'شهر 10'!AB226","v":0},{"$f":"'شهر 10'!AC226","v":0},{"$f":"'شهر 10'!AD226","v":0},{"$f":"'شهر 10'!AE226","v":0},{"$f":"'شهر 10'!AF226","v":0},{"$f":"'شهر 10'!AG226","v":0},{"$f":"'شهر 10'!AH226","v":0}]
[113,null,{"$f":"'شهر 10'!AI227","v":0},{"$f":"'شهر 10'!AJ227","v":0},{"$f":"'شهر 10'!AK227","v":0},null,{"$f":"'شهر 10'!D227","v":0},{"$f":"'شهر 10'!E227","v":0},{"$f":"'شهر 10'!F227","v":0},{"$f":"'شهر 10'!G227","v":0},{"$f":"'شهر 10'!H227","v":0},{"$f":"'شهر 10'!I227","v":0},{"$f":"'شهر 10'!J227","v":0},{"$f":"'شهر 10'!K227","v":0},{"$f":"'شهر 10'!L227","v":0},{"$f":"'شهر 10'!M227","v":0},{"$f":"'شهر 10'!N227","v":0},{"$f":"'شهر 10'!O227","v":0},{"$f":"'شهر 10'!P227","v":0},{"$f":"'شهر 10'!Q227","v":0},{"$f":"'شهر 10'!R227","v":0},{"$f":"'شهر 10'!S227","v":0},{"$f":"'شهر 10'!T227","v":0},{"$f":"'شهر 10'!U227","v":0},{"$f":"'شهر 10'!V227","v":0},{"$f":"'شهر 10'!W227","v":0},{"$f":"'شهر 10'!X227","v":0},{"$f":"'شهر 10'!Y227","v":0},{"$f":"'شهر 10'!Z227","v":0},{"$f":"'شهر 10'!AA227","v":0},{"$f":"'شهر 10'!AB227","v":0},{"$f":"'شهر 10'!AC227","v":0},{"$f":"'شهر 10'!AD227","v":0},{"$f":"'شهر 10'!AE227","v":0},{"$f":"'شهر 10'!AF227","v":0},{"$f":"'شهر 10'!AG227","v":0},{"$f":"'شهر 10'!AH227","v":0}]
[null,null,null,null,null,null,{"$f":"'شهر 10'!D228","v":0},{"$f":"'شهر 10'!E228","v":0},{"$f":"'شهر 10'!F228","v":0},{"$f":"'شهر 10'!G228","v":0},{"$f":"'شهر 10'!H228","v":0},{"$f":"'شهر 10'!I228","v":0},{"$f":"'شهر 10'!J228","v":0},{"$f":"'شهر 10'!K228","v":0},{"$f":"'شهر 10'!L228","v":0},{"$f":"'شهر 10'!M228","v":0},{"$f":"'شهر 10'!N228","v":0},{"$f":"'شهر 10'!O228","v":0},{"$f":"'شهر 10'!P228","v":0},{"$f":"'شهر 10'!Q228","v":0},{"$f":"'شهر 10'!R228","v":0},{"$f":"'شهر 10'!S228","v":0},{"$f":"'شهر 10'!T228","v":0},{"$f":"'شهر 10'!U228","v":0},{"$f":"'شهر 10'!V228","v":0},{"$f":"'شهر 10'!W228","v":0},{"$f":"'شهر 10'!X228","v":0},{"$f":"'شهر 10'!Y228","v":0},{"$f":"'شهر 10'!Z228","v":0},{"$f":"'شهر 10'!AA228","v":0},{"$f":"'شهر 10'!AB228","v":0},{"$f":"'شهر 10'!AC228","v":0},{"$f":"'شهر 10'!AD228","v":0},{"$f":"'شهر 10'!AE228","v":0},{"$f":"'شهر 10'!AF228","v":0},{"$f":"'شهر 10'!AG228","v":0},{"$f":"'شهر 10'!AH228","v":0}]
[114,null,{"$f":"'شهر 10'!AI229","v":0},{"$f":"'شهر 10'!AJ229","v":0},{"$f":"'شهر 10'!AK229","v":0},null,{"$f":"'شهر 10'!D229","v":0},{"$f":"'شهر 10'!E229","v":0},{"$f":"'شهر 10'!F229","v":0},{"$f":"'شهر 10'!G229","v":0},{"$f":"'شهر 10'!H229","v":0},{"$f":"'شهر 10'!I229","v":0},{"$f":"'شهر 10'!J229","v":0},{"$f":"'شهر 10'!K229","v":0},{"$f":"'شهر 10'!L229","v":0},{"$f":"'شهر 10'!M229","v":0},{"$f":"'شهر 10'!N229","v":0},{"$f":"'شهر 10'!O229","v":0},{"$f":"'شهر 10'!P229","v":0},{"$f":"'شهر 10'!Q229","v":0},{"$f":"'شهر 10'!R229","v":0},{"$f":"'شهر 10'!S229","v":0},{"$f":"'شهر 10'!T229","v":0},{"$f":"'شهر 10'!U229","v":0},{"$f":"'شهر 10'!V229","v":0},{"$f":"'شهر 10'!W229","v":0},{"$f":"'شهر 10'!X229","v":0},{"$f":"'شهر 10'!Y229","v":0},{"$f":"'شهر 10'!Z229","v":0},{"$f":"'شهر 10'!AA229","v":0},{"$f":"'شهر 10'!AB229","v":0},{"$f":"'شهر 10'!AC229","v":0},{"$f":"'شهر 10'!AD229","v":0},{"$f":"'شهر 10'!AE229","v":0},{"$f":"'شهر 10'!AF229","v":0},{"$f":"'شهر 10'!AG229","v":0},{"$f":"'شهر 10'!AH229","v":0}]
[null,null,null,null,null,null,{"$f":"'شهر 10'!D230","v":0},{"$f":"'شهر 10'!E230","v":0},{"$f":"'شهر 10'!F230","v":0},{"$f":"'شهر 10'!G230","v":0},{"$f":"'شهر 10'!H230","v":0},{"$f":"'شهر 10'!I230","v":0},{"$f":"'شهر 10'!J230","v":0},{"$f":"'شهر 10'!K230","v":0},{"$f":"'شهر 10'!L230","v":0},{"$f":"'شهر 10'!M230","v":0},{"$f":"'شهر 10'!N230","v":0},{"$f":"'شهر 10'!O230","v":0},{"$f":"'شهر 10'!P230","v":0},{"$f":"'شهر 10'!Q230","v":0},{"$f":"'شهر 10'!R230","v":0},{"$f":"'شهر 10'!S230","v":0},{"$f":"'شهر 10'!T230","v":0},{"$f":"'شهر 10'!U230","v":0},{"$f":"'شهر 10'!V230","v":0},{"$f":"'شهر 10'!W230","v":0},{"$f":"'شهر 10'!X230","v":0},{"$f":"'شهر 10'!Y230","v":0},{"$f":"'شهر 10'!Z230","v":0},{"$f":"'شهر 10'!AA230","v":0},{"$f":"'شهر 10'!AB230","v":0},{"$f":"'شهر 10'!AC230","v":0},{"$f":"'شهر 10'!AD230","v":0},{"$f":"'شهر 10'!AE230","v":0},{"$f":"'شهر 10'!AF230","v":0},{"$f":"'شهر 10'!AG230","v":0},{"$f":"'شهر 10'!AH230","v":0}]
[115,null,{"$f":"'شهر 10'!AI231","v":0},{"$f":"'شهر 10'!AJ231","v":0},{"$f":"'شهر 10'!AK231","v":0},null,{"$f":"'شهر 10'!D231","v":0},{"$f":"'شهر 10'!E231","v":0},{"$f":"'شهر 10'!F231","v":0},{"$f":"'شهر 10'!G231","v":0},{"$f":"'شهر 10'!H231","v":0},{"$f":"'شهر 10'!I231","v":0},{"$f":"'شهر 10'!J231","v":0},{"$f":"'شهر 10'!K231","v":0},{"$f":"'شهر 10'!L231","v":0},{"$f":"'شهر 10'!M231","v":0},{"$f":"'شهر 10'!N231","v":0},{"$f":"'شهر 10'!O231","v":0},{"$f":"'شهر 10'!P231","v":0},{"$f":"'شهر 10'!Q231","v":0},{"$f":"'شهر 10'!R231","v":0},{"$f":"'شهر 10'!S231","v":0},{"$f":"'شهر 10'!T231","v":0},{"$f":"'شهر 10'!U231","v":0},{"$f":"'شهر 10'!V231","v":0},{"$f":"'شهر 10'!W231","v":0},{"$f":"'شهر 10'!X231","v":0},{"$f":"'شهر 10'!Y231","v":0},{"$f":"'شهر 10'!Z231","v":0},{"$f":"'شهر 10'!AA231","v":0},{"$f":"'شهر 10'!AB231","v":0},{"$f":"'شهر 10'!AC231","v":0},{"$f":"'شهر 10'!AD231","v":0},{"$f":"'شهر 10'!AE231","v":0},{"$f":"'شهر 10'!AF231","v":0},{"$f":"'شهر 10'!AG231","v":0},{"$f":"'شهر 10'!AH231","v":0}]
[null,null,null,null,null,null,{"$f":"'شهر 10'!D232","v":0},{"$f":"'شهر 10'!E232","v":0},{"$f":"'شهر 10'!F232","v":0},{"$f":"'شهر 10'!G232","v":0},{"$f":"'شهر 10'!H232","v":0},{"$f":"'شهر 10'!I232","v":0},{"$f":"'شهر 10'!J232","v":0},{"$f":"'شهر 10'!K232","v":0},{"$f":"'شهر 10'!L232","v":0},{"$f":"'شهر 10'!M232","v":0},{"$f":"'شهر 10'!N232","v":0},{"$f":"'شهر 10'!O232","v":0},{"$f":"'شهر 10'!P232","v":0},{"$f":"'شهر 10'!Q232","v":0},{"$f":"'شهر 10'!R232","v":0},{"$f":"'شهر 10'!S232","v":0},{"$f":"'شهر 10'!T232","v":0},{"$f":"'شهر 10'!U232","v":0},{"$f":"'شهر 10'!V232","v":0},{"$f":"'شهر 10'!W232","v":0},{"$f":"'شهر 10'!X232","v":0},{"$f":"'شهر 10'!Y232","v":0},{"$f":"'شهر 10'!Z232","v":0},{"$f":"'شهر 10'!AA232","v":0},{"$f":"'شهر 10'!AB232","v":0},{"$f":"'شهر 10'!AC232","v":0},{"$f":"'شهر 10'!AD232","v":0},{"$f":"'شهر 10'!AE232","v":0},{"$f":"'شهر 10'!AF232","v":0},{"$f":"'شهر 10'!AG232","v":0},{"$f":"'شهر 10'!AH232","v":0}]
[116,null,{"$f":"'شهر 10'!AI233","v":0},{"$f":"'شهر 10'!AJ233","v":0},{"$f":"'شهر 10'!AK233","v":0},null,{"$f":"'شهر 10'!D233","v":0},{"$f":"'شهر 10'!E233","v":0},{"$f":"'شهر 10'!F233","v":0},{"$f":"'شهر 10'!G233","v":0},{"$f":"'شهر 10'!H233","v":0},{"$f":"'شهر 10'!I233","v":0},{"$f":"'شهر 10'!J233","v":0},{"$f":"'شهر 10'!K233","v":0},{"$f":"'شهر 10'!L233","v":0},{"$f":"'شهر 10'!M233","v":0},{"$f":"'شهر 10'!N233","v":0},{"$f":"'شهر 10'!O233","v":0},{"$f":"'شهر 10'!P233","v":0},{"$f":"'شهر 10'!Q233","v":0},{"$f":"'شهر 10'!R233","v":0},{"$f":"'شهر 10'!S233","v":0},{"$f":"'شهر 10'!T233","v":0},{"$f":"'شهر 10'!U233","v":0},{"$f":"'شهر 10'!V233","v":0},{"$f":"'شهر 10'!W233","v":0},{"$f":"'شهر 10'!X233","v":0},{"$f":"'شهر 10'!Y233","v":0},{"$f":"'شهر 10'!Z233","v":0},{"$f":"'شهر 10'!AA233","v":0},{"$f":"'شهر 10'!AB233","v":0},{"$f":"'شهر 10'!AC233","v":0},{"$f":"'شهر 10'!AD233","v":0},{"$f":"'شهر 10'!AE233","v":0},{"$f":"'شهر 10'!AF233","v":0},{"$f":"'شهر 10'!AG233","v":0},{"$f":"'شهر 10'!AH233","v":0}]
[null,null,null,null,null,null,{"$f":"'شهر 10'!D234","v":0},{"$f":"'شهر 10'!E234","v":0},{"$f":"'شهر 10'!F234","v":0},{"$f":"'شهر 10'!G234","v":0},{"$f":"'شهر 10'!H234","v":0},{"$f":"'شهر 10'!I234","v":0},{"$f":"'شهر 10'!J234","v":0},{"$f":"'شهر 10'!K234","v":0},{"$f":"'شهر 10'!L234","v":0},{"$f":"'شهر 10'!M234","v":0},{"$f":"'شهر 10'!N234","v":0},{"$f":"'شهر 10'!O234","v":0},{"$f":"'شهر 10'!P234","v":0},{"$f":"'شهر 10'!Q234","v":0},{"$f":"'شهر 10'!R234","v":0},{"$f":"'شهر 10'!S234","v":0},{"$f":"'شهر 10'!T234","v":0},{"$f":"'شهر 10'!U234","v":0},{"$f":"'شهر 10'!V234","v":0},{"$f":"'شهر 10'!W234","v":0},{"$f":"'شهر 10'!X234","v":0},{"$f":"'شهر 10'!Y234","v":0},{"$f":"'شهر 10'!Z234","v":0},{"$f":"'شهر 10'!AA234","v":0},{"$f":"'شهر 10'!AB234","v":0},{"$f":"'شهر 10'!AC234","v":0},{"$f":"'شهر 10'!AD234","v":0},{"$f":"'شهر 10'!AE234","v":0},{"$f":"'شهر 10'!AF234","v":0},{"$f":"'شهر 10'!AG234","v":0},{"$f":"'شهر 10'!AH234","v":0}]
[117,null,{"$f":"'شهر 10'!AI235","v":0},{"$f":"'شهر 10'!AJ235","v":0},{"$f":"'شهر 10'!AK235","v":0},null,{"$f":"'شهر 10'!D235","v":0},{"$f":"'شهر 10'!E235","v":0},{"$f":"'شهر 10'!F235","v":0},{"$f":"'شهر 10'!G235","v":0},{"$f":"'شهر 10'!H235","v":0},{"$f":"'شهر 10'!I235","v":0},{"$f":"'شهر 10'!J235","v":0},{"$f":"'شهر 10'!K235","v":0},{"$f":"'شهر 10'!L235","v":0},{"$f":"'شهر 10'!M235","v":0},{"$f":"'شهر 10'!N235","v":0},{"$f":"'شهر 10'!O235","v":0},{"$f":"'شهر 10'!P235","v":0},{"$f":"'شهر 10'!Q235","v":0},{"$f":"'شهر 10'!R235","v":0},{"$f":"'شهر 10'!S235","v":0},{"$f":"'شهر 10'!T235","v":0},{"$f":"'شهر 10'!U235","v":0},{"$f":"'شهر 10'!V235","v":0},{"$f":"'شهر 10'!W235","v":0},{"$f":"'شهر 10'!X235","v":0},{"$f":"'شهر 10'!Y235","v":0},{"$f":"'شهر 10'!Z235","v":0},{"$f":"'شهر 10'!AA235","v":0},{"$f":"'شهر 10'!AB235","v":0},{"$f":"'شهر 10'!AC235","v":0},{"$f":"'شهر 10'!AD235","v":0},{"$f":"'شهر 10'!AE235","v":0},{"$f":"'شهر 10'!AF235","v":0},{"$f":"'شهر 10'!AG235","v":0},{"$f":"'شهر 10'!AH235","v":0}]
[null,null,null,null,null,null,{"$f":"'شهر 10'!D236","v":0},{"$f":"'شهر 10'!E236","v":0},{"$f":"'شهر 10'!F236","v":0},{"$f":"'شهر 10'!G236","v":0},{"$f":"'شهر 10'!H236","v":0},{"$f":"'شهر 10'!I236","v":0},{"$f":"'شهر 10'!J236","v":0},{"$f":"'شهر 10'!K236","v":0},{"$f":"'شهر 10'!L236","v":0},{"$f":"'شهر 10'!M236","v":0},{"$f":"'شهر 10'!N236","v":0},{"$f":"'شهر 10'!O236","v":0},{"$f":"'شهر 10'!P236","v":0},{"$f":"'شهر 10'!Q236","v":0},{"$f":"'شهر 10'!R236","v":0},{"$f":"'شهر 10'!S236","v":0},{"$f":"'شهر 10'!T236","v":0},{"$f":"'شهر 10'!U236","v":0},{"$f":"'شهر 10'!V236","v":0},{"$f":"'شهر 10'!W236","v":0},{"$f":"'شهر 10'!X236","v":0},{"$f":"'شهر 10'!Y236","v":0},{"$f":"'شهر 10'!Z236","v":0},{"$f":"'شهر 10'!AA236","v":0},{"$f":"'شهر 10'!AB236","v":0},{"$f":"'شهر 10'!AC236","v":0},{"$f":"'شهر 10'!AD236","v":0},{"$f":"'شهر 10'!AE236","v":0},{"$f":"'شهر 10'!AF236","v":0},{"$f":"'شهر 10'!AG236","v":0},{"$f":"'شهر 10'!AH236","v":0}]
[118,null,{"$f":"'شهر 10'!AI237","v":0},{"$f":"'شهر 10'!AJ237","v":0},{"$f":"'شهر 10'!AK237","v":0},null,{"$f":"'شهر 10'!D237","v":0},{"$f":"'شهر 10'!E237","v":0},{"$f":"'شهر 10'!F237","v":0},{"$f":"'شهر 10'!G237","v":0},{"$f":"'شهر 10'!H237","v":0},{"$f":"'شهر 10'!I237","v":0},{"$f":"'شهر 10'!J237","v":0},{"$f":"'شهر 10'!K237","v":0},{"$f":"'شهر 10'!L237","v":0},{"$f":"'شهر 10'!M237","v":0},{"$f":"'شهر 10'!N237","v":0},{"$f":"'شهر 10'!O237","v":0},{"$f":"'شهر 10'!P237","v":0},{"$f":"'شهر 10'!Q237","v":0},{"$f":"'شهر 10'!R237","v":0},{"$f":"'شهر 10'!S237","v":0},{"$f":"'شهر 10'!T237","v":0},{"$f":"'شهر 10'!U237","v":0},{"$f":"'شهر 10'!V237","v":0},{"$f":"'شهر 10'!W237","v":0},{"$f":"'شهر 10'!X237","v":0},{"$f":"'شهر 10'!Y237","v":0},{"$f":"'شهر 10'!Z237","v":0},{"$f":"'شهر 10'!AA237","v":0},{"$f":"'شهر 10'!AB237","v":0},{"$f":"'شهر 10'!AC237","v":0},{"$f":"'شهر 10'!AD237","v":0},{"$f":"'شهر 10'!AE237","v":0},{"$f":"'شهر 10'!AF237","v":0},{"$f":"'شهر 10'!AG237","v":0},{"$f":"'شهر 10'!AH237","v":0}]
[null,null,null,null,null,null,{"$f":"'شهر 10'!D238","v":0},{"$f":"'شهر 10'!E238","v":0},{"$f":"'شهر 10'!F238","v":0},{"$f":"'شهر 10'!G238","v":0},{"$f":"'شهر 10'!H238","v":0},{"$f":"'شهر 10'!I238","v":0},{"$f":"'شهر 10'!J238","v":0},{"$f":"'شهر 10'!K238","v":0},{"$f":"'شهر 10'!L238","v":0},{"$f":"'شهر 10'!M238","v":0},{"$f":"'شهر 10'!N238","v":0},{"$f":"'شهر 10'!O238","v":0},{"$f":"'شهر 10'!P238","v":0},{"$f":"'شهر 10'!Q238","v":0},{"$f":"'شهر 10'!R238","v":0},{"$f":"'شهر 10'!S238","v":0},{"$f":"'شهر 10'!T238","v":0},{"$f":"'شهر 10'!U238","v":0},{"$f":"'شهر 10'!V238","v":0},{"$f":"'شهر 10'!W238","v":0},{"$f":"'شهر 10'!X238","v":0},{"$f":"'شهر 10'!Y238","v":0},{"$f":"'شهر 10'!Z238","v":0},{"$f":"'شهر 10'!AA238","v":0},{"$f":"'شهر 10'!AB238","v":0},{"$f":"'شهر 10'!AC238","v":0},{"$f":"'شهر 10'!AD238","v":0},{"$f":"'شهر 10'!AE238","v":0},{"$f":"'شهر 10'!AF238","v":0},{"$f":"'شهر 10'!AG238","v":0},{"$f":"'شهر 10'!AH238","v":0}]
[119,null,{"$f":"'شهر 10'!AI239","v":0},{"$f":"'شهر 10'!AJ239","v":0},{"$f":"'شهر 10'!AK239","v":0},null,{"$f":"'شهر 10'!D239","v":0},{"$f":"'شهر 10'!E239","v":0},{"$f":"'شهر 10'!F239","v":0},{"$f":"'شهر 10'!G239","v":0},{"$f":"'شهر 10'!H239","v":0},{"$f":"'شهر 10'!I239","v":0},{"$f":"'شهر 10'!J239","v":0},{"$f":"'شهر 10'!K239","v":0},{"$f":"'شهر 10'!L239","v":0},{"$f":"'شهر 10'!M239","v":0},{"$f":"'شهر 10'!N239","v":0},{"$f":"'شهر 10'!O239","v":0},{"$f":"'شهر 10'!P239","v":0},{"$f":"'شهر 10'!Q239","v":0},{"$f":"'شهر 10'!R239","v":0},{"$f":"'شهر 10'!S239","v":0},{"$f":"'شهر 10'!T239","v":0},{"$f":"'شهر 10'!U239","v":0},{"$f":"'شهر 10'!V239","v":0},{"$f":"'شهر 10'!W239","v":0},{"$f":"'شهر 10'!X239","v":0},{"$f":"'شهر 10'!Y239","v":0},{"$f":"'شهر 10'!Z239","v":0},{"$f":"'شهر 10'!AA239","v":0},{"$f":"'شهر 10'!AB239","v":0},{"$f":"'شهر 10'!AC239","v":0},{"$f":"'شهر 10'!AD239","v":0},{"$f":"'شهر 10'!AE239","v":0},{"$f":"'شهر 10'!AF239","v":0},{"$f":"'شهر 10'!AG239","v":0},{"$f":"'شهر 10'!AH239","v":0}]
[null,null,null,null,null,null,{"$f":"'شهر 10'!D240","v":0},{"$f":"'شهر 10'!E240","v":0},{"$f":"'شهر 10'!F240","v":0},{"$f":"'شهر 10'!G240","v":0},{"$f":"'شهر 10'!H240","v":0},{"$f":"'شهر 10'!I240","v":0},{"$f":"'شهر 10'!J240","v":0},{"$f":"'شهر 10'!K240","v":0},{"$f":"'شهر 10'!L240","v":0},{"$f":"'شهر 10'!M240","v":0},{"$f":"'شهر 10'!N240","v":0},{"$f":"'شهر 10'!O240","v":0},{"$f":"'شهر 10'!P240","v":0},{"$f":"'شهر 10'!Q240","v":0},{"$f":"'شهر 10'!R240","v":0},{"$f":"'شهر 10'!S240","v":0},{"$f":"'شهر 10'!T240","v":0},{"$f":"'شهر 10'!U240","v":0},{"$f":"'شهر 10'!V240","v":0},{"$f":"'شهر 10'!W240","v":0},{"$f":"'شهر 10'!X240","v":0},{"$f":"'شهر 10'!Y240","v":0},{"$f":"'شهر 10'!Z240","v":0},{"$f":"'شهر 10'!AA240","v":0},{"$f":"'شهر 10'!AB240","v":0},{"$f":"'شهر 10'!AC240","v":0},{"$f":"'شهر 10'!AD240","v":0},{"$f":"'شهر 10'!AE240","v":0},{"$f":"'شهر 10'!AF240","v":0},{"$f":"'شهر 10'!AG240","v":0},{"$f":"'شهر 10'!AH240","v":0}]
[120,null,{"$f":"'شهر 10'!AI241","v":0},{"$f":"'شهر 10'!AJ241","v":0},{"$f":"'شهر 10'!AK241","v":0},null,{"$f":"'شهر 10'!D241","v":0},{"$f":"'شهر 10'!E241","v":0},{"$f":"'شهر 10'!F241","v":0},{"$f":"'شهر 10'!G241","v":0},{"$f":"'شهر 10'!H241","v":0},{"$f":"'شهر 10'!I241","v":0},{"$f":"'شهر 10'!J241","v":0},{"$f":"'شهر 10'!K241","v":0},{"$f":"'شهر 10'!L241","v":0},{"$f":"'شهر 10'!M241","v":0},{"$f":"'شهر 10'!N241","v":0},{"$f":"'شهر 10'!O241","v":0},{"$f":"'شهر 10'!P241","v":0},{"$f":"'شهر 10'!Q241","v":0},{"$f":"'شهر 10'!R241","v":0},{"$f":"'شهر 10'!S241","v":0},{"$f":"'شهر 10'!T241","v":0},{"$f":"'شهر 10'!U241","v":0},{"$f":"'شهر 10'!V241","v":0},{"$f":"'شهر 10'!W241","v":0},{"$f":"'شهر 10'!X241","v":0},{"$f":"'شهر 10'!Y241","v":0},{"$f":"'شهر 10'!Z241","v":0},{"$f":"'شهر 10'!AA241","v":0},{"$f":"'شهر 10'!AB241","v":0},{"$f":"'شهر 10'!AC241","v":0},{"$f":"'شهر 10'!AD241","v":0},{"$f":"'شهر 10'!AE241","v":0},{"$f":"'شهر 10'!AF241","v":0},{"$f":"'شهر 10'!AG241","v":0},{"$f":"'شهر 10'!AH241","v":0}]
[null,null,null,null,null,null,{"$f":"'شهر 10'!D242","v":0},{"$f":"'شهر 10'!E242","v":0},{"$f":"'شهر 10'!F242","v":0},{"$f":"'شهر 10'!G242","v":0},{"$f":"'شهر 10'!H242","v":0},{"$f":"'شهر 10'!I242","v":0},{"$f":"'شهر 10'!J242","v":0},{"$f":"'شهر 10'!K242","v":0},{"$f":"'شهر 10'!L242","v":0},{"$f":"'شهر 10'!M242","v":0},{"$f":"'شهر 10'!N242","v":0},{"$f":"'شهر 10'!O242","v":0},{"$f":"'شهر 10'!P242","v":0},{"$f":"'شهر 10'!Q242","v":0},{"$f":"'شهر 10'!R242","v":0},{"$f":"'شهر 10'!S242","v":0},{"$f":"'شهر 10'!T242","v":0},{"$f":"'شهر 10'!U242","v":0},{"$f":"'شهر 10'!V242","v":0},{"$f":"'شهر 10'!W242","v":0},{"$f":"'شهر 10'!X242","v":0},{"$f":"'شهر 10'!Y242","v":0},{"$f":"'شهر 10'!Z242","v":0},{"$f":"'شهر 10'!AA242","v":0},{"$f":"'شهر 10'!AB242","v":0},{"$f":"'شهر 10'!AC242","v":0},{"$f":"'شهر 10'!AD242","v":0},{"$f":"'شهر 10'!AE242","v":0},{"$f":"'شهر 10'!AF242","v":0},{"$f":"'شهر 10'!AG242","v":0},{"$f":"'شهر 10'!AH242","v":0}]
[121,null,{"$f":"'شهر 10'!AI243","v":0},{"$f":"'شهر 10'!AJ243","v":0},{"$f":"'شهر 10'!AK243","v":0},null,{"$f":"'شهر 10'!D243","v":0},{"$f":"'شهر 10'!E243","v":0},{"$f":"'شهر 10'!F243","v":0},{"$f":"'شهر 10'!G243","v":0},{"$f":"'شهر 10'!H243","v":0},{"$f":"'شهر 10'!I243","v":0},{"$f":"'شهر 10'!J243","v":0},{"$f":"'شهر 10'!K243","v":0},{"$f":"'شهر 10'!L243","v":0},{"$f":"'شهر 10'!M243","v":0},{"$f":"'شهر 10'!N243","v":0},{"$f":"'شهر 10'!O243","v":0},{"$f":"'شهر 10'!P243","v":0},{"$f":"'شهر 10'!Q243","v":0},{"$f":"'شهر 10'!R243","v":0},{"$f":"'شهر 10'!S243","v":0},{"$f":"'شهر 10'!T243","v":0},{"$f":"'شهر 10'!U243","v":0},{"$f":"'شهر 10'!V243","v":0},{"$f":"'شهر 10'!W243","v":0},{"$f":"'شهر 10'!X243","v":0},{"$f":"'شهر 10'!Y243","v":0},{"$f":"'شهر 10'!Z243","v":0},{"$f":"'شهر 10'!AA243","v":0},{"$f":"'شهر 10'!AB243","v":0},{"$f":"'شهر 10'!AC243","v":0},{"$f":"'شهر 10'!AD243","v":0},{"$f":"'شهر 10'!AE243","v":0},{"$f":"'شهر 10'!AF243","v":0},{"$f":"'شهر 10'!AG243","v":0},{"$f":"'شهر 10'!AH243","v":0}]
[null,null,null,null,null,null,{"$f":"'شهر 10'!D244","v":0},{"$f":"'شهر 10'!E244","v":0},{"$f":"'شهر 10'!F244","v":0},{"$f":"'شهر 10'!G244","v":0},{"$f":"'شهر 10'!H244","v":0},{"$f":"'شهر 10'!I244","v":0},{"$f":"'شهر 10'!J244","v":0},{"$f":"'شهر 10'!K244","v":0},{"$f":"'شهر 10'!L244","v":0},{"$f":"'شهر 10'!M244","v":0},{"$f":"'شهر 10'!N244","v":0},{"$f":"'شهر 10'!O244","v":0},{"$f":"'شهر 10'!P244","v":0},{"$f":"'شهر 10'!Q244","v":0},{"$f":"'شهر 10'!R244","v":0},{"$f":"'شهر 10'!S244","v":0},{"$f":"'شهر 10'!T244","v":0},{"$f":"'شهر 10'!U244","v":0},{"$f":"'شهر 10'!V244","v":0},{"$f":"'شهر 10'!W244","v":0},{"$f":"'شهر 10'!X244","v":0},{"$f":"'شهر 10'!Y244","v":0},{"$f":"'شهر 10'!Z244","v":0},{"$f":"'شهر 10'!AA244","v":0},{"$f":"'شهر 10'!AB244","v":0},{"$f":"'شهر 10'!AC244","v":0},{"$f":"'شهر 10'!AD244","v":0},{"$f":"'شهر 10'!AE244","v":0},{"$f":"'شهر 10'!AF244","v":0},{"$f":"'شهر 10'!AG244","v":0},{"$f":"'شهر 10'!AH244","v":0}]
[122,null,{"$f":"'شهر 10'!AI245","v":0},{"$f":"'شهر 10'!AJ245","v":0},{"$f":"'شهر 10'!AK245","v":0},null,{"$f":"'شهر 10'!D245","v":0},{"$f":"'شهر 10'!E245","v":0},{"$f":"'شهر 10'!F245","v":0},{"$f":"'شهر 10'!G245","v":0},{"$f":"'شهر 10'!H245","v":0},{"$f":"'شهر 10'!I245","v":0},{"$f":"'شهر 10'!J245","v":0},{"$f":"'شهر 10'!K245","v":0},{"$f":"'شهر 10'!L245","v":0},{"$f":"'شهر 10'!M245","v":0},{"$f":"'شهر 10'!N245","v":0},{"$f":"'شهر 10'!O245","v":0},{"$f":"'شهر 10'!P245","v":0},{"$f":"'شهر 10'!Q245","v":0},{"$f":"'شهر 10'!R245","v":0},{"$f":"'شهر 10'!S245","v":0},{"$f":"'شهر 10'!T245","v":0},{"$f":"'شهر 10'!U245","v":0},{"$f":"'شهر 10'!V245","v":0},{"$f":"'شهر 10'!W245","v":0},{"$f":"'شهر 10'!X245","v":0},{"$f":"'شهر 10'!Y245","v":0},{"$f":"'شهر 10'!Z245","v":0},{"$f":"'شهر 10'!AA245","v":0},{"$f":"'شهر 10'!AB245","v":0},{"$f":"'شهر 10'!AC245","v":0},{"$f":"'شهر 10'!AD245","v":0},{"$f":"'شهر 10'!AE245","v":0},{"$f":"'شهر 10'!AF245","v":0},{"$f":"'شهر 10'!AG245","v":0},{"$f":"'شهر 10'!AH245","v":0}]
[null,null,null,null,null,null,{"$f":"'شهر 10'!D246","v":0},{"$f":"'شهر 10'!E246","v":0},{"$f":"'شهر 10'!F246","v":0},{"$f":"'شهر 10'!G246","v":0},{"$f":"'شهر 10'!H246","v":0},{"$f":"'شهر 10'!I246","v":0},{"$f":"'شهر 10'!J246","v":0},{"$f":"'شهر 10'!K246","v":0},{"$f":"'شهر 10'!L246","v":0},{"$f":"'شهر 10'!M246","v":0},{"$f":"'شهر 10'!N246","v":0},{"$f":"'شهر 10'!O246","v":0},{"$f":"'شهر 10'!P246","v":0},{"$f":"'شهر 10'!Q246","v":0},{"$f":"'شهر 10'!R246","v":0},{"$f":"'شهر 10'!S246","v":0},{"$f":"'شهر 10'!T246","v":0},{"$f":"'شهر 10'!U246","v":0},{"$f":"'شهر 10'!V246","v":0},{"$f":"'شهر 10'!W246","v":0},{"$f":"'شهر 10'!X246","v":0},{"$f":"'شهر 10'!Y246","v":0},{"$f":"'شهر 10'!Z246","v":0},{"$f":"'شهر 10'!AA246","v":0},{"$f":"'شهر 10'!AB246","v":0},{"$f":"'شهر 10'!AC246","v":0},{"$f":"'شهر 10'!AD246","v":0},{"$f":"'شهر 10'!AE246","v":0},{"$f":"'شهر 10'!AF246","v":0},{"$f":"'شهر 10'!AG246","v":0},{"$f":"'شهر 10'!AH246","v":0}]
[123,null,{"$f":"'شهر 10'!AI247","v":0},{"$f":"'شهر 10'!AJ247","v":0},{"$f":"'شهر 10'!AK247","v":0},null,{"$f":"'شهر 10'!D247","v":0},{"$f":"'شهر 10'!E247","v":0},{"$f":"'شهر 10'!F247","v":0},{"$f":"'شهر 10'!G247","v":0},{"$f":"'شهر 10'!H247","v":0},{"$f":"'شهر 10'!I247","v":0},{"$f":"'شهر 10'!J247","v":0},{"$f":"'شهر 10'!K247","v":0},{"$f":"'شهر 10'!L247","v":0},{"$f":"'شهر 10'!M247","v":0},{"$f":"'شهر 10'!N247","v":0},{"$f":"'شهر 10'!O247","v":0},{"$f":"'شهر 10'!P247","v":0},{"$f":"'شهر 10'!Q247","v":0},{"$f":"'شهر 10'!R247","v":0},{"$f":"'شهر 10'!S247","v":0},{"$f":"'شهر 10'!T247","v":0},{"$f":"'شهر 10'!U247","v":0},{"$f":"'شهر 10'!V247","v":0},{"$f":"'شهر 10'!W247","v":0},{"$f":"'شهر 10'!X247","v":0},{"$f":"'شهر 10'!Y247","v":0},{"$f":"'شهر 10'!Z247","v":0},{"$f":"'شهر 10'!AA247","v":0},{"$f":"'شهر 10'!AB247","v":0},{"$f":"'شهر 10'!AC247","v":0},{"$f":"'شهر 10'!AD247","v":0},{"$f":"'شهر 10'!AE247","v":0},{"$f":"'شهر 10'!AF247","v":0},{"$f":"'شهر 10'!AG247","v":0},{"$f":"'شهر 10'!AH247","v":0}]
[null,null,null,null,null,null,{"$f":"'شهر 10'!D248","v":0},{"$f":"'شهر 10'!E248","v":0},{"$f":"'شهر 10'!F248","v":0},{"$f":"'شهر 10'!G248","v":0},{"$f":"'شهر 10'!H248","v":0},{"$f":"'شهر 10'!I248","v":0},{"$f":"'شهر 10'!J248","v":0},{"$f":"'شهر 10'!K248","v":0},{"$f":"'شهر 10'!L248","v":0},{"$f":"'شهر 10'!M248","v":0},{"$f":"'شهر 10'!N248","v":0},{"$f":"'شهر 10'!O248","v":0},{"$f":"'شهر 10'!P248","v":0},{"$f":"'شهر 10'!Q248","v":0},{"$f":"'شهر 10'!R248","v":0},{"$f":"'شهر 10'!S248","v":0},{"$f":"'شهر 10'!T248","v":0},{"$f":"'شهر 10'!U248","v":0},{"$f":"'شهر 10'!V248","v":0},{"$f":"'شهر 10'!W248","v":0},{"$f":"'شهر 10'!X248","v":0},{"$f":"'شهر 10'!Y248","v":0},{"$f":"'شهر 10'!Z248","v":0},{"$f":"'شهر 10'!AA248","v":0},{"$f":"'شهر 10'!AB248","v":0},{"$f":"'شهر 10'!AC248","v":0},{"$f":"'شهر 10'!AD248","v":0},{"$f":"'شهر 10'!AE248","v":0},{"$f":"'شهر 10'!AF248","v":0},{"$f":"'شهر 10'!AG248","v":0},{"$f":"'شهر 10'!AH248","v":0}]
[124,null,{"$f":"'شهر 10'!AI249","v":0},{"$f":"'شهر 10'!AJ249","v":0},{"$f":"'شهر 10'!AK249","v":0},null,{"$f":"'شهر 10'!D249","v":0},{"$f":"'شهر 10'!E249","v":0},{"$f":"'شهر 10'!F249","v":0},{"$f":"'شهر 10'!G249","v":0},{"$f":"'شهر 10'!H249","v":0},{"$f":"'شهر 10'!I249","v":0},{"$f":"'شهر 10'!J249","v":0},{"$f":"'شهر 10'!K249","v":0},{"$f":"'شهر 10'!L249","v":0},{"$f":"'شهر 10'!M249","v":0},{"$f":"'شهر 10'!N249","v":0},{"$f":"'شهر 10'!O249","v":0},{"$f":"'شهر 10'!P249","v":0},{"$f":"'شهر 10'!Q249","v":0},{"$f":"'شهر 10'!R249","v":0},{"$f":"'شهر 10'!S249","v":0},{"$f":"'شهر 10'!T249","v":0},{"$f":"'شهر 10'!U249","v":0},{"$f":"'شهر 10'!V249","v":0},{"$f":"'شهر 10'!W249","v":0},{"$f":"'شهر 10'!X249","v":0},{"$f":"'شهر 10'!Y249","v":0},{"$f":"'شهر 10'!Z249","v":0},{"$f":"'شهر 10'!AA249","v":0},{"$f":"'شهر 10'!AB249","v":0},{"$f":"'شهر 10'!AC249","v":0},{"$f":"'شهر 10'!AD249","v":0},{"$f":"'شهر 10'!AE249","v":0},{"$f":"'شهر 10'!AF249","v":0},{"$f":"'شهر 10'!AG249","v":0},{"$f":"'شهر 10'!AH249","v":0}]
[null,null,null,null,null,null,{"$f":"'شهر 10'!D250","v":0},{"$f":"'شهر 10'!E250","v":0},{"$f":"'شهر 10'!F250","v":0},{"$f":"'شهر 10'!G250","v":0},{"$f":"'شهر 10'!H250","v":0},{"$f":"'شهر 10'!I250","v":0},{"$f":"'شهر 10'!J250","v":0},{"$f":"'شهر 10'!K250","v":0},{"$f":"'شهر 10'!L250","v":0},{"$f":"'شهر 10'!M250","v":0},{"$f":"'شهر 10'!N250","v":0},{"$f":"'شهر 10'!O250","v":0},{"$f":"'شهر 10'!P250","v":0},{"$f":"'شهر 10'!Q250","v":0},{"$f":"'شهر 10'!R250","v":0},{"$f":"'شهر 10'!S250","v":0},{"$f":"'شهر 10'!T250","v":0},{"$f":"'شهر 10'!U250","v":0},{"$f":"'شهر 10'!V250","v":0},{"$f":"'شهر 10'!W250","v":0},{"$f":"'شهر 10'!X250","v":0},{"$f":"'شهر 10'!Y250","v":0},{"$f":"'شهر 10'!Z250","v":0},{"$f":"'شهر 10'!AA250","v":0},{"$f":"'شهر 10'!AB250","v":0},{"$f":"'شهر 10'!AC250","v":0},{"$f":"'شهر 10'!AD250","v":0},{"$f":"'شهر 10'!AE250","v":0},{"$f":"'شهر 10'!AF250","v":0},{"$f":"'شهر 10'!AG250","v":0},{"$f":"'شهر 10'!AH250","v":0}]
[125,null,{"$f":"'شهر 10'!AI251","v":0},{"$f":"'شهر 10'!AJ251","v":0},{"$f":"'شهر 10'!AK251","v":0},null,{"$f":"'شهر 10'!D251","v":0},{"$f":"'شهر 10'!E251","v":0},{"$f":"'شهر 10'!F251","v":0},{"$f":"'شهر 10'!G251","v":0},{"$f":"'شهر 10'!H251","v":0},{"$f":"'شهر 10'!I251","v":0},{"$f":"'شهر 10'!J251","v":0},{"$f":"'شهر 10'!K251","v":0},{"$f":"'شهر 10'!L251","v":0},{"$f":"'شهر 10'!M251","v":0},{"$f":"'شهر 10'!N251","v":0},{"$f":"'شهر 10'!O251","v":0},{"$f":"'شهر 10'!P251","v":0},{"$f":"'شهر 10'!Q251","v":0},{"$f":"'شهر 10'!R251","v":0},{"$f":"'شهر 10'!S251","v":0},{"$f":"'شهر 10'!T251","v":0},{"$f":"'شهر 10'!U251","v":0},{"$f":"'شهر 10'!V251","v":0},{"$f":"'شهر 10'!W251","v":0},{"$f":"'شهر 10'!X251","v":0},{"$f":"'شهر 10'!Y251","v":0},{"$f":"'شهر 10'!Z251","v":0},{"$f":"'شهر 10'!AA251","v":0},{"$f":"'شهر 10'!AB251","v":0},{"$f":"'شهر 10'!AC251","v":0},{"$f":"'شهر 10'!AD251","v":0},{"$f":"'شهر 10'!AE251","v":0},{"$f":"'شهر 10'!AF251","v":0},{"$f":"'شهر 10'!AG251","v":0},{"$f":"'شهر 10'!AH251","v":0}]
[null,null,null,null,null,null,{"$f":"'شهر 10'!D252","v":0},{"$f":"'شهر 10'!E252","v":0},{"$f":"'شهر 10'!F252","v":0},{"$f":"'شهر 10'!G252","v":0},{"$f":"'شهر 10'!H252","v":0},{"$f":"'شهر 10'!I252","v":0},{"$f":"'شهر 10'!J252","v":0},{"$f":"'شهر 10'!K252","v":0},{"$f":"'شهر 10'!L252","v":0},{"$f":"'شهر 10'!M252","v":0},{"$f":"'شهر 10'!N252","v":0},{"$f":"'شهر 10'!O252","v":0},{"$f":"'شهر 10'!P252","v":0},{"$f":"'شهر 10'!Q252","v":0},{"$f":"'شهر 10'!R252","v":0},{"$f":"'شهر 10'!S252","v":0},{"$f":"'شهر 10'!T252","v":0},{"$f":"'شهر 10'!U252","v":0},{"$f":"'شهر 10'!V252","v":0},{"$f":"'شهر 10'!W252","v":0},{"$f":"'شهر 10'!X252","v":0},{"$f":"'شهر 10'!Y252","v":0},{"$f":"'شهر 10'!Z252","v":0},{"$f":"'شهر 10'!AA252","v":0},{"$f":"'شهر 10'!AB252","v":0},{"$f":"'شهر 10'!AC252","v":0},{"$f":"'شهر 10'!AD252","v":0},{"$f":"'شهر 10'!AE252","v":0},{"$f":"'شهر 10'!AF252","v":0},{"$f":"'شهر 10'!AG252","v":0},{"$f":"'شهر 10'!AH252","v":0}]

{"sheet":"الرئيسية (1)","index":4,"n_rows":9,"n_cols":6,"rows_kept":9,"cut":false,"hidden":true,"merged":[[7,2,7,3],[8,2,8,3],[0,0,0,8],[1,0,1,8],[2,0,2,8],[4,1,4,3],[5,1,5,3]]}
["كشف حدادين"]
["من شهر 10/2021"]
["الي شهر 12/2021"]
[]
[]
["الاسم",26,null,null,"شهر","شهر 8"]
[]
[null,"ID","حضور",null,"سلف"]
[null,{"$f":"VLOOKUP($B$6,#REF!,MATCH(B$8,#REF!,0),FALSE)","v":{"$error":"#REF!"}},{"$error":"#REF!"},null,{"$f":"VLOOKUP($B$6,#REF!,MATCH(E$8,#REF!,0),FALSE)","v":{"$error":"#REF!"}}]

{"sheet":"الرئيسية (2)","index":5,"n_rows":9,"n_cols":6,"rows_kept":9,"cut":false,"hidden":true,"merged":[[7,2,7,3],[8,2,8,3],[0,0,0,8],[1,0,1,8],[2,0,2,8],[4,1,4,3],[5,1,5,3]]}
["كشف حدادين"]
["من شهر 10/2021"]
["الي شهر 12/2021"]
[]
[]
["الاسم",26,null,null,"شهر","شهر 8"]
[]
[null,"ID","حضور",null,"سلف"]
[null,{"$f":"VLOOKUP($B$6,#REF!,MATCH(B$8,#REF!,0),FALSE)","v":{"$error":"#REF!"}},{"$error":"#REF!"},null,{"$f":"VLOOKUP($B$6,#REF!,MATCH(E$8,#REF!,0),FALSE)","v":{"$error":"#REF!"}}]

{"sheet":"كارت حضور عاملين","index":6,"n_rows":49,"n_cols":17,"rows_kept":49,"cut":false,"hidden":false,"merged":[[48,1,48,6],[48,8,48,10],[48,11,48,15],[29,1,29,8],[29,9,29,11],[29,12,29,15],[44,2,44,12],[46,0,46,15],[41,12,41,15],[41,1,41,4],[42,1,42,4],[42,9,42,11],[42,12,42,15],[41,6,42,7],[41,9,41,11],[0,0,0,15],[2,1,2,8],[2,9,2,11],[2,12,2,15],[3,1,3,8],[3,9,3,11],[3,12,3,15],[27,1,27,8],[27,9,27,11],[27,12,27,15],[28,1,28,8],[28,9,28,11],[28,12,28,15],[21,0,21,15],[23,8,23,10],[23,11,23,15],[25,0,25,15],[23,1,23,6],[19,13,19,14],[4,1,4,8],[4,9,4,11],[4,12,4,15],[16,1,16,4],[16,6,17,7],[16,12,16,15],[17,1,17,4],[17,12,17,15],[16,9,16,11],[17,9,17,11],[19,2,19,12]]}
["كارت حضور العاملين"]
[]
["اسم الموظف",{"$f":"IFERROR(VLOOKUP(M3,DATA!A3:AK252,2,FALSE),\"\")","v":"ابراهيم العيسوى"},null,null,null,null,null,null,null,"كود الموظف",null,null,85]
["اسم المشروع",null,null,null,null,null,null,null,null,"كود المشروع"]
["الوظيفة",null,null,null,null,null,null,null,null,"الشهر"]
[null,{"$f":"IFERROR(VLOOKUP(M3,DATA!A3:AK252,7,FALSE),\"\")","v":0},{"$f":"IFERROR(VLOOKUP(M3,DATA!A3:AK252,8,FALSE),\"\")","v":0},{"$f":"IFERROR(VLOOKUP(M3,DATA!A3:AK252,9,FALSE),\"\")","v":0},{"$f":"IFERROR(VLOOKUP(M3,DATA!A3:AK252,10,FALSE),\"\")","v":0},{"$f":"IFERROR(VLOOKUP(M3,DATA!A3:AK252,11,FALSE),\"\")","v":0},{"$f":"IFERROR(VLOOKUP(M3,DATA!A3:AK252,12,FALSE),\"\")","v":0},{"$f":"IFERROR(VLOOKUP(M3,DATA!A3:AK252,13,FALSE),\"\")","v":0},{"$f":"IFERROR(VLOOKUP(M3,DATA!A3:AK252,14,FALSE),\"\")","v":0},{"$f":"IFERROR(VLOOKUP(M3,DATA!A3:AK252,15,FALSE),\"\")","v":0},{"$f":"IFERROR(VLOOKUP(M3,DATA!A3:AK252,16,FALSE),\"\")","v":0},{"$f":"IFERROR(VLOOKUP(M3,DATA!A3:AK252,17,FALSE),\"\")","v":0},{"$f":"IFERROR(VLOOKUP(M3,DATA!A3:AK252,18,FALSE),\"\")","v":0},{"$f":"IFERROR(VLOOKUP(M3,DATA!A3:AK252,19,FALSE),\"\")","v":0},{"$f":"IFERROR(VLOOKUP(M3,DATA!A3:AK252,20,FALSE),\"\")","v":0},{"$f":"IFERROR(VLOOKUP(M3,DATA!A3:AK252,21,FALSE),\"\")","v":0}]
["التاريخ",1,2,3,4,5,6,7,8,9,10,11,12,13,14,15]
["الفتره الصباحية",{"$f":"IF(B$6>=4,\"✔\",\"X\")","v":"X"},{"$f":"IF(C$6>=4,\"✔\",\"X\")","v":"X"},"X","X","X","X","X","X","X","X","X","X","X","X","X"]
["الفتره المسائية",{"$f":"IF(B6>=8,\"✔\",\"X\")","v":"X"},{"$f":"IF(C6>=8,\"✔\",\"X\")","v":"X"},"X","X","X","X","X","X","X","X","X","X","X","X","X"]
["الاضافي",{"$f":"IF(B6=11,\"3\",IF(B6=12,\"4\",IF(B6=13,\"5\",IF(B6=14,\"6\",IF(B6=15,\"7\",IF(B6=16,\"8\",\"X\"))))))","v":"X"},{"$f":"IF(C6=11,\"3\",IF(C6=12,\"4\",IF(C6=13,\"5\",IF(C6=14,\"6\",IF(C6=15,\"7\",IF(C6=16,\"8\",\"X\"))))))","v":"X"},"X","X","X","X","X","X","X","X","X","X","X","X","X"]
[null,{"$f":"IFERROR(VLOOKUP(M3,DATA!A3:AK252,22,FALSE),\"\")","v":0},{"$f":"IFERROR(VLOOKUP(M3,DATA!A3:AK252,23,FALSE),\"\")","v":0},{"$f":"IFERROR(VLOOKUP(M3,DATA!A3:AK252,24,FALSE),\"\")","v":0},{"$f":"IFERROR(VLOOKUP(M3,DATA!A3:AK252,25,FALSE),\"\")","v":0},{"$f":"IFERROR(VLOOKUP(M3,DATA!A3:AK252,26,FALSE),\"\")","v":0},{"$f":"IFERROR(VLOOKUP(M3,DATA!A3:AK252,27,FALSE),\"\")","v":0},{"$f":"IFERROR(VLOOKUP(M3,DATA!A3:AK252,28,FALSE),\"\")","v":0},{"$f":"IFERROR(VLOOKUP(M3,DATA!A3:AK252,29,FALSE),\"\")","v":0},{"$f":"IFERROR(VLOOKUP(M3,DATA!A3:AK252,30,FALSE),\"\")","v":0},{"$f":"IFERROR(VLOOKUP(M3,DATA!A3:AK252,31,FALSE),\"\")","v":0},{"$f":"IFERROR(VLOOKUP(M3,DATA!A3:AK252,32,FALSE),\"\")","v":0},{"$f":"IFERROR(VLOOKUP(M3,DATA!A3:AK252,33,FALSE),\"\")","v":0},{"$f":"IFERROR(VLOOKUP(M3,DATA!A3:AK252,34,FALSE),\"\")","v":0},{"$f":"IFERROR(VLOOKUP(M3,DATA!A3:AK252,35,FALSE),\"\")","v":0},{"$f":"IFERROR(VLOOKUP(M3,DATA!A3:AK252,36,FALSE),\"\")","v":0},{"$f":"IFERROR(VLOOKUP(M3,DATA!A3:AK252,37,FALSE),\"\")","v":0}]
["التاريخ",16,17,18,19,20,21,22,23,24,25,26,27,28,29,30,31]
["الفتره الصباحية",{"$f":"IF(B11>=4,\"✔\",\"X\")","v":"X"},{"$f":"IF(C11>=4,\"✔\",\"X\")","v":"X"},"X","X","X","X","X","X","X","X","X","X","X","X","X",{"$f":"IF(Q11>=4,\"✔\",\"X\")","v":"X"}]
["الفتره المسائية",{"$f":"IF(B11>=8,\"✔\",\"X\")","v":"X"},{"$f":"IF(C11>=8,\"✔\",\"X\")","v":"X"},"X","X","X","X","X","X","X","X","X","X","X","X","X",{"$f":"IF(Q11>=8,\"✔\",\"X\")","v":"X"}]
["الاضافي",{"$f":"IF(B11=11,\"3\",IF(B11=12,\"4\",IF(B11=13,\"5\",IF(B11=14,\"6\",IF(B11=15,\"7\",IF(B11=16,\"8\",\"X\"))))))","v":"X"},{"$f":"IF(C11=11,\"3\",IF(C11=12,\"4\",IF(C11=13,\"5\",IF(C11=14,\"6\",IF(C11=15,\"7\",IF(C11=16,\"8\",\"X\"))))))","v":"X"},"X","X","X","X","X","X","X","X","X","X","X","X","X",{"$f":"IF(Q11=11,\"3\",IF(Q11=12,\"4\",IF(Q11=13,\"5\",IF(Q11=14,\"6\",IF(Q11=15,\"7\",IF(Q11=16,\"8\",\"X\"))))))","v":"X"}]
[]
["عدد ايام العمل",{"$f":"IFERROR(VLOOKUP(M3,DATA!A3:AK252,4,FALSE),\"\")","v":0},null,null,null,null,{"$f":"IFERROR(VLOOKUP(M3,DATA!A3:AK252,6,FALSE),\"\")","v":0},null,null,"سلف",null,null,{"$f":"IFERROR(VLOOKUP(M3,DATA!A3:AK252,5,FALSE),\"\")","v":0}]
["عدد ساعات العمل",{"$f":"IFERROR(VLOOKUP(M3,DATA!A3:AK252,3,FALSE),\"\")","v":0},null,null,null,null,null,null,null,"حساب الموظف",null,null,{"$f":"B17*G17-M17","v":0}]
[]
[]
[]
[]
[]
["مدير المشروع",null,null,null,null,null,null,null,"تم اعدادة بواسطة"]
[]
["كارت حضور العاملين"]
[]
["اسم الموظف",null,null,null,null,null,null,null,null,"كود الموظف"]
["اسم المشروع",null,null,null,null,null,null,null,null,"كود المشروع"]
["الوظيفة",null,null,null,null,null,null,null,null,"الشهر"]
[]
["التاريخ",1,2,3,4,5,6,7,8,9,10,11,12,13,14,15]
["الفتره الصباحية",{"$f":"IF('شهر 10'!D5>=4,\"☑\",\"X\")","v":"X"},{"$f":"IF('شهر 10'!E5>=4,\"☑\",\"X\")","v":"X"},{"$f":"IF('شهر 10'!F5>=4,\"☑\",\"X\")","v":"X"},{"$f":"IF('شهر 10'!G5>=4,\"☑\",\"X\")","v":"X"},{"$f":"IF('شهر 10'!H5>=4,\"☑\",\"X\")","v":"X"},{"$f":"IF('شهر 10'!I5>=4,\"☑\",\"X\")","v":"X"},{"$f":"IF('شهر 10'!J5>=4,\"☑\",\"X\")","v":"X"},{"$f":"IF('شهر 10'!K5>=4,\"☑\",\"X\")","v":"X"},{"$f":"IF('شهر 10'!L5>=4,\"☑\",\"X\")","v":"X"},{"$f":"IF('شهر 10'!M5>=4,\"☑\",\"X\")","v":"X"},{"$f":"IF('شهر 10'!N5>=4,\"☑\",\"X\")","v":"X"},{"$f":"IF('شهر 10'!O5>=4,\"☑\",\"X\")","v":"X"},{"$f":"IF('شهر 10'!P5>=4,\"☑\",\"X\")","v":"X"},{"$f":"IF('شهر 10'!Q5>=4,\"☑\",\"X\")","v":"X"},{"$f":"IF('شهر 10'!R5>=4,\"☑\",\"X\")","v":"X"}]
["الفتره المسائية",{"$f":"IF('شهر 10'!D5>=8,\"☑\",\"X\")","v":"X"},{"$f":"IF('شهر 10'!E5>=8,\"☑\",\"X\")","v":"X"},{"$f":"IF('شهر 10'!F5>=8,\"☑\",\"X\")","v":"X"},{"$f":"IF('شهر 10'!G5>=8,\"☑\",\"X\")","v":"X"},{"$f":"IF('شهر 10'!H5>=8,\"☑\",\"X\")","v":"X"},{"$f":"IF('شهر 10'!I5>=8,\"☑\",\"X\")","v":"X"},{"$f":"IF('شهر 10'!J5>=8,\"☑\",\"X\")","v":"X"},{"$f":"IF('شهر 10'!K5>=8,\"☑\",\"X\")","v":"X"},{"$f":"IF('شهر 10'!L5>=8,\"☑\",\"X\")","v":"X"},{"$f":"IF('شهر 10'!M5>=8,\"☑\",\"X\")","v":"X"},{"$f":"IF('شهر 10'!N5>=8,\"☑\",\"X\")","v":"X"},{"$f":"IF('شهر 10'!O5>=8,\"☑\",\"X\")","v":"X"},{"$f":"IF('شهر 10'!P5>=8,\"☑\",\"X\")","v":"X"},{"$f":"IF('شهر 10'!Q5>=8,\"☑\",\"X\")","v":"X"},{"$f":"IF('شهر 10'!R5>=8,\"☑\",\"X\")","v":"X"}]
["الاضافي",{"$f":"IF('شهر 10'!D5=12,\"4\",IF('شهر 10'!D5=13,\"5\",\"X\"))","v":"X"},{"$f":"IF('شهر 10'!E5=12,\"4\",IF('شهر 10'!E5=13,\"5\",\"X\"))","v":"X"},{"$f":"IF('شهر 10'!F5=12,\"4\",IF('شهر 10'!F5=13,\"5\",\"X\"))","v":"X"},{"$f":"IF('شهر 10'!G5=12,\"4\",IF('شهر 10'!G5=13,\"5\",\"X\"))","v":"X"},{"$f":"IF('شهر 10'!H5=12,\"4\",IF('شهر 10'!H5=13,\"5\",\"X\"))","v":"X"},{"$f":"IF('شهر 10'!I5=12,\"4\",IF('شهر 10'!I5=13,\"5\",\"X\"))","v":"X"},{"$f":"IF('شهر 10'!J5=12,\"4\",IF('شهر 10'!J5=13,\"5\",\"X\"))","v":"X"},{"$f":"IF('شهر 10'!K5=12,\"4\",IF('شهر 10'!K5=13,\"5\",\"X\"))","v":"X"},{"$f":"IF('شهر 10'!L5=12,\"4\",IF('شهر 10'!L5=13,\"5\",\"X\"))","v":"X"},{"$f":"IF('شهر 10'!M5=12,\"4\",IF('شهر 10'!M5=13,\"5\",\"X\"))","v":"X"},{"$f":"IF('شهر 10'!N5=12,\"4\",IF('شهر 10'!N5=13,\"5\",\"X\"))","v":"X"},{"$f":"IF('شهر 10'!O5=12,\"4\",IF('شهر 10'!O5=13,\"5\",\"X\"))","v":"X"},{"$f":"IF('شهر 10'!P5=12,\"4\",IF('شهر 10'!P5=13,\"5\",\"X\"))","v":"X"},{"$f":"IF('شهر 10'!Q5=12,\"4\",IF('شهر 10'!Q5=13,\"5\",\"X\"))","v":"X"},{"$f":"IF('شهر 10'!R5=12,\"4\",IF('شهر 10'!R5=13,\"5\",\"X\"))","v":"X"}]
[]
["التاريخ",16,17,18,19,20,21,22,23,24,25,26,27,28,29,30,31]
["الفتره الصباحية",{"$f":"IF('شهر 10'!S5>=4,\"☑\",\"X\")","v":"X"},{"$f":"IF('شهر 10'!T5>=4,\"☑\",\"X\")","v":"X"},{"$f":"IF('شهر 10'!U5>=4,\"☑\",\"X\")","v":"X"},{"$f":"IF('شهر 10'!V5>=4,\"☑\",\"X\")","v":"X"},{"$f":"IF('شهر 10'!W5>=4,\"☑\",\"X\")","v":"X"},{"$f":"IF('شهر 10'!X5>=4,\"☑\",\"X\")","v":"X"},{"$f":"IF('شهر 10'!Y5>=4,\"☑\",\"X\")","v":"X"},{"$f":"IF('شهر 10'!Z5>=4,\"☑\",\"X\")","v":"X"},{"$f":"IF('شهر 10'!AA5>=4,\"☑\",\"X\")","v":"X"},{"$f":"IF('شهر 10'!AB5>=4,\"☑\",\"X\")","v":"X"},{"$f":"IF('شهر 10'!AC5>=4,\"☑\",\"X\")","v":"X"},{"$f":"IF('شهر 10'!AD5>=4,\"☑\",\"X\")","v":"X"},{"$f":"IF('شهر 10'!AE5>=4,\"☑\",\"X\")","v":"X"},{"$f":"IF('شهر 10'!AF5>=4,\"☑\",\"X\")","v":"X"},{"$f":"IF('شهر 10'!AG5>=4,\"☑\",\"X\")","v":"X"},{"$f":"IF(Q36>=4,\"✔\",\"X\")","v":"X"}]
["الفتره المسائية",{"$f":"IF('شهر 10'!S5>=8,\"☑\",\"X\")","v":"X"},{"$f":"IF('شهر 10'!T5>=8,\"☑\",\"X\")","v":"X"},{"$f":"IF('شهر 10'!U5>=8,\"☑\",\"X\")","v":"X"},{"$f":"IF('شهر 10'!V5>=8,\"☑\",\"X\")","v":"X"},{"$f":"IF('شهر 10'!W5>=8,\"☑\",\"X\")","v":"X"},{"$f":"IF('شهر 10'!X5>=8,\"☑\",\"X\")","v":"X"},{"$f":"IF('شهر 10'!Y5>=8,\"☑\",\"X\")","v":"X"},{"$f":"IF('شهر 10'!Z5>=8,\"☑\",\"X\")","v":"X"},{"$f":"IF('شهر 10'!AA5>=8,\"☑\",\"X\")","v":"X"},{"$f":"IF('شهر 10'!AB5>=8,\"☑\",\"X\")","v":"X"},{"$f":"IF('شهر 10'!AC5>=8,\"☑\",\"X\")","v":"X"},{"$f":"IF('شهر 10'!AD5>=8,\"☑\",\"X\")","v":"X"},{"$f":"IF('شهر 10'!AE5>=8,\"☑\",\"X\")","v":"X"},{"$f":"IF('شهر 10'!AF5>=8,\"☑\",\"X\")","v":"X"},{"$f":"IF('شهر 10'!AG5>=8,\"☑\",\"X\")","v":"X"},{"$f":"IF(Q36>=8,\"✔\",\"X\")","v":"X"}]
["الاضافي",{"$f":"IF('شهر 10'!S5=12,\"4\",IF('شهر 10'!S5=13,\"5\",\"X\"))","v":"X"},{"$f":"IF('شهر 10'!T5=12,\"4\",IF('شهر 10'!T5=13,\"5\",\"X\"))","v":"X"},{"$f":"IF('شهر 10'!U5=12,\"4\",IF('شهر 10'!U5=13,\"5\",\"X\"))","v":"X"},{"$f":"IF('شهر 10'!V5=12,\"4\",IF('شهر 10'!V5=13,\"5\",\"X\"))","v":"X"},{"$f":"IF('شهر 10'!W5=12,\"4\",IF('شهر 10'!W5=13,\"5\",\"X\"))","v":"X"},{"$f":"IF('شهر 10'!X5=12,\"4\",IF('شهر 10'!X5=13,\"5\",\"X\"))","v":"X"},{"$f":"IF('شهر 10'!Y5=12,\"4\",IF('شهر 10'!Y5=13,\"5\",\"X\"))","v":"X"},{"$f":"IF('شهر 10'!Z5=12,\"4\",IF('شهر 10'!Z5=13,\"5\",\"X\"))","v":"X"},{"$f":"IF('شهر 10'!AA5=12,\"4\",IF('شهر 10'!AA5=13,\"5\",\"X\"))","v":"X"},{"$f":"IF('شهر 10'!AB5=12,\"4\",IF('شهر 10'!AB5=13,\"5\",\"X\"))","v":"X"},{"$f":"IF('شهر 10'!AC5=12,\"4\",IF('شهر 10'!AC5=13,\"5\",\"X\"))","v":"X"},{"$f":"IF('شهر 10'!AD5=12,\"4\",IF('شهر 10'!AD5=13,\"5\",\"X\"))","v":"X"},{"$f":"IF('شهر 10'!AE5=12,\"4\",IF('شهر 10'!AE5=13,\"5\",\"X\"))","v":"X"},{"$f":"IF('شهر 10'!AF5=12,\"4\",IF('شهر 10'!AF5=13,\"5\",\"X\"))","v":"X"},{"$f":"IF('شهر 10'!AG5=12,\"4\",IF('شهر 10'!AG5=13,\"5\",\"X\"))","v":"X"},{"$f":"IF(Q36=11,\"3\",IF(Q36=12,\"4\",IF(Q36=13,\"5\",IF(Q36=14,\"6\",IF(Q36=15,\"7\",IF(Q36=16,\"8\",\"X\"))))))","v":"X"}]
[]
["عدد ايام العمل",null,null,null,null,null,null,null,null,"سلف"]
["عدد ساعات العمل",null,null,null,null,null,null,null,null,"حساب الموظف"]
[]
[]
[]
[]
[]
["مدير المشروع",null,null,null,null,null,null,null,"تم اعدادة بواسطة"]