{"text_format":"1","workbook":"xlsx","n_sheets":8,"sheets":["data","list garde","tab garde","tabprof","gradeeta","gradeeta (2)","جدول الامتحان 3","جدول الامتحان 1 2"],"not_rendered":{"charts":0,"images":2,"macros":1,"external_links":1,"defined_names":6,"comments":0,"pivot_tables":0},"unopened":[],"bounds":{"document_bytes":16777216,"sheet_cells":100000,"rows_first":2000,"rows_last":500,"rows_between":2000,"halvings":0,"cell_chars":16384,"cell_head_chars":4096},"cells_cut":0,"cells_raw":0,"read":"whole","date_system":"1900"}

{"sheet":"data","index":0,"n_rows":98,"n_cols":10,"rows_kept":98,"cut":false,"hidden":false,"merged":[[36,9,43,9],[0,5,0,6],[4,9,11,9],[12,9,19,9],[20,9,27,9],[28,9,35,9]]}
[null,"فى حالة  مادتين فى نفس الفترة اكتب المادتين معا  مثلا فيزياء+عربية",null,null,null,"ادخل تاريخ بداية الامتحان",null,"2021-11-28","العنوان","جدول حراسة اختبارات الفصل الثاني"]
[null,null,null,null,null,null,null,null,"السنة الدراسية","2012/2011"]
[null,"مواد الامتحان",null,null,null,null,null,"مواد الامتحان"]
[null,"المادة","الفترة","التاريخ",null,null,null,"المادة","الفترة","التاريخ"]
[1,"عربية","الصباحية1",{"$f":"$H$1","v":"2021-11-28"},null,null,1,"عربية","10-08",{"$f":"$H$1","v":"2021-11-28"}]
[2,null,"الصباحية2",{"$f":"$H$1","v":"2021-11-28"},null,null,2,null,"11-08"]
[3,"انجليزية","المسائية","2021-11-28",null,null,3,"انجليزية","12-10"]
[4,"رياضيات","الصباحية1",{"$f":"$H$1+1","v":"2021-11-29"},null,null,4,"رياضيات","12-08"]
[5,null,"الصباحية2",{"$f":"$H$1+1","v":"2021-11-29"},null,null,5,null,"15-13"]
[6,"تاريخ","المسائية","2021-11-29",null,null,6,"تاريخ","16-13"]
[7,"علوم","الصباحية1",{"$f":"$H$1+2","v":"2021-11-30"},null,null,7,"علوم","17-15"]
[8,null,"الصباحية2",{"$f":"$H$1+2","v":"2021-11-30"},null,null,8,null,"17-13"]
[9,"فرنسية","المسائية","2021-11-30",null,null,9,"فرنسية","10-08",{"$f":"$H$1+1","v":"2021-11-29"}]
[10,"ع اسلامية","الصباحية1",{"$f":"$H$1+3","v":"2021-12-01"},null,null,10,"ع اسلامية","11-08"]
[11,"قانون","الصباحية2",{"$f":"$H$1+3","v":"2021-12-01"},null,null,11,"قانون","12-10"]
[12,null,"المسائية","2021-12-01",null,null,12,null,"12-08"]
[13,"فيزياء","الصباحية1",{"$f":"$H$1+4","v":"2021-12-02"},null,null,13,"فيزياء","15-13"]
[14,null,"الصباحية2",{"$f":"$H$1+4","v":"2021-12-02"},null,null,14,null,"16-13"]
[15,"فلسفة","المسائية","2021-12-02",null,null,15,"فلسفة","17-15"]
[{"$f":"IF(B20=\"\",\"\",A19+1)","v":""},null,null,null,null,null,16,null,"17-13"]
{"$rows_left_out":79}
{"sheet":"list garde","index":1,"n_rows":81,"n_cols":36,"rows_kept":81,"cut":false,"hidden":false,"merged":[[0,18,0,23],[0,24,0,29],[0,30,0,35],[0,6,0,11],[0,12,0,17]]}
[null,"حدد بلون مغاير الخانات التى لا تريد اللاستاذ يحرس بها",null,null,null,null,{"$f":"data!D5","v":"2021-11-28"},null,null,null,null,null,{"$f":"$G$1+1","v":"2021-11-29"},null,null,null,null,null,{"$f":"$M$1+1","v":"2021-11-30"},null,null,null,null,null,{"$f":"$S$1+1","v":"2021-12-01"},null,null,null,null,null,{"$f":"$Y$1+1","v":"2021-12-02"}]
[null,"ادخل رقم القاعة امام اسم الاستاذ",null,null,null,null,1,2,3,4,5,6,7,8,9,10,11,12,13,14,15,16,17,18,19,20,21,22,23,24,25,26,27,28,29,30]
["الرقم","اللقب و الاسم","الاطار","المادة","عدد القاعات","مجموع ساعات","10-08","11-08","12-10","12-08","16-14","17-14","10-08","11-08","12-10","12-08","16-14","17-14","10-08","11-08","12-10","12-08","16-14","17-14","10-08","11-08","12-10","12-08","16-14","17-14","10-08","11-08","12-10","12-08","16-14","17-14"]
[1,{"$f":"IF(data!D22=\"فارغ\",\"\",data!D22)","v":"استاذ1"},{"$f":"IF(B4=\"\",\"\",data!E22)","v":"ا.ت.ث"},{"$f":"IF(B4=\"\",\"\",data!F22)","v":"رياضيات"},{"$f":"COUNT(G4:AJ4)","v":1},{"$f":"SUMIFS($G$81:$AJ$81,G4:AJ4,\">0\")","v":3},null,null,null,null,null,null,null,null,null,null,null,null,null,14]
[2,{"$f":"IF(data!D23=\"فارغ\",\"\",data!D23)","v":"استاذ2"},{"$f":"IF(B5=\"\",\"\",data!E23)","v":"ا.ت.ث"},{"$f":"IF(B5=\"\",\"\",data!F23)","v":"رياضيات"},{"$f":"COUNT(G5:AJ5)","v":1},3,null,1]
[3,{"$f":"IF(data!D24=\"فارغ\",\"\",data!D24)","v":"استاذ3"},{"$f":"IF(B6=\"\",\"\",data!E24)","v":"ا.ت.ث"},{"$f":"IF(B6=\"\",\"\",data!F24)","v":"رياضيات"},{"$f":"COUNT(G6:AJ6)","v":1},2,14]
[4,{"$f":"IF(data!D25=\"فارغ\",\"\",data!D25)","v":"استاذ4"},{"$f":"IF(B7=\"\",\"\",data!E25)","v":"ا.ت.ث"},{"$f":"IF(B7=\"\",\"\",data!F25)","v":"رياضيات"},1,2,15]
[5,{"$f":"IF(data!D26=\"فارغ\",\"\",data!D26)","v":"استاذ5"},{"$f":"IF(B8=\"\",\"\",data!E26)","v":"ا.ت.ث"},{"$f":"IF(B8=\"\",\"\",data!F26)","v":"رياضيات"},1,2,null,null,null,null,10]
[6,{"$f":"IF(data!D27=\"فارغ\",\"\",data!D27)","v":"استاذ6"},{"$f":"IF(B9=\"\",\"\",data!E27)","v":"ا.ت.ث"},{"$f":"IF(B9=\"\",\"\",data!F27)","v":"فيزياء"},1,2,null,null,null,null,11]
[7,{"$f":"IF(data!D28=\"فارغ\",\"\",data!D28)","v":"استاذ7"},{"$f":"IF(B10=\"\",\"\",data!E28)","v":"ا.ت.ث"},{"$f":"IF(B10=\"\",\"\",data!F28)","v":"فيزياء"},1,2,null,null,null,null,12]
[8,{"$f":"IF(data!D29=\"فارغ\",\"\",data!D29)","v":"استاذ8"},{"$f":"IF(B11=\"\",\"\",data!E29)","v":"ا.ت.ث"},{"$f":"IF(B11=\"\",\"\",data!F29)","v":"فيزياء"},1,2,null,null,null,null,13]
[9,{"$f":"IF(data!D30=\"فارغ\",\"\",data!D30)","v":"استاذ9"},{"$f":"IF(B12=\"\",\"\",data!E30)","v":"ا.ت.ث"},{"$f":"IF(B12=\"\",\"\",data!F30)","v":"فيزياء"},1,2,null,null,null,null,null,null,17]
[10,{"$f":"IF(data!D31=\"فارغ\",\"\",data!D31)","v":"استاذ10"},{"$f":"IF(B13=\"\",\"\",data!E31)","v":"ا.ت.ث"},{"$f":"IF(B13=\"\",\"\",data!F31)","v":"ع. طبيعية"},1,3,null,null,null,null,null,null,null,10]
[11,{"$f":"IF(data!D32=\"فارغ\",\"\",data!D32)","v":"استاذ11"},{"$f":"IF(B14=\"\",\"\",data!E32)","v":"ا.ت.ث"},{"$f":"IF(B14=\"\",\"\",data!F32)","v":"ع. طبيعية"},1,3,null,null,null,null,null,null,null,11]
[12,{"$f":"IF(data!D33=\"فارغ\",\"\",data!D33)","v":"استاذ12"},{"$f":"IF(B15=\"\",\"\",data!E33)","v":"ا.ت.ث"},{"$f":"IF(B15=\"\",\"\",data!F33)","v":"ع. طبيعية"},1,3,null,null,null,null,null,null,null,12]
[13,{"$f":"IF(data!D34=\"فارغ\",\"\",data!D34)","v":"استاذ13"},{"$f":"IF(B16=\"\",\"\",data!E34)","v":"ا.ت.ث"},{"$f":"IF(B16=\"\",\"\",data!F34)","v":"ع. طبيعية"},1,4,null,null,null,null,null,null,null,null,null,16]
[14,{"$f":"IF(data!D35=\"فارغ\",\"\",data!D35)","v":"استاذ14"},{"$f":"IF(B17=\"\",\"\",data!E35)","v":"ا.ت.ث"},{"$f":"IF(B17=\"\",\"\",data!F35)","v":"لغة عربية"},1,3,null,null,null,null,null,null,null,null,null,null,null,10]
[15,{"$f":"IF(data!D36=\"فارغ\",\"\",data!D36)","v":"استاذ15"},{"$f":"IF(B18=\"\",\"\",data!E36)","v":"ا.ت.ث"},{"$f":"IF(B18=\"\",\"\",data!F36)","v":"لغة عربية"},1,3,null,null,null,null,null,null,null,null,null,null,null,11]
[16,{"$f":"IF(data!D37=\"فارغ\",\"\",data!D37)","v":"استاذ16"},{"$f":"IF(B19=\"\",\"\",data!E37)","v":"ا.ت.ث"},{"$f":"IF(B19=\"\",\"\",data!F37)","v":"لغة عربية"},1,2,2]
[17,{"$f":"IF(data!D38=\"فارغ\",\"\",data!D38)","v":"استاذ17"},{"$f":"IF(B20=\"\",\"\",data!E38)","v":"ا.ت.ث"},{"$f":"IF(B20=\"\",\"\",data!F38)","v":"لغة عربية"},1,4,null,null,null,null,null,null,null,null,null,null,null,null,null,null,null,13]
{"$rows_left_out":62}
{"sheet":"tab garde","index":2,"n_rows":18,"n_cols":11,"rows_kept":18,"cut":false,"hidden":false,"merged":[[0,6,0,10],[13,2,13,3],[7,1,7,2],[8,1,8,2],[9,1,9,2],[10,1,10,2],[12,2,12,3]]}
[null,null,null,null,null,null,"عدد الساعات"]
[null,null,null,null,"الشعبة","عدد القاعات",{"$f":"gradeeta!A6","v":"2021-11-28"},{"$f":"G2+1","v":"2021-11-29"},{"$f":"H2+1","v":"2021-11-30"},{"$f":"I2+1","v":"2021-12-01"},{"$f":"J2+1","v":"2021-12-02"}]
[null,null,null,null,"جذع مشترك اداب",2,4,2,4,2,2]
[null,null,null,null,"جذع مشترك علوم",4,4,2,4,2]
[null,null,null,null,"الثانية علوم تجريبية",3,2,4,2,4,2]
[null,null,null,null,"الثانية رياضيات",1,2,4,2,4,2]
[null,null,null,null,"الثانية تقنى رياضي",2,2,4,2,4,2]
[null,"عدد الحراس الاجمالى",null,{"$f":"COUNTIF(data!D22:D98,\"<>فارغ\")","v":56},"الثانية لغات",1,2,4,2,4,2]
[null,"عدد قاعات الاختبار",null,{"$f":"F18","v":24},"الثانية اداب وفلسفة",3,2,4,2,4,2]
[null,"مجموع ساعات الامتحان فى كل القاعات",null,{"$f":"$G$18+$H$18+$I$18+$J$18+$K$18","v":388},"الثانية تسيير و اقتصاد",1,2,4,2,4,2]
[null,"عدد ساعات العمل للحراس",null,{"$f":"D10/D8","v":6.9285714285714288},"الثالثة علوم تجريبية",2,4,5,6,6,3]
[null,null,null,null,"الثالثة رياضيات",1,4,6,4,6,4]
[null,null,{"$f":"\"يعمل \"& D8- MOD(D10,D8) &\" استـــاذ  \"& INT(D10/D8) &\"  ساعات\"","v":"يعمل 4 استـــاذ  6  ساعات"},null,"الثالثة تقنى رياضي",1,4,6,6,6,4]
[null,null,{"$f":"\"يعمل \"& MOD(D10,D8) &\" استـــاذ  \"& INT(D10/D8)+1 &\"  ساعات\"","v":"يعمل 52 استـــاذ  7  ساعات"},null,"الثالثة لغات",1,5,5,6,3,3]
[null,null,null,null,"الثالثة اداب وفلسفة",1,6,4,6,4]
[null,null,null,null,"الثالثة تسيير و اقتصاد",1,4,5,null,6,3]
[]
[null,null,null,null,"المجموع",{"$f":"SUM(F3:F17)","v":24},{"$f":"G3*$F$3+G4*$F$4+G5*$F$5+G6*$F$6+G7*$F$7+G8*$F$8+G9*$F$9+G10*$F$10+G11*$F$11+G12*$F$12+G13*$F$13+G14*$F$14+G15*$F$15+G16*$F$16","v":77},{"$f":"H3*$F$3+H4*$F$4+H5*$F$5+H6*$F$6+H7*$F$7+H8*$F$8+H9*$F$9+H10*$F$10+H11*$F$11+H12*$F$12+H13*$F$13+H14*$F$14+H15*$F$15+H16*$F$16","v":92},{"$f":"I3*$F$3+I4*$F$4+I5*$F$5+I6*$F$6+I7*$F$7+I8*$F$8+I9*$F$9+I10*$F$10+I11*$F$11+I12*$F$12+I13*$F$13+I14*$F$14+I15*$F$15+I16*$F$16","v":80},93,46]

{"sheet":"tabprof","index":3,"n_rows":40,"n_cols":12,"rows_kept":40,"cut":false,"hidden":false,"merged":[[1,10,2,10],[1,11,2,11],[28,1,28,2],[28,6,28,7],[29,1,29,2],[29,6,29,7],[27,1,27,7],[64,3,64,4],[1,1,1,7],[2,1,2,7],[6,1,6,2],[6,6,6,7],[7,1,7,2],[7,6,7,7],[5,1,5,7],[23,1,23,7],[24,1,24,7],[55,1,55,4],[55,6,55,7],[56,1,56,2],[56,6,56,7],[57,1,57,2],[57,6,57,7],[51,1,51,4],[51,6,51,7],[52,1,52,4],[52,6,52,7],[54,2,54,3]]}
[]
[null,"الجمهورية الجزائرية الديمقراطية الشعبية",null,null,null,null,null,null,null,null,1,{"$f":"$K$2+1","v":2}]
[null,"وزارة التربية الوطنية"]
[null,"مديرية التربية بادرار",null,null,null,null,"السنة الدراسية:",{"$f":"data!J2","v":"2012/2011"}]
[null,"ثانوية "]
[null,{"$f":"data!J1","v":"جدول حراسة اختبارات الفصل الثاني"}]
[null,{"$f":"\"الاستاذ: \"&VLOOKUP($K$2,servproftot,2,FALSE)","v":"الاستاذ: استاذ1"}]
[null,{"$f":"\"المادة: \"&VLOOKUP($K$2,servproftot,4,FALSE)","v":"المادة: رياضيات"}]
[null,"                   التوقيت  التاريخ","10-08","11-08","12-10","12-08","16-14","17-14"]
[null,{"$f":"data!$D$5","v":"2021-11-28"},{"$f":"IF(VLOOKUP($K$2,servproftot,(ROW()-10)*6+COLUMN()+4,FALSE)<>0, \"ق\"& VLOOKUP($K$2,servproftot,(ROW()-10)*6+COLUMN()+4,FALSE),\"\")","v":""},{"$f":"IF(VLOOKUP($K$2,servproftot,(ROW()-10)*6+COLUMN()+4,FALSE)<>0, \"ق\"& VLOOKUP($K$2,servproftot,(ROW()-10)*6+COLUMN()+4,FALSE),\"\")","v":""},{"$f":"IF(VLOOKUP($K$2,servproftot,(ROW()-10)*6+COLUMN()+4,FALSE)<>0, \"ق\"& VLOOKUP($K$2,servproftot,(ROW()-10)*6+COLUMN()+4,FALSE),\"\")","v":""},{"$f":"IF(VLOOKUP($K$2,servproftot,(ROW()-10)*6+COLUMN()+4,FALSE)<>0, \"ق\"& VLOOKUP($K$2,servproftot,(ROW()-10)*6+COLUMN()+4,FALSE),\"\")","v":""},{"$f":"IF(VLOOKUP($K$2,servproftot,(ROW()-10)*6+COLUMN()+4,FALSE)<>0, \"ق\"& VLOOKUP($K$2,servproftot,(ROW()-10)*6+COLUMN()+4,FALSE),\"\")","v":""},{"$f":"IF(VLOOKUP($K$2,servproftot,(ROW()-10)*6+COLUMN()+4,FALSE)<>0, \"ق\"& VLOOKUP($K$2,servproftot,(ROW()-10)*6+COLUMN()+4,FALSE),\"\")","v":""}]
[null,{"$f":"data!$D$5+1","v":"2021-11-29"},{"$f":"IF(VLOOKUP($K$2,servproftot,(ROW()-10)*6+COLUMN()+4,FALSE)<>0, \"ق\"& VLOOKUP($K$2,servproftot,(ROW()-10)*6+COLUMN()+4,FALSE),\"\")","v":""},{"$f":"IF(VLOOKUP($K$2,servproftot,(ROW()-10)*6+COLUMN()+4,FALSE)<>0, \"ق\"& VLOOKUP($K$2,servproftot,(ROW()-10)*6+COLUMN()+4,FALSE),\"\")","v":""},{"$f":"IF(VLOOKUP($K$2,servproftot,(ROW()-10)*6+COLUMN()+4,FALSE)<>0, \"ق\"& VLOOKUP($K$2,servproftot,(ROW()-10)*6+COLUMN()+4,FALSE),\"\")","v":""},{"$f":"IF(VLOOKUP($K$2,servproftot,(ROW()-10)*6+COLUMN()+4,FALSE)<>0, \"ق\"& VLOOKUP($K$2,servproftot,(ROW()-10)*6+COLUMN()+4,FALSE),\"\")","v":""},{"$f":"IF(VLOOKUP($K$2,servproftot,(ROW()-10)*6+COLUMN()+4,FALSE)<>0, \"ق\"& VLOOKUP($K$2,servproftot,(ROW()-10)*6+COLUMN()+4,FALSE),\"\")","v":""},{"$f":"IF(VLOOKUP($K$2,servproftot,(ROW()-10)*6+COLUMN()+4,FALSE)<>0, \"ق\"& VLOOKUP($K$2,servproftot,(ROW()-10)*6+COLUMN()+4,FALSE),\"\")","v":""}]
[null,{"$f":"data!$D$5+2","v":"2021-11-30"},{"$f":"IF(VLOOKUP($K$2,servproftot,(ROW()-10)*6+COLUMN()+4,FALSE)<>0, \"ق\"& VLOOKUP($K$2,servproftot,(ROW()-10)*6+COLUMN()+4,FALSE),\"\")","v":""},{"$f":"IF(VLOOKUP($K$2,servproftot,(ROW()-10)*6+COLUMN()+4,FALSE)<>0, \"ق\"& VLOOKUP($K$2,servproftot,(ROW()-10)*6+COLUMN()+4,FALSE),\"\")","v":"ق14"},{"$f":"IF(VLOOKUP($K$2,servproftot,(ROW()-10)*6+COLUMN()+4,FALSE)<>0, \"ق\"& VLOOKUP($K$2,servproftot,(ROW()-10)*6+COLUMN()+4,FALSE),\"\")","v":""},{"$f":"IF(VLOOKUP($K$2,servproftot,(ROW()-10)*6+COLUMN()+4,FALSE)<>0, \"ق\"& VLOOKUP($K$2,servproftot,(ROW()-10)*6+COLUMN()+4,FALSE),\"\")","v":""},{"$f":"IF(VLOOKUP($K$2,servproftot,(ROW()-10)*6+COLUMN()+4,FALSE)<>0, \"ق\"& VLOOKUP($K$2,servproftot,(ROW()-10)*6+COLUMN()+4,FALSE),\"\")","v":""},{"$f":"IF(VLOOKUP($K$2,servproftot,(ROW()-10)*6+COLUMN()+4,FALSE)<>0, \"ق\"& VLOOKUP($K$2,servproftot,(ROW()-10)*6+COLUMN()+4,FALSE),\"\")","v":""}]
[null,{"$f":"data!$D$5+3","v":"2021-12-01"},{"$f":"IF(VLOOKUP($K$2,servproftot,(ROW()-10)*6+COLUMN()+4,FALSE)<>0, \"ق\"& VLOOKUP($K$2,servproftot,(ROW()-10)*6+COLUMN()+4,FALSE),\"\")","v":""},{"$f":"IF(VLOOKUP($K$2,servproftot,(ROW()-10)*6+COLUMN()+4,FALSE)<>0, \"ق\"& VLOOKUP($K$2,servproftot,(ROW()-10)*6+COLUMN()+4,FALSE),\"\")","v":""},{"$f":"IF(VLOOKUP($K$2,servproftot,(ROW()-10)*6+COLUMN()+4,FALSE)<>0, \"ق\"& VLOOKUP($K$2,servproftot,(ROW()-10)*6+COLUMN()+4,FALSE),\"\")","v":""},{"$f":"IF(VLOOKUP($K$2,servproftot,(ROW()-10)*6+COLUMN()+4,FALSE)<>0, \"ق\"& VLOOKUP($K$2,servproftot,(ROW()-10)*6+COLUMN()+4,FALSE),\"\")","v":""},{"$f":"IF(VLOOKUP($K$2,servproftot,(ROW()-10)*6+COLUMN()+4,FALSE)<>0, \"ق\"& VLOOKUP($K$2,servproftot,(ROW()-10)*6+COLUMN()+4,FALSE),\"\")","v":""},{"$f":"IF(VLOOKUP($K$2,servproftot,(ROW()-10)*6+COLUMN()+4,FALSE)<>0, \"ق\"& VLOOKUP($K$2,servproftot,(ROW()-10)*6+COLUMN()+4,FALSE),\"\")","v":""}]
[null,{"$f":"data!$D$5+4","v":"2021-12-02"},{"$f":"IF(VLOOKUP($K$2,servproftot,(ROW()-10)*6+COLUMN()+4,FALSE)<>0, \"ق\"& VLOOKUP($K$2,servproftot,(ROW()-10)*6+COLUMN()+4,FALSE),\"\")","v":""},{"$f":"IF(VLOOKUP($K$2,servproftot,(ROW()-10)*6+COLUMN()+4,FALSE)<>0, \"ق\"& VLOOKUP($K$2,servproftot,(ROW()-10)*6+COLUMN()+4,FALSE),\"\")","v":""},{"$f":"IF(VLOOKUP($K$2,servproftot,(ROW()-10)*6+COLUMN()+4,FALSE)<>0, \"ق\"& VLOOKUP($K$2,servproftot,(ROW()-10)*6+COLUMN()+4,FALSE),\"\")","v":""},{"$f":"IF(VLOOKUP($K$2,servproftot,(ROW()-10)*6+COLUMN()+4,FALSE)<>0, \"ق\"& VLOOKUP($K$2,servproftot,(ROW()-10)*6+COLUMN()+4,FALSE),\"\")","v":""},{"$f":"IF(VLOOKUP($K$2,servproftot,(ROW()-10)*6+COLUMN()+4,FALSE)<>0, \"ق\"& VLOOKUP($K$2,servproftot,(ROW()-10)*6+COLUMN()+4,FALSE),\"\")","v":""},{"$f":"IF(VLOOKUP($K$2,servproftot,(ROW()-10)*6+COLUMN()+4,FALSE)<>0, \"ق\"& VLOOKUP($K$2,servproftot,(ROW()-10)*6+COLUMN()+4,FALSE),\"\")","v":""}]
[]
[null,null,null,null,null,null,"........... فى ",{"$f":"TODAY()","v":"2021-10-30"}]
[]
[null,null,null,null,null,null,null,"الناظــر"]
[]
[]
{"$rows_left_out":21}
{"sheet":"gradeeta","index":4,"n_rows":50,"n_cols":38,"rows_kept":50,"cut":false,"hidden":false,"merged":[[0,29,0,35],[1,29,1,35],[0,11,0,18],[1,11,1,18],[0,20,0,27],[1,20,1,27],[0,0,0,9],[1,0,1,9],[37,0,44,0],[3,0,3,9],[5,0,12,0],[13,0,20,0],[21,0,28,0],[29,0,36,0]]}
["الجمهورية الجزائرية الديمقراطية الشعبية"]
["وزارة التربية الوطنية"]
["مديرية التربية بادرار",null,null,null,null,null,"السنة الدراسية",{"$f":"data!$J$2","v":"2012/2011"},null,null,null,null,null,null,null,"السنة الدراسية",{"$f":"data!$J$2","v":"2012/2011"},null,null,null,null,null,null,null,"السنة الدراسية",{"$f":"data!$J$2","v":"2012/2011"},null,null,null,null,null,null,null,"السنة الدراسية",{"$f":"data!$J$2","v":"2012/2011"}]
[{"$f":"data!J1","v":"جدول حراسة اختبارات الفصل الثاني"}]
[null,"القاعة",1,2,3,4,5,6,7,8,9,10,11,12,13,14,15,16,17,18,19,20,21,22,23,24,25,26,27,28,29,30,31,32,33,34,35,36]
[{"$f":"data!$D$5","v":"2021-11-28"},"10-08",null,null,null,null,null,null,null,null,null,null,null,null,null,"استاذ3","استاذ4"]
[null,"11-08"]
[null,"12-10"]
[null,"12-08"]
[null,"15-13",null,null,null,null,null,null,null,null,null,"استاذ5","استاذ6","استاذ7","استاذ8"]
[null,"16-13"]
[null,"17-15",null,null,null,null,null,null,null,null,null,null,null,null,null,null,null,null,"استاذ9"]
[null,"17-13",null,null,null,null,null,null,null,null,null,"استاذ10","استاذ11","استاذ12"]
[{"$f":"data!$D$5+1","v":"2021-11-29"},"10-08"]
[null,"11-08",null,null,null,null,null,null,null,null,null,null,null,null,null,null,null,"استاذ13"]
[null,"12-10"]
[null,"12-08",null,null,null,null,null,null,null,null,null,"استاذ14","استاذ15"]
[null,"15-13"]
[null,"16-13"]
[null,"17-15"]
{"$rows_left_out":31}
{"sheet":"gradeeta (2)","index":5,"n_rows":50,"n_cols":48,"rows_kept":50,"cut":false,"hidden":false,"merged":[[13,22,20,22],[37,0,44,0],[37,11,44,11],[37,22,44,22],[37,33,44,33],[21,0,28,0],[21,11,28,11],[21,22,28,22],[21,33,28,33],[29,0,36,0],[29,11,36,11],[29,22,36,22],[29,33,36,33],[13,33,20,33],[13,0,20,0],[13,11,20,11],[0,0,0,9],[0,11,0,20],[0,22,0,31],[0,33,0,41],[1,0,1,9],[1,11,1,20],[1,22,1,31],[1,33,1,41],[3,0,3,9],[5,0,12,0],[5,11,12,11],[5,22,12,22],[5,33,12,33]]}
["الجمهورية الجزائرية الديمقراطية الشعبية",null,null,null,null,null,null,null,null,null,null,"الجمهورية الجزائرية الديمقراطية الشعبية",null,null,null,null,null,null,null,null,null,null,"الجمهورية الجزائرية الديمقراطية الشعبية",null,null,null,null,null,null,null,null,null,null,"الجمهورية الجزائرية الديمقراطية الشعبية"]
["وزارة التربية الوطنية",null,null,null,null,null,null,null,null,null,null,"وزارة التربية الوطنية",null,null,null,null,null,null,null,null,null,null,"وزارة التربية الوطنية",null,null,null,null,null,null,null,null,null,null,"وزارة التربية الوطنية"]
["مديرية التربية بادرار",null,null,null,null,null,"السنة الدراسية",{"$f":"data!$J$2","v":"2012/2011"},null,null,null,"مديرية التربية بادرار",null,null,null,null,null,"السنة الدراسية",{"$f":"data!$J$2","v":"2012/2011"},null,null,null,"مديرية التربية بادرار",null,null,null,null,null,"السنة الدراسية",{"$f":"data!$J$2","v":"2012/2011"},null,null,null,"مديرية التربية بادرار",null,null,null,null,null,"السنة الدراسية",{"$f":"data!$J$2","v":"2012/2011"}]
[{"$f":"data!J1","v":"جدول حراسة اختبارات الفصل الثاني"}]
[null,"القاعة",1,2,3,4,5,6,7,8,9,null,"القاعة",10,11,12,13,14,15,16,17,18,null,"القاعة",19,20,21,22,23,24,25,26,27,null,"القاعة",28,29,30,31,32,33,34,35,36]
[{"$f":"data!$D$5","v":"2021-11-28"},"10-08",null,null,null,null,null,null,null,null,null,"","10-08",null,null,null,null,null,null,null,null,null,"","10-08",null,null,null,null,null,null,null,null,null,"","10-08",null,null,null,null,null,null,null,null,null,"","","",""]
[null,"11-08",null,null,null,null,null,null,null,null,null,null,"11-08",null,null,null,null,null,null,null,null,null,null,"11-08",null,null,null,null,null,null,null,null,null,null,"11-08",null,null,null,null,null,null,null,null,null,"","","",""]
[null,"12-10",null,null,null,null,null,null,null,null,null,null,"12-10",null,null,null,null,null,null,null,null,null,null,"12-10",null,null,null,null,null,null,null,null,null,null,"12-10",null,null,null,null,null,null,null,null,null,"","","",""]
[null,"12-08",null,null,null,null,null,null,null,null,null,null,"12-08",null,null,null,null,null,null,null,null,null,null,"12-08",null,null,null,null,null,null,null,null,null,null,"12-08",null,null,null,null,null,null,null,null,null,"","","",""]
[null,"15-13",null,null,null,null,null,null,null,null,null,null,"15-13",null,null,null,null,null,null,null,null,null,null,"15-13",null,null,null,null,null,null,null,null,null,null,"15-13",null,null,null,null,null,null,null,null,null,"","","",""]
[null,"16-13",null,null,null,null,null,null,null,null,null,null,"16-13",null,null,null,null,null,null,null,null,null,null,"16-13",null,null,null,null,null,null,null,null,null,null,"16-13",null,null,null,null,null,null,null,null,null,"","","",""]
[null,"17-15",null,null,null,null,null,null,null,null,null,null,"17-15",null,null,null,null,null,null,null,null,null,null,"17-15",null,null,null,null,null,null,null,null,null,null,"17-15",null,null,null,null,null,null,null,null,null,"","","",""]
[null,"17-13",null,null,null,null,null,null,null,null,null,null,"17-13",null,null,null,null,null,null,null,null,null,null,"17-13",null,null,null,null,null,null,null,null,null,null,"17-13",null,null,null,null,null,null,null,null,null,"","","",""]
[{"$f":"data!$D$5+1","v":"2021-11-29"},"10-08",null,null,null,null,null,null,null,null,null,"","10-08",null,null,null,null,null,null,null,null,null,"","10-08",null,null,null,null,null,null,null,null,null,"","10-08",null,null,null,null,null,null,null,null,null,"","","",""]
[null,"11-08",null,null,null,null,null,null,null,null,null,null,"11-08",null,null,null,null,null,null,null,null,null,null,"11-08",null,null,null,null,null,null,null,null,null,null,"11-08",null,null,null,null,null,null,null,null,null,"","","",""]
[null,"12-10",null,null,null,null,null,null,null,null,null,null,"12-10",null,null,null,null,null,null,null,null,null,null,"12-10",null,null,null,null,null,null,null,null,null,null,"12-10",null,null,null,null,null,null,null,null,null,"","","",""]
[null,"12-08",null,null,null,null,null,null,null,null,null,null,"12-08",null,null,null,null,null,null,null,null,null,null,"12-08",null,null,null,null,null,null,null,null,null,null,"12-08",null,null,null,null,null,null,null,null,null,"","","",""]
[null,"15-13",null,null,null,null,null,null,null,null,null,null,"15-13",null,null,null,null,null,null,null,null,null,null,"15-13",null,null,null,null,null,null,null,null,null,null,"15-13",null,null,null,null,null,null,null,null,null,"","","",""]
[null,"16-13",null,null,null,null,null,null,null,null,null,null,"16-13",null,null,null,null,null,null,null,null,null,null,"16-13",null,null,null,null,null,null,null,null,null,null,"16-13",null,null,null,null,null,null,null,null,null,"","","",""]
[null,"17-15",null,null,null,null,null,null,null,null,null,null,"17-15",null,null,null,null,null,null,null,null,null,null,"17-15",null,null,null,null,null,null,null,null,null,null,"17-15",null,null,null,null,null,null,null,null,null,"","","",""]
{"$rows_left_out":31}
{"sheet":"جدول الامتحان 3","index":6,"n_rows":29,"n_cols":8,"rows_kept":29,"cut":false,"hidden":false,"merged":[[24,0,26,0],[5,0,6,0],[5,1,6,1],[5,2,6,2],[5,7,6,7],[4,0,4,7],[0,0,0,7],[1,0,1,7],[7,0,10,0],[21,0,23,0],[11,0,15,0],[5,5,6,5],[5,3,6,3],[5,4,6,4],[5,6,6,6],[16,0,20,0]]}
["                                                                                                الجمهورية الجزائرية الدمقراطية الشعبية"]
["                                           وزارة التربية الوطنية "]
["مديرية التربية لولاية تسمسيلت                        "]
["ثانوية   "]
["جدول سير إختبارات  الفصل الثاني للسنة الثالثة ثانوي"]
["اليوم","التوقيت","03 آداب وفـلـــــــــــسفة","03 لغات اجنبية","03 علوم تجريبية","03 رياضيات","03 تقني رياضي","03 تسيـــير وإقتــصـــــاد"]
[]
[{"$f":"data!J5","v":"2021-11-28"},"10-08",null,null,"اللغة العربية  وادابها","اللغة العربية  وادابها","اللغة العربية  وادابها","اللغة العربية  وادابها"]
[null,"11-08",null,"اللغة العربية  وادابها"]
[null,"12-08","اللغة العربية  وادابها"]
[null,"16-14","العلوم الإسلامية","العلوم الإسلامية","العلوم الإسلامية","العلوم الإسلامية","العلوم الإسلامية","العلوم الإسلامية"]
[{"$f":"data!J13","v":"2021-11-29"},"10-08","الرياضيات","الرياضيات"]
[null,"11-08",null,null,"الرياضيات",null,null,"الرياضيات"]
[null,"12-08",null,null,null,"الرياضيات","الرياضيات"]
[null,"16-14","اللغة الإنجليزية",null,"اللغة الإنجليزية","اللغة الإنجليزية","اللغة الإنجليزية","اللغة الإنجليزية"]
[null,"17-14",null,"اللغة الإنجليزية"]
[{"$f":"data!J21","v":"2021-11-30"},"10-08",null,null,null,"العلوم الطبيعية"]
[null,"11-08"]
[null,"12-08","الفلسفة",null,"العلوم الطبيعية",null,"تكنولوجيا","التسيير المحاسبي والمالي"]
[null,"16-14","اللغة الفرنسية","الفلسفة","اللغة الفرنسية","اللغة الفرنسية","اللغة الفرنسية","اللغة الفرنسية"]
{"$rows_left_out":10}
{"sheet":"جدول الامتحان 1 2","index":7,"n_rows":29,"n_cols":9,"rows_kept":29,"cut":false,"hidden":false,"merged":[[0,0,0,8],[7,0,10,0],[11,0,14,0],[18,0,21,0],[27,6,27,7],[15,0,17,0],[22,0,25,0],[5,0,6,0],[5,1,6,1],[5,2,6,2],[5,3,6,3],[5,4,6,4],[4,0,4,8],[1,0,1,8]]}
["                                                                                                الجمهورية الجزائرية الدمقراطية الشعبية"]
["                                           وزارة التربية الوطنية "]
["مديرية التربية لولاية ادرار                          ",null,null,null,null,null,null," الموسم الدراسي:2011/2012"]
["ثانوية "]
["جدول سير إختبارات  الفصل الثاني للسنة الاولى و الثانية ثانوي"]
["اليوم","التوقيت","1 ج م اداب","1 ج م علوم","       2ع تجريبية +      2 رياضيات","2تقني رياضي","2تسيير واقتصاد","2اداب وفلسفة","2لغات"]
[]
[{"$f":"data!J5","v":"2021-11-28"},"10-08",null,null,"رياضيات","رياضيات","التسيير م و المحاسبى","فلسفة","المانية"]
[null,"12-10",null,null,"علوم اسلامية","علوم اسلامية","علوم اسلامية","علوم اسلامية","علوم اسلامية"]
[null,"15-13","علوم طبيعية","فيزياء"]
[null,"17-15","علوم اسلامية","علوم اسلامية"]
[{"$f":"data!J13","v":"2021-11-29"},"10-08",null,null,"فيزياء","فيزياء","تاريخ وجغرافيا","تاريخ وجغرافيا","تاريخ وجغرافيا"]
[null,"12-10",null,null,"لغة انجليزية","لغة انجليزية","لغة انجليزية","لغة انجليزية","لغة انجليزية"]
[null,"15-13","لغة عربية","لغة عربية"]
[null,"17-15","لغة فرنسية","لغة فرنسية"]
[{"$f":"data!J21","v":"2021-11-30"},"10-08",null,null,null,null,"لغة فرنسية","لغة فرنسية"]
[null,"09-08","اعلام الي","اعلام الي"]
[null,"10-09","تكنولوجيا"]
[{"$f":"data!J29","v":"2021-12-01"},"10-08","تاريخ وجغرافيا","رياضيات"]
[null,"12-10","رياضيات","تاريخ وجغرافيا"]
{"$rows_left_out":9}