{"text_format":"1","workbook":"xlsx","n_sheets":9,"sheets":["شيت","ناجح","دور ثانى","كشف بالتلاميذ الناجحين","كشف مواد الدور الثاني","الغائبين عن الاختبار","كشوف الدور الثاني","إحصاء نتيجة الدور الأول جميع ال","الأوائل العشرة"],"not_rendered":{"charts":0,"images":1,"macros":1,"external_links":1,"defined_names":23,"comments":0,"pivot_tables":0},"unopened":[],"bounds":{"document_bytes":16777216,"sheet_cells":100000,"rows_first":2000,"rows_last":500,"rows_between":2000,"halvings":0,"cell_chars":16384,"cell_head_chars":4096},"cells_cut":0,"cells_raw":0,"read":"whole","date_system":"1900"}

{"sheet":"شيت","index":0,"n_rows":247,"n_cols":54,"rows_kept":247,"cut":false,"hidden":false,"merged":[[8,36,9,36],[8,37,9,37],[5,19,6,27],[7,2,9,2],[7,1,9,1],[7,17,9,17],[7,16,9,16],[7,15,9,15],[7,14,9,14],[7,13,9,13],[7,10,8,10],[7,12,8,12],[7,11,8,11],[7,9,8,9],[7,8,8,8],[7,7,8,7],[8,34,9,34],[8,35,9,35],[7,0,9,0],[7,6,8,6],[7,5,8,5],[7,4,8,4],[7,3,8,3],[7,41,8,45],[7,47,8,53],[8,20,9,20],[8,19,9,19],[8,26,9,26],[8,27,9,27],[8,39,9,39],[8,38,9,38],[8,25,9,25],[8,24,9,24],[8,23,9,23],[8,22,9,22],[8,21,9,21],[8,31,9,31],[8,32,9,32],[8,33,9,33]]}
[]
[]
[]
[]
[]
[null,null,null,null,null,null,null,null,null,null,null,null,null,null,null,null,null,null,null,"عدد مواد الرسوب"]
[]
["رقم الجلوس","اسم الطالب","الصف","الرياضيات","الدراسات الاجتماعية","الحوسبة وتكنولوجيا المعلومات","الكيمياء","الفيزياء","الأحياء","التربية الإسلامية","اللغة العربية","اللغة الإنجليزية","المجموع الكلي","نتيجة الطالب","النسبة المئوية","التقدير العام للطالب","الترتيب","مواد الدور الثاني",null,{"$f":"COUNTIF(T11:T60,\"x\")","v":6},3,3,6,3,5,3,2,3,null,null,null,null,null,null,null,null,null,null,null,null,null,"ترتيب الأوائل",null,null,null,null,null,"العشر الأوائل"]
[null,null,null,null,null,null,null,null,null,null,null,null,null,null,null,null,null,null,null,"الرياضيات","الدراسات الاجتماعية","الحوسبة وتكنولوجيا المعلومات","الكيمياء","الفيزياء","الأحياء","التربية الإسلامية","اللغة العربية","اللغة الإنجليزية",null,null,null,"الرياضيات","الدراسات الاجتماعية","الحوسبة وتكنولوجيا المعلومات","الكيمياء","الفيزياء","الأحياء","التربية الإسلامية","اللغة العربية","اللغة الإنجليزية"]
[null,null,null,30,30,30,30,30,30,30,30,30,{"$f":"SUM(D10:L10)","v":270},null,null,null,null,null,null,null,null,null,null,null,null,null,null,null,null,null,null,null,null,null,null,null,null,null,null,null,null,"رقم الجلوس","اسم الطالب","المجموع","الترتيب","النتيجة",null,"م","رقم الجلوس","اسم التلميذ","المجموع","الترتيب","مجموع","المركز"]
[{"$f":"ROW()-10","v":1},"احمد حسن احمد سليمان الهيل","10 - 1",22,19,22,19,19,19,19,22,25,{"$f":"IF(B11=\"\",\"\",IF(AND(D11=\"غ\",E11=\"غ\",F11=\"غ\",G11=\"غ\",H11=\"غ\",I11=\"غ\",J11=\"غ\",K11=\"غ\",L11=\"غ\"),\"غ\",SUM(D11,E11,F11,G11,H11,I11,J11,K11,L11)))","v":186},{"$f":"IF(B11=\"\",\"\",AE11)","v":"ناجح"},{"$f":"IF(B11=\"\",\"\",IF(M11=\"غ\",\"غ\",M11/$M$10*100/100))","v":0.68888888888888888},{"$f":"IF(M11=\"\",\"\",IF(M11=\"غ\",\"غ\",IF(M11=0,\"دون المستوى\",IF(M11/$M$10*100>=85,\"ممتاز\",IF(M11/$M$10*100>=75,\"جيد جدا\",IF(M11/$M$10*100>=65,\"جيد\",IF(M11/$M$10*100>=50,\"مقبول\",IF(M11/$M$10*100<50,\"دون المستوى\"))))))))","v":"جيد"},null,{"$f":"CONCATENATE(AF11,AG11,AH11,AI11,AJ11,AK11,AL11)","v":""},null,{"$f":"IF($B11=\"\",\"\",IF(OR(D11<15,D11=\"\",D11=\"غ\",D11=\"صفر\"=\"\"),\"x\",\"\"))","v":""},{"$f":"IF($B11=\"\",\"\",IF(OR(E11<15,E11=\"\",E11=\"غ\",E11=\"صفر\"=\"\"),\"x\",\"\"))","v":""},"","","","","","","",{"$f":"IF(B11=\"\",\"\",COUNTBLANK(T11:Z11))","v":7},{"$f":"IF(B11=\"\",\"\",COUNTIF(T11:Z11,\"x\"))","v":0},{"$f":"IF(B11=\"\",\"\",IF(AC11=7,\"ناجح\",\"دور ثانى\"))","v":"ناجح"},{"$f":"IF(T11=\"x\",\"الرياضيات / \",\"\")","v":""},{"$f":"IF(U11=\"x\",\"الدراسات الاجتماعية / \",\"\")","v":""},{"$f":"IF(V11=\"x\",\"الحوسبة وتكنولوجيا المعلومات / \",\"\")","v":""},{"$f":"IF(W11=\"x\",\"الكيمياء / \",\"\")","v":""},{"$f":"IF(X11=\"x\",\"الفيزياء / \",\"\")","v":""},{"$f":"IF(Y11=\"x\",\"الأحياء / \",\"\")","v":""},{"$f":"IF(Z11=\"x\",\"التربية الإسلامية / \",\"\")","v":""},{"$f":"IF(AA11=\"x\",\"اللغة العربية / \",\"\")","v":""},{"$f":"IF(AB11=\"x\",\"اللغة الإنجليزية / \",\"\")","v":""},null,{"$f":"A11","v":1},{"$f":"B11","v":"احمد حسن احمد سليمان الهيل"},{"$f":"IF(M11=\"\",\"\",IF(M11=\"غ\",\"غ\",M11+1/ROW()*0.001))","v":186.00009090909091},{"$f":"IF(M11=\" \",\" \",IF(M11=\"غ\",\"غ\",RANK(M11,$M$11:$M$60)))","v":43},null,null,1,{"$f":"INDEX($AP$11:$AP$60,MATCH(BA11,$AR$11:$AR$60,0))","v":6},{"$f":"INDEX($AQ$11:$AQ$60,MATCH(BA11,$AR$11:$AR$60,0))","v":"خالد مصعب خضر عبدالله تايه"},{"$f":"IF(BA11=\" \",\" \",ROUNDDOWN(BA11,1))","v":267},{"$f":"RANK(AY11,$AY$11:$AY$20)","v":1},{"$f":"IF(AR11=\" \",\" \",LARGE($AR$11:$AR$60,AV11))","v":267.00006250000001},{"$f":"IF(AZ11=1,\"الأول\",\" \")","v":"الأول"}]
[{"$f":"ROW()-10","v":2},"احمد عبداللاه احمد يحيى عبدالاله","10 - 1",24.5,24.5,26,22.5,29,16,30,29,22.5,224,"ناجح",0.82962962962962961,{"$f":"IF(M12=\"\",\"\",IF(M12=\"غ\",\"غ\",IF(M12=0,\"دون المستوى\",IF(M12/$M$10*100>=85,\"ممتاز\",IF(M12/$M$10*100>=75,\"جيد جدا\",IF(M12/$M$10*100>=65,\"جيد\",IF(M12/$M$10*100>=50,\"مقبول\",IF(M12/$M$10*100<50,\"دون المستوى\"))))))))","v":"جيد جدا"},null,{"$f":"CONCATENATE(AF12,AG12,AH12,AI12,AJ12,AK12,AL12)","v":""},null,{"$f":"IF($B12=\"\",\"\",IF(OR(D12<15,D12=\"\",D12=\"غ\",D12=\"صفر\"=\"\"),\"x\",\"\"))","v":""},{"$f":"IF($B12=\"\",\"\",IF(OR(E12<15,E12=\"\",E12=\"غ\",E12=\"صفر\"=\"\"),\"x\",\"\"))","v":""},{"$f":"IF($B12=\"\",\"\",IF(OR(F12<15,F12=\"\",F12=\"غ\",F12=\"صفر\"=\"\"),\"x\",\"\"))","v":""},{"$f":"IF($B12=\"\",\"\",IF(OR(G12<15,G12=\"\",G12=\"غ\",G12=\"صفر\"=\"\"),\"x\",\"\"))","v":""},{"$f":"IF($B12=\"\",\"\",IF(OR(H12<15,H12=\"\",H12=\"غ\",H12=\"صفر\"=\"\"),\"x\",\"\"))","v":""},{"$f":"IF($B12=\"\",\"\",IF(OR(I12<15,I12=\"\",I12=\"غ\",I12=\"صفر\"=\"\"),\"x\",\"\"))","v":""},{"$f":"IF($B12=\"\",\"\",IF(OR(J12<15,J12=\"\",J12=\"غ\",J12=\"صفر\"=\"\"),\"x\",\"\"))","v":""},{"$f":"IF($B12=\"\",\"\",IF(OR(K12<15,K12=\"\",K12=\"غ\",K12=\"صفر\"=\"\"),\"x\",\"\"))","v":""},{"$f":"IF($B12=\"\",\"\",IF(OR(L12<15,L12=\"\",L12=\"غ\",L12=\"صفر\"=\"\"),\"x\",\"\"))","v":""},7,0,"ناجح",{"$f":"IF(T12=\"x\",\"الرياضيات / \",\"\")","v":""},{"$f":"IF(U12=\"x\",\"الدراسات الاجتماعية / \",\"\")","v":""},{"$f":"IF(V12=\"x\",\"الحوسبة وتكنولوجيا المعلومات / \",\"\")","v":""},{"$f":"IF(W12=\"x\",\"الكيمياء / \",\"\")","v":""},{"$f":"IF(X12=\"x\",\"الفيزياء / \",\"\")","v":""},{"$f":"IF(Y12=\"x\",\"الأحياء / \",\"\")","v":""},{"$f":"IF(Z12=\"x\",\"التربية الإسلامية / \",\"\")","v":""},{"$f":"IF(AA12=\"x\",\"اللغة العربية / \",\"\")","v":""},{"$f":"IF(AB12=\"x\",\"اللغة الإنجليزية / \",\"\")","v":""},null,2,"احمد عبداللاه احمد يحيى عبدالاله",224.00008333333332,33,null,null,2,29,"محمود عادل عبدالمحسن محمد",260,2,260.00002564102562,{"$f":"IF(AZ12=AZ11,BB11&\" مكرر \",IF(AZ12=2,\" الثاني \",\" \"))","v":" الثاني "}]
[3,"احمد محمود احمد عبدالسميع عثمان","10 - 1",28,30,29.5,29,28,28,29,26,25.5,253,"ناجح",0.937037037037037,"ممتاز",null,"",null,"","","","","","","","","",7,0,"ناجح","","","","","","","","","",null,3,"احمد محمود احمد عبدالسميع عثمان",253.00007692307693,9,null,null,3,19,"عمر هشام على بحيرى ابوالخير",259.5,3,259.50003448275862,{"$f":"IF(AZ13=AZ12,BB12&\" مكرر  \",IF(AZ13=3,\" الثالث  \",\" \"))","v":" الثالث  "}]
[4,"جمال عبدالغفار كمال على","10 - 1",24.5,27,27,22.5,25,23,27.5,29,22.5,228,"ناجح",0.84444444444444444,"جيد جدا",null,"",null,"","","","","","","","","",7,0,"ناجح","","","","","","","","","",null,4,"جمال عبدالغفار كمال على",228.00007142857143,29,null,null,4,36,"أحمد اقبال ابواصبع",258.5,4,258.50002173913043,{"$f":"IF(AZ14=AZ13,BB13&\"   \"&\" مكرر\",IF(AZ14=4,\" الرابع  \",\" \"))","v":" الرابع  "}]
[5,"حسن محمد العبود الصالح","10 - 1",25.5,30,27,27,30,27,30,28,18.5,243,"ناجح",0.9,"ممتاز",null,"",null,"","","","","","","","","",7,0,"ناجح","","","","","","","","","",null,5,"حسن محمد العبود الصالح",243.00006666666667,14,null,null,5,26,"محمد عمر عبدالرحيم على",257.5,5,257.5000277777778,{"$f":"IF(AZ15=AZ14,BB14&\"   \"&\" مكرر\",IF(AZ15=5,\" الخامس  \",\" \"))","v":" الخامس  "}]
[6,"خالد مصعب خضر عبدالله تايه","10 - 1",29.5,30,29,30,30,30,30,29,29.5,267,"ناجح",0.98888888888888882,"ممتاز",null,"",null,"","","","","","","","","",7,0,"ناجح","","","","","","","","","",null,6,"خالد مصعب خضر عبدالله تايه",267.00006250000001,1,null,null,6,27,"محمد عمر فتحى عبدالتواب عبدالمقصود",257.5,5,257.50002702702704,{"$f":"IF(AZ16=AZ15,BB15&\"   \"&\" مكرر\",IF(AZ16=6,\" السادس  \",\" \"))","v":" الخامس      مكرر"}]
[7,"سيف سعيد احمد عبدالمجيد عبدالرحيم","10 - 1",27.5,28,24.5,28,28,24,28,27,25.5,240.5,"ناجح",0.89074074074074072,"ممتاز",null,"",null,"","","","","","","","","",7,0,"ناجح","","","","","","","","","",null,7,"سيف سعيد احمد عبدالمجيد عبدالرحيم",240.5000588235294,18,null,null,7,23,"محمد عبدالله السيد بيومي حسن",256,7,256.00003030303031,{"$f":"IF(AZ17=AZ16,BB16&\"   \"&\" مكرر\",IF(AZ17=7,\" السابع  \",\" \"))","v":" السابع  "}]
[8,"شعيب خالد شعيب جاب الله","10 - 1",22,28,29,21,30,28,29,26,28.5,241.5,"ناجح",0.89444444444444438,"ممتاز",null,"",null,"","","","","","","","","",7,0,"ناجح","","","","","","","","","",null,8,"شعيب خالد شعيب جاب الله",241.50005555555555,16,null,null,8,20,"فادي عدنان احمد عبدالجليل",255,8,255.00003333333333,{"$f":"IF(AZ18=AZ17,BB17&\"مكرر\",IF(AZ18=8,\"الثامن\",\" \"))","v":"الثامن"}]
[9,"عادل سعيد فتحي مصطفى عوض  الله","10 - 1",27,30,27,23.5,28,19,30,30,24,238.5,"ناجح",0.8833333333333333,"ممتاز",null,"",null,"","","","","","","","","",7,0,"ناجح","","","","","","","","","",null,9,"عادل سعيد فتحي مصطفى عوض  الله",238.50005263157894,19,null,null,9,3,"احمد محمود احمد عبدالسميع عثمان",253,9,253.00007692307693,{"$f":"IF(AZ19=AZ18,BB18&\"  مكرر\",IF(AZ19=9,\"التاسع\",\" \"))","v":"التاسع"}]
[10,"عامر محمد عمر عجيز","10 - 1",23,19.5,29,19.5,30,26,30,27,24,228,"ناجح",0.84444444444444444,"جيد جدا",null,"",null,"","","","","","","","","",7,0,"ناجح","","","","","","","","","",null,10,"عامر محمد عمر عجيز",228.00004999999999,29,null,null,10,28,"محمود حبيب الله",253,9,253.00002631578948,{"$f":"IF(AZ20=AZ19,BB19&\"  مكرر\",IF(AZ20=10,\"العاشر\",\" \"))","v":"التاسع  مكرر"}]
[11,"عبدالرحمن خالد محمد سليمان الشيخ","10 - 1",26.5,27,20,28,30,29,30,29,29.5,249,"ناجح",0.92222222222222228,"ممتاز",null,"",null,"","","","","","","","","",7,0,"ناجح","","","","","","","","","",null,11,"عبدالرحمن خالد محمد سليمان الشيخ",249.00004761904762,12]
[12,"عبدالرحمن قارى محمد اقبال","10 - 1",27,25,20.5,29,30,22,28,30,26.5,238,"ناجح",0.88148148148148153,"ممتاز",null,"",null,"","","","","","","","","",7,0,"ناجح","","","","","","","","","",null,12,"عبدالرحمن قارى محمد اقبال",238.00004545454544,20]
[13,"عبدالله فتحي سيد محمد جمعه","10 - 1",3,30,30,26.5,30,28,30,30,24.5,232,"دور ثانى",0.85925925925925928,"ممتاز",null,"الرياضيات / ",null,"x","","","","","","","","",6,1,"دور ثانى","الرياضيات / ","","","","","","","","",null,13,"عبدالله فتحي سيد محمد جمعه",232.00004347826086,24]
[14,"عدنان محمد رضا كرار سليمان","10 - 1",30,27,20.5,24,24,21,28.5,30,23.5,228.5,"ناجح",0.84629629629629632,"جيد جدا",null,"",null,"","","","","","","","","",7,0,"ناجح","","","","","","","","","",null,14,"عدنان محمد رضا كرار سليمان",228.50004166666668,28]
[15,"على هصام حامد على الحبابى","10 - 1",26,21,26,25,25,25,24,20,19,211,"ناجح",0.78148148148148133,"جيد جدا",null,"",null,"","","","","","","","","",7,0,"ناجح","","","","","","","","","",null,15,"على هصام حامد على الحبابى",211.00004000000001,37]
[16,"عمر عبدالباسط ابراهيم محمد","10 - 1",26.5,23.5,28.5,25,30,14.5,26.5,27,29.5,231,"دور ثانى",0.85555555555555562,"ممتاز",null,"الأحياء / ",null,"","","","","","x","","","",6,1,"دور ثانى","","","","","","الأحياء / ","","","",null,16,"عمر عبدالباسط ابراهيم محمد",231.00003846153845,26]
[17,"عمر فؤاد اسماعيل ثابت","10 - 1",24.5,24,27,26,27,22.5,26,30,25.5,232.5,"ناجح",0.86111111111111116,"ممتاز",null,"",null,"","","","","","","","","",7,0,"ناجح","","","","","","","","","",null,17,"عمر فؤاد اسماعيل ثابت",232.50003703703703,23]
[18,"عمر مصطفى محمد عوه","10 - 1",26,29,22.5,30,27,22.5,30,28,27.5,242.5,"ناجح",0.89814814814814814,"ممتاز",null,"",null,"","","","","","","","","",7,0,"ناجح","","","","","","","","","",null,18,"عمر مصطفى محمد عوه",242.5000357142857,15]
[19,"عمر هشام على بحيرى ابوالخير","10 - 1",30,30,27,28,30,28,30,29,27.5,259.5,"ناجح",0.96111111111111114,"ممتاز",null,"",null,"","","","","","","","","",7,0,"ناجح","","","","","","","","","",null,19,"عمر هشام على بحيرى ابوالخير",259.50003448275862,3]
[20,"فادي عدنان احمد عبدالجليل","10 - 1",29,30,28.5,27,28,29,30,25,28.5,255,"ناجح",0.94444444444444442,"ممتاز",null,"",null,"","","","","","","","","",7,0,"ناجح","","","","","","","","","",null,20,"فادي عدنان احمد عبدالجليل",255.00003333333333,8]
[21,"مازن محمود السيد عبدالله عبدالوهاب","10 - 1",28,29,29.5,25,24,26,30,25,19,235.5,"ناجح",0.87222222222222223,"ممتاز",null,"",null,"","","","","","","","","",7,0,"ناجح","","","","","","","","","",null,21,"مازن محمود السيد عبدالله عبدالوهاب",235.50003225806452,21]
[22,"محمد احمد محمود شناق","10 - 1",27.5,27,26,27,28,26,29,26,29.5,246,"ناجح",0.91111111111111109,"ممتاز",null,"",null,"","","","","","","","","",7,0,"ناجح","","","","","","","","","",null,22,"محمد احمد محمود شناق",246.00003125000001,13]
[23,"محمد عبدالله السيد بيومي حسن","10 - 1",30,26,26.5,30,30,29,30,27,27.5,256,"ناجح",0.94814814814814818,"ممتاز",null,"",null,"","","","","","","","","",7,0,"ناجح","","","","","","","","","",null,23,"محمد عبدالله السيد بيومي حسن",256.00003030303031,7]
[24,"محمد عقيل عدنان سيد احمد","10 - 1",23.5,30,26.5,26,30,26,25.5,27,26.5,241,"ناجح",0.89259259259259272,"ممتاز",null,"",null,"","","","","","","","","",7,0,"ناجح","","","","","","","","","",null,24,"محمد عقيل عدنان سيد احمد",241.0000294117647,17]
[25,"محمد علي عطيت الله ابراهيم عبداللاه","10 - 1",24,30,23.5,24,30,25,29,27,19.5,232,"ناجح",0.85925925925925928,"ممتاز",null,"",null,"","","","","","","","","",7,0,"ناجح","","","","","","","","","",null,25,"محمد علي عطيت الله ابراهيم عبداللاه",232.00002857142857,24]
[26,"محمد عمر عبدالرحيم على","10 - 1",30,30,29.5,29,30,24.5,28,30,26.5,257.5,"ناجح",0.95370370370370372,"ممتاز",null,"",null,"","","","","","","","","",7,0,"ناجح","","","","","","","","","",null,26,"محمد عمر عبدالرحيم على",257.5000277777778,5]
[27,"محمد عمر فتحى عبدالتواب عبدالمقصود","10 - 1",30,30,28,28,28,27,29,30,27.5,257.5,"ناجح",0.95370370370370372,"ممتاز",null,"",null,"","","","","","","","","",7,0,"ناجح","","","","","","","","","",null,27,"محمد عمر فتحى عبدالتواب عبدالمقصود",257.50002702702704,5]
[28,"محمود حبيب الله","10 - 1",28,30,27,22.5,28,28,30,30,29.5,253,"ناجح",0.937037037037037,"ممتاز",null,"",null,"","","","","","","","","",7,0,"ناجح","","","","","","","","","",null,28,"محمود حبيب الله",253.00002631578948,9]
[29,"محمود عادل عبدالمحسن محمد","10 - 1",28.5,30,29.5,30,30,27,29.5,27,28.5,260,"ناجح",0.96296296296296291,"ممتاز",null,"",null,"","","","","","","","","",7,0,"ناجح","","","","","","","","","",null,29,"محمود عادل عبدالمحسن محمد",260.00002564102562,2]
[30,"معتز احمد كامل على خوالده","10 - 1",30,30,28,null,28,26,29,29,25,225,"دور ثانى",0.83333333333333348,"جيد جدا",null,"الكيمياء / ",null,"","","","x","","","","","",6,1,"دور ثانى","","","","الكيمياء / ","","","","","",null,30,"معتز احمد كامل على خوالده",225.00002499999999,31]
[31,"مهنا احمد محمد سيف النعيمى","10 - 1",null,12,null,8,8,8,null,17,18,71,"دور ثانى",0.26296296296296295,"دون المستوى",null,"الرياضيات / الدراسات الاجتماعية / الحوسبة وتكنولوجيا المعلومات / الكيمياء / الفيزياء / الأحياء / التربية الإسلامية / ",null,"x","x","x","x","x","x","x","","",0,7,"دور ثانى","الرياضيات / ","الدراسات الاجتماعية / ","الحوسبة وتكنولوجيا المعلومات / ","الكيمياء / ","الفيزياء / ","الأحياء / ","التربية الإسلامية / ","","",null,31,"مهنا احمد محمد سيف النعيمى",71.000024390243908,48]
[32,"مؤمن شريف محمد التاج","10 - 1",29.5,30,29.5,null,28,29,30,30,24.5,230.5,"دور ثانى",0.85370370370370385,"ممتاز",null,"الكيمياء / ",null,"","","","x","","","","","",6,1,"دور ثانى","","","","الكيمياء / ","","","","","",null,32,"مؤمن شريف محمد التاج",230.50002380952381,27]
[33,"ياسين احمد صلاح عبداللطيف","10 - 1",null,null,null,null,null,null,null,null,null,0,"دور ثانى",0,"دون المستوى",null,"الرياضيات / الدراسات الاجتماعية / الحوسبة وتكنولوجيا المعلومات / الكيمياء / الفيزياء / الأحياء / التربية الإسلامية / ",null,"x","x","x","x","x","x","x","x","x",0,7,"دور ثانى","الرياضيات / ","الدراسات الاجتماعية / ","الحوسبة وتكنولوجيا المعلومات / ","الكيمياء / ","الفيزياء / ","الأحياء / ","التربية الإسلامية / ","اللغة العربية / ","اللغة الإنجليزية / ",null,{"$f":"A43","v":33},{"$f":"B43","v":"ياسين احمد صلاح عبداللطيف"},{"$f":"IF(M43=\"\",\"\",IF(M43=\"غ\",\"غ\",M43+1/ROW()*0.001))","v":2.3255813953488371E-5},{"$f":"IF(M43=\" \",\" \",IF(M43=\"غ\",\"غ\",RANK(M43,$M$11:$M$60)))","v":49}]
[34,"يوسف محمد سليمان موسى عامر","10 - 1",26.5,30,30,27,28,22,29,30,27,249.5,"ناجح",0.92407407407407405,"ممتاز",null,"",null,"","","","","","","","","",7,0,"ناجح","","","","","","","","","",null,34,"يوسف محمد سليمان موسى عامر",249.50002272727272,11]
[35,"احمد اسامه جميل ابوالعلا","10 - 2",29,24.5,26.5,25,30,26,26,24.5,23,234.5,"ناجح",0.86851851851851847,"ممتاز",null,"",null,"","","","","","","","","",7,0,"ناجح","","","","","","","","","",null,35,"احمد اسامه جميل ابوالعلا",234.50002222222221,22]
[36,"أحمد اقبال ابواصبع","10 - 2",29,30,28.5,28,30,29,28,28.5,27.5,258.5,"ناجح",0.95740740740740737,"ممتاز",null,"",null,"","","","","","","","","",7,0,"ناجح","","","","","","","","","",null,36,"أحمد اقبال ابواصبع",258.50002173913043,4]
[37,"احمد شريف ابراهيم الدسوقى عوض","10 - 2",25,21,28.5,17,29,23,26.5,26.5,28,224.5,"ناجح",0.83148148148148149,"جيد جدا",null,"",null,"","","","","","","","","",7,0,"ناجح","","","","","","","","","",null,37,"احمد شريف ابراهيم الدسوقى عوض",224.50002127659573,32]
[38,"امين بن المنذر بن عثمان","10 - 2",19,19,20,18,18,18,19,20,24,175,"ناجح",0.64814814814814814,"مقبول",null,"",null,"","","","","","","","","",7,0,"ناجح","","","","","","","","","",null,38,"امين بن المنذر بن عثمان",175.00002083333334,45]
[39,"براء اشرف سعيد زكي السيد","10 - 2",29,22,19.5,22,26,19.5,23,22,27,210,"ناجح",0.7777777777777779,"جيد جدا",null,"",null,"","","","","","","","","",7,0,"ناجح","","","","","","","","","",null,39,"براء اشرف سعيد زكي السيد",210.00002040816327,39]
[40,"بريك سالم دغش الجربوعى المرى","10 - 2",18,24,17,14.5,23,21,18,17,22,174.5,"دور ثانى",0.64629629629629615,"مقبول",null,"الكيمياء / ",null,"","","","x","","","","","",6,1,"دور ثانى","","","","الكيمياء / ","","","","","",null,40,"بريك سالم دغش الجربوعى المرى",174.50002000000001,46]
[41,"جوين عماد عبدالحليم داود","10 - 2",21.5,16,22,21.5,28,18.5,21,19,25,192.5,"ناجح",0.71296296296296291,"جيد",null,"",null,"","","","","","","","","",7,0,"ناجح","","","","","","","","","",null,41,"جوين عماد عبدالحليم داود",192.50001960784314,42]
[42,"حمد ناجى مسعد احمد الطيرى","10 - 2",28.5,21,27.5,27.5,30,20,23,23,19,219.5,"ناجح",0.812962962962963,"جيد جدا",null,"",null,"","","","","","","","","",7,0,"ناجح","","","","","","","","","",null,42,"حمد ناجى مسعد احمد الطيرى",219.50001923076923,35]
[43,"خالد طارق عبدالرحمن فوزي رامون","10 - 2",null,null,null,null,null,null,null,null,null,0,"دور ثانى",0,"دون المستوى",null,"الرياضيات / الدراسات الاجتماعية / الحوسبة وتكنولوجيا المعلومات / الكيمياء / الفيزياء / الأحياء / التربية الإسلامية / ",null,"x","x","x","x","x","x","x","x","x",0,7,"دور ثانى","الرياضيات / ","الدراسات الاجتماعية / ","الحوسبة وتكنولوجيا المعلومات / ","الكيمياء / ","الفيزياء / ","الأحياء / ","التربية الإسلامية / ","اللغة العربية / ","اللغة الإنجليزية / ",null,43,"خالد طارق عبدالرحمن فوزي رامون",1.8867924528301888E-5,49]
[44,"خالد ناصر محمد ناصر الدهيمى","10 - 2",14,27,19.5,19.5,23,25,25,24.5,26,203.5,"دور ثانى",0.75370370370370365,"جيد جدا",null,"الرياضيات / ",null,"x","","","","","","","","",6,1,"دور ثانى","الرياضيات / ","","","","","","","","",null,44,"خالد ناصر محمد ناصر الدهيمى",203.50001851851852,40]
[45,"راشد حمد على البكرى اليافعى","10 - 2",23,24,20,19.5,23,17.5,22.5,23.5,21,194,"ناجح",0.71851851851851867,"جيد",null,"",null,"","","","","","","","","",7,0,"ناجح","","","","","","","","","",null,45,"راشد حمد على البكرى اليافعى",194.00001818181818,41]
[46,"رامي سعد فراج فرج علي","10 - 2",18,24,27.5,23,25,23.5,26,28,26,221,"ناجح",0.81851851851851842,"جيد جدا",null,"",null,"","","","","","","","","",7,0,"ناجح","","","","","","","","","",null,46,"رامي سعد فراج فرج علي",221.00001785714286,34]
[47,"زكي واءلئ شحده عطيه ابوعيده","10 - 2",24.5,28,27,20,26,20,19.5,20,26,211,"ناجح",0.78148148148148133,"جيد جدا",null,"",null,"","","","","","","","","",7,0,"ناجح","","","","","","","","","",null,47,"زكي واءلئ شحده عطيه ابوعيده",211.00001754385966,37]
[48,"زيد محمود احمد خشان","10 - 2",23.5,29,21,20.5,29,14,29,25.5,24,215.5,"دور ثانى",0.79814814814814805,"جيد جدا",null,"الأحياء / ",null,"","","","","","x","","","",6,1,"دور ثانى","","","","","","الأحياء / ","","","",null,48,"زيد محمود احمد خشان",215.50001724137931,36]
[49,"سالم محمد سالم البطى الكعبى","10 - 2",8,27,21,16,22,19,19.5,20,14,166.5,"دور ثانى",0.6166666666666667,"مقبول",null,"الرياضيات / ",null,"x","","","","","","","","x",6,1,"دور ثانى","الرياضيات / ","","","","","","","","اللغة الإنجليزية / ",null,49,"سالم محمد سالم البطى الكعبى",166.50001694915255,47]
[50,"سلمان محمد اسلام ناصر احمد","10 - 2",17,16,25.5,15.5,24,25,22,20,18,183,"ناجح",0.67777777777777781,"جيد",null,"",null,"","","","","","","","","",7,0,"ناجح","","","","","","","","","",null,50,"سلمان محمد اسلام ناصر احمد",183.00001666666665,44]
[51,"سيف فهد موسى حسن على","10 - 2",14.5,24,24,17.5,17,22,21.5,15.5,18,174,"دور ثانى",0.64444444444444438,"مقبول",null,{"$f":"CONCATENATE(AF61,AG61,AH61,AI61,AJ61,AK61,AL61)","v":"الرياضيات / "},null,"x","","","","","","","","",6,1,"دور ثانى","الرياضيات / ","","","","","","","","",null,51,{"$f":"B61","v":"سيف فهد موسى حسن على"},{"$f":"IF(M61=\"\",\"\",IF(M61=\"غ\",\"غ\",M61+1/ROW()*0.001))","v":174.00001639344262},{"$error":"#N/A"}]
[52,"عبدالرحمن اشرف فتحى سالم نصار","10 - 2",null,null,null,null,null,null,null,null,null,0,"دور ثانى",0,"دون المستوى",null,"الرياضيات / الدراسات الاجتماعية / الحوسبة وتكنولوجيا المعلومات / الكيمياء / الفيزياء / الأحياء / التربية الإسلامية / ",null,"x","x","x","x","x","x","x","x","x",0,7,"دور ثانى","الرياضيات / ","الدراسات الاجتماعية / ","الحوسبة وتكنولوجيا المعلومات / ","الكيمياء / ","الفيزياء / ","الأحياء / ","التربية الإسلامية / ","اللغة العربية / ","اللغة الإنجليزية / ",null,52,"عبدالرحمن اشرف فتحى سالم نصار",1.6129032258064517E-5,49]
[53,"عبدالرحمن جمال على صالح سيد","10 - 2",23.5,28,18,13.5,27,22,24.5,21,25,202.5,"دور ثانى",0.75,"جيد جدا",null,"الكيمياء / ",null,"","","","x","","","","","",6,1,"دور ثانى","","","","الكيمياء / ","","","","","",null,53,"عبدالرحمن جمال على صالح سيد",202.50001587301588,{"$error":"#N/A"}]
[54,"عبدالرحمن محمد محسن البكري","10 - 2",21.5,26.5,22,18,24,19,26.5,18,21,196.5,"ناجح",0.72777777777777775,"جيد",null,"",null,"","","","","","","","","",7,0,"ناجح","","","","","","","","","",null,54,"عبدالرحمن محمد محسن البكري",196.500015625,{"$error":"#N/A"}]
[55,"عبدالرحمن هيثم اديب ابودلو","10 - 2",28,26,27.5,22.5,28,24,26,24,19,225,"ناجح",0.83333333333333348,"جيد جدا",null,"",null,"","","","","","","","","",7,0,"ناجح","","","","","","","","","",null,55,"عبدالرحمن هيثم اديب ابودلو",225.00001538461538,31]
[56,"عبدالرحيم محمد رشيد الديرشوى","10 - 2",13.5,26,20,22,25,27.5,24.5,23.5,18,200,"دور ثانى",0.74074074074074081,"جيد",null,"الرياضيات / ",null,"x","","","","","","","","",6,1,"دور ثانى","الرياضيات / ","","","","","","","","",null,56,"عبدالرحيم محمد رشيد الديرشوى",200.00001515151516,{"$error":"#N/A"}]
[57,"عبدالعزيز عوض احمد محمد اليافعى","10 - 2",17,23,16,11,25,14.5,25.5,21,19,172,"دور ثانى",0.63703703703703707,"مقبول",null,"الكيمياء / الأحياء / ",null,"","","","x","","x","","","",5,2,"دور ثانى","","","","الكيمياء / ","","الأحياء / ","","","",null,57,"عبدالعزيز عوض احمد محمد اليافعى",172.00001492537314,{"$error":"#N/A"}]
[58,"على عبدالحافظ على منصر منيف","10 - 2",27,25,25.5,20,28,19,29,24,17,214.5,"ناجح",0.7944444444444444,"جيد جدا",null,"",null,"","","","","","","","","",7,0,"ناجح","","","","","","","","","",null,58,"على عبدالحافظ على منصر منيف",214.50001470588236,{"$error":"#N/A"}]
[59,"على نائل محمد عبدالله الخالدى","10 - 2",20,20.5,null,6,10.5,17,16.5,13,24,127.5,"دور ثانى",0.47222222222222221,"دون المستوى",null,"الحوسبة وتكنولوجيا المعلومات / الكيمياء / الفيزياء / ",null,"","","x","x","x","","","x","",4,3,"دور ثانى","","","الحوسبة وتكنولوجيا المعلومات / ","الكيمياء / ","الفيزياء / ","","","اللغة العربية / ","",null,59,"على نائل محمد عبدالله الخالدى",127.50001449275362,{"$error":"#N/A"}]
[60,"فيصل محمد راشد جخدب الهميمى","10 - 2",25.5,28,29.5,29,27,21.5,24,23.5,24,232,"ناجح",0.85925925925925928,"ممتاز",null,"",null,"","","","","","","","","",7,0,"ناجح","","","","","","","","","",null,60,"فيصل محمد راشد جخدب الهميمى",232.00001428571429,24]
[61,"قيس محمد داود ابراهيم ابوديه","10 - 2",25.5,29,26.5,29,30,28,30,27,27,252,"ناجح",0.93333333333333324,"ممتاز",null,"",null,"","","","","","","","","",7,0,"ناجح","","","","","","","","","",null,61,"قيس محمد داود ابراهيم ابوديه",252.00001408450703,{"$error":"#N/A"}]
[62,"لؤي ايهاب محمد احمد محمد","10 - 2",24,26.5,18.5,27,27,25,24,22,27,221,"ناجح",0.81851851851851842,"جيد جدا",null,"",null,"","","","","","","","","",7,0,"ناجح","","","","","","","","","",null,62,"لؤي ايهاب محمد احمد محمد",221.0000138888889,34]
[63,"محمد على راشد محمد انديله","10 - 2",26,22,27,20,24,20,23,19,23,204,"ناجح",0.75555555555555554,"جيد جدا",null,"",null,"","","","","","","","","",7,0,"ناجح","","","","","","","","","",null,63,"محمد على راشد محمد انديله",204.00001369863014,{"$error":"#N/A"}]
[64,"محمد محمود فاروق العبد","10 - 2",17.5,25,26,14.5,20,17,25,22.5,26,193.5,"دور ثانى",0.71666666666666667,"جيد",null,"الكيمياء / ",null,"","","","x","","","","","",6,1,"دور ثانى","","","","الكيمياء / ","","","","","",null,64,"محمد محمود فاروق العبد",193.50001351351352,{"$error":"#N/A"}]
[65,"محمدخير حسين رغفان","10 - 2",25,28,24.5,21,27,24,27,20,27,{"$f":"IF(B75=\"\",\"\",IF(AND(D75=\"غ\",E75=\"غ\",F75=\"غ\",G75=\"غ\",H75=\"غ\",I75=\"غ\",J75=\"غ\",K75=\"غ\",L75=\"غ\"),\"غ\",SUM(D75,E75,F75,G75,H75,I75,J75,K75,L75)))","v":223.5},{"$f":"IF(B75=\"\",\"\",AE75)","v":"ناجح"},{"$f":"IF(B75=\"\",\"\",IF(M75=\"غ\",\"غ\",M75/$M$10*100/100))","v":0.82777777777777772},"جيد جدا",null,"",null,"","","","","","","","","",{"$f":"IF(B75=\"\",\"\",COUNTBLANK(T75:Z75))","v":7},{"$f":"IF(B75=\"\",\"\",COUNTIF(T75:Z75,\"x\"))","v":0},{"$f":"IF(B75=\"\",\"\",IF(AC75=7,\"ناجح\",\"دور ثانى\"))","v":"ناجح"},"","","","","","","","","",null,65,"محمدخير حسين رغفان",223.50001333333333,{"$error":"#N/A"}]
[{"$f":"ROW()-10","v":66},"وليد الامين عثمان","10 - 2",22.5,20.5,27.5,18,27,24,25,21,23,208.5,"ناجح",0.77222222222222225,{"$f":"IF(M76=\"\",\"\",IF(M76=\"غ\",\"غ\",IF(M76=0,\"دون المستوى\",IF(M76/$M$10*100>=85,\"ممتاز\",IF(M76/$M$10*100>=75,\"جيد جدا\",IF(M76/$M$10*100>=65,\"جيد\",IF(M76/$M$10*100>=50,\"مقبول\",IF(M76/$M$10*100<50,\"دون المستوى\"))))))))","v":"جيد جدا"},null,"",null,{"$f":"IF($B76=\"\",\"\",IF(OR(D76<15,D76=\"\",D76=\"غ\",D76=\"صفر\"=\"\"),\"x\",\"\"))","v":""},{"$f":"IF($B76=\"\",\"\",IF(OR(E76<15,E76=\"\",E76=\"غ\",E76=\"صفر\"=\"\"),\"x\",\"\"))","v":""},{"$f":"IF($B76=\"\",\"\",IF(OR(F76<15,F76=\"\",F76=\"غ\",F76=\"صفر\"=\"\"),\"x\",\"\"))","v":""},{"$f":"IF($B76=\"\",\"\",IF(OR(G76<15,G76=\"\",G76=\"غ\",G76=\"صفر\"=\"\"),\"x\",\"\"))","v":""},{"$f":"IF($B76=\"\",\"\",IF(OR(H76<15,H76=\"\",H76=\"غ\",H76=\"صفر\"=\"\"),\"x\",\"\"))","v":""},{"$f":"IF($B76=\"\",\"\",IF(OR(I76<15,I76=\"\",I76=\"غ\",I76=\"صفر\"=\"\"),\"x\",\"\"))","v":""},{"$f":"IF($B76=\"\",\"\",IF(OR(J76<15,J76=\"\",J76=\"غ\",J76=\"صفر\"=\"\"),\"x\",\"\"))","v":""},{"$f":"IF($B76=\"\",\"\",IF(OR(K76<15,K76=\"\",K76=\"غ\",K76=\"صفر\"=\"\"),\"x\",\"\"))","v":""},{"$f":"IF($B76=\"\",\"\",IF(OR(L76<15,L76=\"\",L76=\"غ\",L76=\"صفر\"=\"\"),\"x\",\"\"))","v":""},7,0,"ناجح",{"$f":"IF(T76=\"x\",\"الرياضيات / \",\"\")","v":""},{"$f":"IF(U76=\"x\",\"الدراسات الاجتماعية / \",\"\")","v":""},{"$f":"IF(V76=\"x\",\"الحوسبة وتكنولوجيا المعلومات / \",\"\")","v":""},{"$f":"IF(W76=\"x\",\"الكيمياء / \",\"\")","v":""},{"$f":"IF(X76=\"x\",\"الفيزياء / \",\"\")","v":""},{"$f":"IF(Y76=\"x\",\"الأحياء / \",\"\")","v":""},{"$f":"IF(Z76=\"x\",\"التربية الإسلامية / \",\"\")","v":""},{"$f":"IF(AA76=\"x\",\"اللغة العربية / \",\"\")","v":""},{"$f":"IF(AB76=\"x\",\"اللغة الإنجليزية / \",\"\")","v":""},null,66,"وليد الامين عثمان",208.50001315789473,{"$error":"#N/A"}]
[67,"يزيد سامح حسنى محيسن","10 - 2",30,30,27.5,30,30,29,26,26,22,250.5,"ناجح",0.92777777777777781,"ممتاز",null,"",null,"","","","","","","","","",7,0,"ناجح","","","","","","","","","",null,67,"يزيد سامح حسنى محيسن",250.50001298701298,{"$error":"#N/A"}]
[68,"يوسف محمد عطيه عطيه حسن","10 - 2",29,27,28,30,29,30,23,27,26,249,"ناجح",0.92222222222222228,"ممتاز",null,"",null,"","","","","","","","","",7,0,"ناجح","","","","","","","","","",null,68,"يوسف محمد عطيه عطيه حسن",249.00001282051281,12]
[69,"احمد حافظ محمد ابوالكلام كبيرالدين","10 - 3",9.5,18.5,20.5,12,16,11,20,15,17,139.5,"دور ثانى",0.51666666666666672,"مقبول",null,"الرياضيات / الكيمياء / الأحياء / ",null,"x","","","x","","x","","","",4,3,"دور ثانى","الرياضيات / ","","","الكيمياء / ","","الأحياء / ","","","",null,69,"احمد حافظ محمد ابوالكلام كبيرالدين",139.50001265822786,{"$error":"#N/A"}]
[70,"احمد محمد احمد قنبر بلال","10 - 3",16,24,22.5,11,16,14,17.5,8,12.5,141.5,"دور ثانى",0.52407407407407403,"مقبول",null,"الكيمياء / الأحياء / ",null,"","","","x","","x","","x","x",5,2,"دور ثانى","","","","الكيمياء / ","","الأحياء / ","","اللغة العربية / ","اللغة الإنجليزية / ",null,70,"احمد محمد احمد قنبر بلال",141.5000125,{"$error":"#N/A"}]
[71,"امان رشيد خان جول جنان","10 - 3",12.5,15.5,21.5,11,10.5,14,13,13,15,126,"دور ثانى",0.46666666666666662,"دون المستوى",null,"الرياضيات / الكيمياء / الفيزياء / الأحياء / التربية الإسلامية / ",null,"x","","","x","x","x","x","x","",2,5,"دور ثانى","الرياضيات / ","","","الكيمياء / ","الفيزياء / ","الأحياء / ","التربية الإسلامية / ","اللغة العربية / ","",null,71,"امان رشيد خان جول جنان",126.00001234567901,{"$error":"#N/A"}]
[72,"ايسر جهاد عبدالفتاح كراز","10 - 3",5,18.5,24.5,15,10.5,14,16,15,8,126.5,"دور ثانى",0.4685185185185185,"دون المستوى",null,"الرياضيات / الفيزياء / الأحياء / ",null,"x","","","","x","x","","","x",4,3,"دور ثانى","الرياضيات / ","","","","الفيزياء / ","الأحياء / ","","","اللغة الإنجليزية / ",null,72,"ايسر جهاد عبدالفتاح كراز",126.50001219512195,{"$error":"#N/A"}]
[73,"بخيت مبخوت سالم سعيد خوار","10 - 3",22.5,16,25.5,17.5,21,13,14,17,14.5,161,"دور ثانى",0.59629629629629632,"مقبول",null,"الأحياء / التربية الإسلامية / ",null,"","","","","","x","x","","x",5,2,"دور ثانى","","","","","","الأحياء / ","التربية الإسلامية / ","","اللغة الإنجليزية / ",null,73,"بخيت مبخوت سالم سعيد خوار",161.00001204819276,{"$error":"#N/A"}]
[74,"تميم محمد ابراهيم محمد فلامرزى","10 - 3",10.5,8,19.5,14,15,7.5,11,13,12,110.5,"دور ثانى",0.40925925925925921,"دون المستوى",null,"الرياضيات / الدراسات الاجتماعية / الكيمياء / الأحياء / التربية الإسلامية / ",null,"x","x","","x","","x","x","x","x",2,5,"دور ثانى","الرياضيات / ","الدراسات الاجتماعية / ","","الكيمياء / ","","الأحياء / ","التربية الإسلامية / ","اللغة العربية / ","اللغة الإنجليزية / ",null,74,"تميم محمد ابراهيم محمد فلامرزى",110.50001190476191,{"$error":"#N/A"}]
[75,"جابر سعد سالم النابت المرى","10 - 3",11,19,18.5,13,15.5,6.5,14,15,9.5,122,"دور ثانى",0.45185185185185184,"دون المستوى",null,"الرياضيات / الكيمياء / الأحياء / التربية الإسلامية / ",null,"x","","","x","","x","x","","x",3,4,"دور ثانى","الرياضيات / ","","","الكيمياء / ","","الأحياء / ","التربية الإسلامية / ","","اللغة الإنجليزية / ",null,75,"جابر سعد سالم النابت المرى",122.00001176470589,{"$error":"#N/A"}]
[76,"جاسم عبدالله خالد عبدالله الكثيرى","10 - 3",19,17.5,18,9.5,15,13,15.5,16,6,129.5,"دور ثانى",0.47962962962962963,"دون المستوى",null,"الكيمياء / الأحياء / ",null,"","","","x","","x","","","x",5,2,"دور ثانى","","","","الكيمياء / ","","الأحياء / ","","","اللغة الإنجليزية / ",null,76,"جاسم عبدالله خالد عبدالله الكثيرى",129.50001162790699,{"$error":"#N/A"}]
[77,"حمد راشد حمد ال شابل المرى","10 - 3",20,16,16,12,19,11,20,18.5,8.5,141,"دور ثانى",0.52222222222222225,"مقبول",null,"الكيمياء / الأحياء / ",null,"","","","x","","x","","","x",5,2,"دور ثانى","","","","الكيمياء / ","","الأحياء / ","","","اللغة الإنجليزية / ",null,77,"حمد راشد حمد ال شابل المرى",141.00001149425287,{"$error":"#N/A"}]
[78,"خالد حسين بلوج زنى","10 - 3",7.5,5.5,20.5,6,11,8,14.5,14,14,101,"دور ثانى",0.37407407407407406,"دون المستوى",null,"الرياضيات / الدراسات الاجتماعية / الكيمياء / الفيزياء / الأحياء / التربية الإسلامية / ",null,"x","x","","x","x","x","x","x","x",1,6,"دور ثانى","الرياضيات / ","الدراسات الاجتماعية / ","","الكيمياء / ","الفيزياء / ","الأحياء / ","التربية الإسلامية / ","اللغة العربية / ","اللغة الإنجليزية / ",null,78,"خالد حسين بلوج زنى",101.00001136363636,{"$error":"#N/A"}]
[79,"خلف فرحان عقيل الرويلى العنزى","10 - 3",13,13.5,21.5,7,14.5,11,12,9,10,111.5,"دور ثانى",0.41296296296296298,"دون المستوى",null,"الرياضيات / الدراسات الاجتماعية / الكيمياء / الفيزياء / الأحياء / التربية الإسلامية / ",null,"x","x","","x","x","x","x","x","x",1,6,"دور ثانى","الرياضيات / ","الدراسات الاجتماعية / ","","الكيمياء / ","الفيزياء / ","الأحياء / ","التربية الإسلامية / ","اللغة العربية / ","اللغة الإنجليزية / ",null,79,"خلف فرحان عقيل الرويلى العنزى",111.50001123595506,{"$error":"#N/A"}]
[80,"راشد خالد على محمد النديله","10 - 3",24,12,21,17.5,23,18,19,20,16.5,171,"دور ثانى",0.6333333333333333,"مقبول",null,"الدراسات الاجتماعية / ",null,"","x","","","","","","","",6,1,"دور ثانى","","الدراسات الاجتماعية / ","","","","","","","",null,80,"راشد خالد على محمد النديله",171.00001111111112,{"$error":"#N/A"}]
[81,"سالم سعد سالم النابت المرى","10 - 3",4.5,15,19,13,18.5,11.5,11,12,6.5,111,"دور ثانى",0.41111111111111109,"دون المستوى",null,"الرياضيات / الكيمياء / الأحياء / التربية الإسلامية / ",null,"x","","","x","","x","x","x","x",3,4,"دور ثانى","الرياضيات / ","","","الكيمياء / ","","الأحياء / ","التربية الإسلامية / ","اللغة العربية / ","اللغة الإنجليزية / ",null,81,"سالم سعد سالم النابت المرى",111.00001098901099,{"$error":"#N/A"}]
[82,"سالم على محمد سالم خوار","10 - 3",10,15,20.5,9,17,8,13.5,14,null,107,"دور ثانى",0.39629629629629631,"دون المستوى",null,"الرياضيات / الكيمياء / الأحياء / التربية الإسلامية / ",null,"x","","","x","","x","x","x","x",3,4,"دور ثانى","الرياضيات / ","","","الكيمياء / ","","الأحياء / ","التربية الإسلامية / ","اللغة العربية / ","اللغة الإنجليزية / ",null,82,"سالم على محمد سالم خوار",107.00001086956522,{"$error":"#N/A"}]
[83,"سعيد حسين ناصر ال شافعه المرى","10 - 3",16.5,13.5,21.5,9,16,12,18.5,16,16,139,"دور ثانى",0.51481481481481484,"مقبول",null,"الدراسات الاجتماعية / الكيمياء / الأحياء / ",null,"","x","","x","","x","","","",4,3,"دور ثانى","","الدراسات الاجتماعية / ","","الكيمياء / ","","الأحياء / ","","","",null,83,{"$f":"B93","v":"سعيد حسين ناصر ال شافعه المرى"},139.00001075268818,{"$error":"#N/A"}]
[84,"شاهين علي","10 - 3",20,10,22,8,13,10,12,11,24.5,130.5,"دور ثانى",0.48333333333333334,"دون المستوى",null,"الدراسات الاجتماعية / الكيمياء / الفيزياء / الأحياء / التربية الإسلامية / ",null,"","x","","x","x","x","x","x","",2,5,"دور ثانى","","الدراسات الاجتماعية / ","","الكيمياء / ","الفيزياء / ","الأحياء / ","التربية الإسلامية / ","اللغة العربية / ","",null,84,"شاهين علي",130.50001063829788,{"$error":"#N/A"}]
[85,"عبدالرحمن فرج محمد المشعلى القحطانى","10 - 3",15.5,12.5,21,12,26,13,26.5,18,17.5,162,"دور ثانى",0.6,"مقبول",null,"الدراسات الاجتماعية / الكيمياء / الأحياء / ",null,"","x","","x","","x","","","",4,3,"دور ثانى","","الدراسات الاجتماعية / ","","الكيمياء / ","","الأحياء / ","","","",null,85,"عبدالرحمن فرج محمد المشعلى القحطانى",162.00001052631578,{"$error":"#N/A"}]
[86,"عبدالرشيد حسين عبدي","10 - 3",12,16.5,22,7,16,7.5,12,15,8,116,"دور ثانى",0.42962962962962964,"دون المستوى",null,"الرياضيات / الكيمياء / الأحياء / التربية الإسلامية / ",null,"x","","","x","","x","x","","x",3,4,"دور ثانى","الرياضيات / ","","","الكيمياء / ","","الأحياء / ","التربية الإسلامية / ","","اللغة الإنجليزية / ",null,86,"عبدالرشيد حسين عبدي",116.00001041666667,{"$error":"#N/A"}]
[87,"عبدالله سعيد بخيت سعيد خوار","10 - 3",15,11.5,14,13.5,20,13.5,18.5,22,15.5,143.5,"دور ثانى",0.53148148148148144,"مقبول",null,"الدراسات الاجتماعية / الحوسبة وتكنولوجيا المعلومات / الكيمياء / الأحياء / ",null,"","x","x","x","","x","","","",3,4,"دور ثانى","","الدراسات الاجتماعية / ","الحوسبة وتكنولوجيا المعلومات / ","الكيمياء / ","","الأحياء / ","","","",null,87,"عبدالله سعيد بخيت سعيد خوار",143.50001030927834,{"$error":"#N/A"}]
[88,"عبدالله سعيد عبدالله آل نابت المرى","10 - 3",22.5,15.5,15,15.5,22.5,11,14,14,16.5,146.5,"دور ثانى",0.54259259259259263,"مقبول",null,"الأحياء / التربية الإسلامية / ",null,"","","","","","x","x","x","",5,2,"دور ثانى","","","","","","الأحياء / ","التربية الإسلامية / ","اللغة العربية / ","",null,88,"عبدالله سعيد عبدالله آل نابت المرى",146.50001020408163,{"$error":"#N/A"}]
[89,"عبدالله عادل خصيف","10 - 3",null,null,null,null,null,null,null,null,null,0,"دور ثانى",0,"دون المستوى",null,"الرياضيات / الدراسات الاجتماعية / الحوسبة وتكنولوجيا المعلومات / الكيمياء / الفيزياء / الأحياء / التربية الإسلامية / ",null,"x","x","x","x","x","x","x","x","x",0,7,"دور ثانى","الرياضيات / ","الدراسات الاجتماعية / ","الحوسبة وتكنولوجيا المعلومات / ","الكيمياء / ","الفيزياء / ","الأحياء / ","التربية الإسلامية / ","اللغة العربية / ","اللغة الإنجليزية / ",null,89,"عبدالله عادل خصيف",1.0101010101010101E-5,49]
[90,"عبدالله مبارك سالم بطى الكعبى","10 - 3",20.5,21,18,16.5,29,13,16,17.5,19,170.5,"دور ثانى",0.63148148148148153,"مقبول",null,"الأحياء / ",null,"","","","","","x","","","",6,1,"دور ثانى","","","","","","الأحياء / ","","","",null,90,"عبدالله مبارك سالم بطى الكعبى",170.50001,{"$error":"#N/A"}]
[91,"على عجيم على عجيم الحبابى","10 - 3",15,26.5,21,19,19,11.5,12,15,19,158,"دور ثانى",0.58518518518518514,"مقبول",null,"الأحياء / التربية الإسلامية / ",null,"","","","","","x","x","","",5,2,"دور ثانى","","","","","","الأحياء / ","التربية الإسلامية / ","","",null,91,"على عجيم على عجيم الحبابى",158.00000990099011,{"$error":"#N/A"}]
[92,"على فهد على احمد محمد","10 - 3",15,10.5,15,9,18,9,17,19,16.5,129,"دور ثانى",0.4777777777777778,"دون المستوى",null,"الدراسات الاجتماعية / الكيمياء / الأحياء / ",null,"","x","","x","","x","","","",4,3,"دور ثانى","","الدراسات الاجتماعية / ","","الكيمياء / ","","الأحياء / ","","","",null,92,"على فهد على احمد محمد",129.00000980392156,{"$error":"#N/A"}]
[93,"عمر عبيدالله روح الامين مريضا","10 - 3",11,8.5,19.5,10,9,10.5,18.5,13,25.5,125.5,"دور ثانى",0.46481481481481479,"دون المستوى",null,"الرياضيات / الدراسات الاجتماعية / الكيمياء / الفيزياء / الأحياء / ",null,"x","x","","x","x","x","","x","",2,5,"دور ثانى","الرياضيات / ","الدراسات الاجتماعية / ","","الكيمياء / ","الفيزياء / ","الأحياء / ","","اللغة العربية / ","",null,93,"عمر عبيدالله روح الامين مريضا",125.50000970873786,{"$error":"#N/A"}]
[94,"ماجد صلاح خميس يوسف ابراهيم","10 - 3",null,null,null,null,null,6,11,null,5,22,"دور ثانى",8.1481481481481488E-2,"دون المستوى",null,"الرياضيات / الدراسات الاجتماعية / الحوسبة وتكنولوجيا المعلومات / الكيمياء / الفيزياء / الأحياء / التربية الإسلامية / ",null,"x","x","x","x","x","x","x","x","x",0,7,"دور ثانى","الرياضيات / ","الدراسات الاجتماعية / ","الحوسبة وتكنولوجيا المعلومات / ","الكيمياء / ","الفيزياء / ","الأحياء / ","التربية الإسلامية / ","اللغة العربية / ","اللغة الإنجليزية / ",null,94,"ماجد صلاح خميس يوسف ابراهيم",22.000009615384617,{"$error":"#N/A"}]
[95,"محمد عبدالله عبدالله ابراهيم الخليفى","10 - 3",19.5,14.5,23,15.5,13,5,13,12,15.5,131,"دور ثانى",0.48518518518518516,"دون المستوى",null,"الدراسات الاجتماعية / الفيزياء / الأحياء / التربية الإسلامية / ",null,"","x","","","x","x","x","x","",3,4,"دور ثانى","","الدراسات الاجتماعية / ","","","الفيزياء / ","الأحياء / ","التربية الإسلامية / ","اللغة العربية / ","",null,95,"محمد عبدالله عبدالله ابراهيم الخليفى",131.00000952380952,{"$error":"#N/A"}]
[96,"محمد عبدالله محمد جاسم السويدى","10 - 3",22.5,13,17,19,11,0,14.5,17,16.5,130.5,"دور ثانى",0.48333333333333334,"دون المستوى",null,"الدراسات الاجتماعية / الفيزياء / الأحياء / التربية الإسلامية / ",null,"","x","","","x","x","x","","",3,4,"دور ثانى","","الدراسات الاجتماعية / ","","","الفيزياء / ","الأحياء / ","التربية الإسلامية / ","","",null,96,"محمد عبدالله محمد جاسم السويدى",130.50000943396228,{"$error":"#N/A"}]
[97,"محمدزين عبدالحميد المبارك على","10 - 3",12,14.5,13,16,15,8,12,17,14.5,122,"دور ثانى",0.45185185185185184,"دون المستوى",null,"الرياضيات / الدراسات الاجتماعية / الحوسبة وتكنولوجيا المعلومات / الأحياء / التربية الإسلامية / ",null,"x","x","x","","","x","x","","x",2,5,"دور ثانى","الرياضيات / ","الدراسات الاجتماعية / ","الحوسبة وتكنولوجيا المعلومات / ","","","الأحياء / ","التربية الإسلامية / ","","اللغة الإنجليزية / ",null,{"$f":"A107","v":97},"محمدزين عبدالحميد المبارك على",122.0000093457944,{"$f":"IF(M107=\" \",\" \",IF(M107=\"غ\",\"غ\",RANK(M107,$M$11:$M$60)))","v":{"$error":"#N/A"}}]
[98,"محمود اسعد الحاج الخلف","10 - 3",10.5,17.5,16,7,19,12,17.5,17.5,18,135,"دور ثانى",0.5,"مقبول",null,"الرياضيات / الكيمياء / الأحياء / ",null,"x","","","x","","x","","","",4,3,"دور ثانى","الرياضيات / ","","","الكيمياء / ","","الأحياء / ","","","",null,98,"محمود اسعد الحاج الخلف",135.00000925925926,{"$error":"#N/A"}]
[99,"مسفر سعد محمد ذفال الحبابى","10 - 3",null,null,null,null,null,12,13,null,13,38,"دور ثانى",0.14074074074074075,"دون المستوى",null,"الرياضيات / الدراسات الاجتماعية / الحوسبة وتكنولوجيا المعلومات / الكيمياء / الفيزياء / الأحياء / التربية الإسلامية / ",null,"x","x","x","x","x","x","x","x","x",0,7,"دور ثانى","الرياضيات / ","الدراسات الاجتماعية / ","الحوسبة وتكنولوجيا المعلومات / ","الكيمياء / ","الفيزياء / ","الأحياء / ","التربية الإسلامية / ","اللغة العربية / ","اللغة الإنجليزية / ",null,99,"مسفر سعد محمد ذفال الحبابى",38.000009174311927,{"$error":"#N/A"}]
[100,"ناصر جهان بخش مرادك درزاده","10 - 3",7.5,7,20,15,11,13.5,15.5,17.5,14,121,"دور ثانى",0.44814814814814807,"دون المستوى",null,"الرياضيات / الدراسات الاجتماعية / الفيزياء / الأحياء / ",null,"x","x","","","x","x","","","x",3,4,"دور ثانى","الرياضيات / ","الدراسات الاجتماعية / ","","","الفيزياء / ","الأحياء / ","","","اللغة الإنجليزية / ",null,100,"ناصر جهان بخش مرادك درزاده",121.00000909090909,{"$error":"#N/A"}]
[101,"ناصر محمد خالد احمد الغانم","10 - 3",8,10,20,11,20,9.5,17,14,12,121.5,"دور ثانى",0.45,"دون المستوى",null,"الرياضيات / الدراسات الاجتماعية / الكيمياء / الأحياء / ",null,"x","x","","x","","x","","x","x",3,4,"دور ثانى","الرياضيات / ","الدراسات الاجتماعية / ","","الكيمياء / ","","الأحياء / ","","اللغة العربية / ","اللغة الإنجليزية / ",null,101,"ناصر محمد خالد احمد الغانم",121.50000900900901,{"$error":"#N/A"}]
[102,"يوسف صالح على عبدالعزيز على","10 - 3",23,10,18.5,16.5,23,15.5,10,16,23.5,156,"دور ثانى",0.57777777777777772,"مقبول",null,"الدراسات الاجتماعية / التربية الإسلامية / ",null,"","x","","","","","x","","",5,2,"دور ثانى","","الدراسات الاجتماعية / ","","","","","التربية الإسلامية / ","","",null,102,"يوسف صالح على عبدالعزيز على",156.00000892857142,{"$error":"#N/A"}]
[103,"احمد رائد سليمان المومني","10 - 4",11.5,21,27,11.5,20,10.5,22,22,18.5,164,"دور ثانى",0.6074074074074074,"مقبول",null,"الرياضيات / الكيمياء / الأحياء / ",null,"x","","","x","","x","","","",4,3,"دور ثانى","الرياضيات / ","","","الكيمياء / ","","الأحياء / ","","","",null,103,"احمد رائد سليمان المومني",164.00000884955753,{"$error":"#N/A"}]
[104,"أحمد نافذ حماده حموده","10 - 4",12,22,18,20.5,17,12,23,17.5,18,160,"دور ثانى",0.59259259259259256,"مقبول",null,"الرياضيات / الأحياء / ",null,"x","","","","","x","","","",5,2,"دور ثانى","الرياضيات / ","","","","","الأحياء / ","","","",null,104,"أحمد نافذ حماده حموده",160.00000877192983,{"$error":"#N/A"}]
[105,"أحمد يوسف خالد يوسف شراب","10 - 4",16.5,20,16,19.5,18,15,22,19.5,17.5,164,"ناجح",0.6074074074074074,"مقبول",null,"",null,"","","","","","","","","",7,0,"ناجح","","","","","","","","","",null,105,"أحمد يوسف خالد يوسف شراب",164.00000869565218,{"$error":"#N/A"}]
[106,"تميم سالم راشد الصعاق المرى","10 - 4",14,11,17,13.5,20,6,17,14.5,6.5,119.5,"دور ثانى",0.44259259259259259,"دون المستوى",null,"الرياضيات / الدراسات الاجتماعية / الكيمياء / الأحياء / ",null,"x","x","","x","","x","","x","x",3,4,"دور ثانى","الرياضيات / ","الدراسات الاجتماعية / ","","الكيمياء / ","","الأحياء / ","","اللغة العربية / ","اللغة الإنجليزية / ",null,106,"تميم سالم راشد الصعاق المرى",119.50000862068966,{"$error":"#N/A"}]
[107,"جابر سعيد جابر سالم اليربوعى","10 - 4",13.5,12.5,19,17,7,8,15,15,null,107,"دور ثانى",0.39629629629629631,"دون المستوى",null,"الرياضيات / الدراسات الاجتماعية / الفيزياء / الأحياء / ",null,"x","x","","","x","x","","","x",3,4,"دور ثانى","الرياضيات / ","الدراسات الاجتماعية / ","","","الفيزياء / ","الأحياء / ","","","اللغة الإنجليزية / ",null,107,"جابر سعيد جابر سالم اليربوعى",107.00000854700855,{"$error":"#N/A"}]
[108,"جاسم محمود محمد عبداللهي","10 - 4",20.5,26,16,20,20,14,24,23.5,18,182,"دور ثانى",0.67407407407407405,"جيد",null,"الأحياء / ",null,"","","","","","x","","","",6,1,"دور ثانى","","","","","","الأحياء / ","","","",null,108,"جاسم محمود محمد عبداللهي",182.00000847457628,{"$error":"#N/A"}]
[109,"جاسم ناصر جاسم محمد المفتاح","10 - 4",23.5,19.5,17.5,17,26,19.5,17.5,21,29.5,191,"ناجح",0.70740740740740737,"جيد",null,"",null,"","","","","","","","","",7,0,"ناجح","","","","","","","","","",null,109,"جاسم ناصر جاسم محمد المفتاح",191.00000840336133,{"$error":"#N/A"}]
[110,"حمد محمد بخيت تويم المرى","10 - 4",19,15.5,11,12,20,7,20.5,18,16.5,139.5,"دور ثانى",0.51666666666666672,"مقبول",null,"الحوسبة وتكنولوجيا المعلومات / الكيمياء / الأحياء / ",null,"","","x","x","","x","","","",4,3,"دور ثانى","","","الحوسبة وتكنولوجيا المعلومات / ","الكيمياء / ","","الأحياء / ","","","",null,110,"حمد محمد بخيت تويم المرى",139.50000833333334,{"$error":"#N/A"}]
[111,"خالد سعيد محمد البريكان المرى","10 - 4",14,24,18.5,22,22,21,24,23,15.5,184,"دور ثانى",0.68148148148148158,"جيد",null,"الرياضيات / ",null,"x","","","","","","","","",6,1,"دور ثانى","الرياضيات / ","","","","","","","","",null,111,"خالد سعيد محمد البريكان المرى",184.00000826446282,{"$error":"#N/A"}]
[112,"خميس محمد سيف خميس الريامي","10 - 4",18,19.5,21.5,17,15,11.5,24.5,15,12.5,154.5,"دور ثانى",0.57222222222222219,"مقبول",null,"الأحياء / ",null,"","","","","","x","","","x",6,1,"دور ثانى","","","","","","الأحياء / ","","","اللغة الإنجليزية / ",null,112,"خميس محمد سيف خميس الريامي",154.50000819672132,{"$error":"#N/A"}]
[113,"راشد حمد راشد سالم خادم","10 - 4",14.5,9.5,19,7.5,13,8.5,13,8,null,93,"دور ثانى",0.34444444444444444,"دون المستوى",null,"الرياضيات / الدراسات الاجتماعية / الكيمياء / الفيزياء / الأحياء / التربية الإسلامية / ",null,"x","x","","x","x","x","x","x","x",1,6,"دور ثانى","الرياضيات / ","الدراسات الاجتماعية / ","","الكيمياء / ","الفيزياء / ","الأحياء / ","التربية الإسلامية / ","اللغة العربية / ","اللغة الإنجليزية / ",null,113,"راشد حمد راشد سالم خادم",93.000008130081298,{"$error":"#N/A"}]
[114,"سالم حمد سالم اليربوعى المرى","10 - 4",null,null,null,null,null,null,null,null,null,0,"دور ثانى",0,"دون المستوى",null,"الرياضيات / الدراسات الاجتماعية / الحوسبة وتكنولوجيا المعلومات / الكيمياء / الفيزياء / الأحياء / التربية الإسلامية / ",null,"x","x","x","x","x","x","x","x","x",0,7,"دور ثانى","الرياضيات / ","الدراسات الاجتماعية / ","الحوسبة وتكنولوجيا المعلومات / ","الكيمياء / ","الفيزياء / ","الأحياء / ","التربية الإسلامية / ","اللغة العربية / ","اللغة الإنجليزية / ",null,114,"سالم حمد سالم اليربوعى المرى",8.0645161290322584E-6,49]
[115,"سليمان حسن علي سليمان موسى","10 - 4",17.5,16,19.5,16,18.5,13.5,26,19,15.5,161.5,"دور ثانى",0.5981481481481481,"مقبول",null,{"$f":"CONCATENATE(AF125,AG125,AH125,AI125,AJ125,AK125,AL125)","v":"الأحياء / "},null,"","","","","","x","","","",6,1,"دور ثانى","","","","","","الأحياء / ","","","",null,115,{"$f":"B125","v":"سليمان حسن علي سليمان موسى"},{"$f":"IF(M125=\"\",\"\",IF(M125=\"غ\",\"غ\",M125+1/ROW()*0.001))","v":161.50000800000001},{"$error":"#N/A"}]
[116,"شعيب عبدي قرني قلديد","10 - 4",10,11.5,17,13,19,11.5,20,17.5,9.5,129,"دور ثانى",0.4777777777777778,"دون المستوى",null,"الرياضيات / الدراسات الاجتماعية / الكيمياء / الأحياء / ",null,"x","x","","x","","x","","","x",3,4,"دور ثانى","الرياضيات / ","الدراسات الاجتماعية / ","","الكيمياء / ","","الأحياء / ","","","اللغة الإنجليزية / ",null,116,"شعيب عبدي قرني قلديد",129.00000793650793,{"$error":"#N/A"}]
[117,"عابدين حافظ عابدين موسى","10 - 4",10,18.5,20.5,15,19,11.5,18,17.5,18.5,148.5,"دور ثانى",0.55000000000000004,"مقبول",null,"الرياضيات / الأحياء / ",null,"x","","","","","x","","","",5,2,"دور ثانى","الرياضيات / ","","","","","الأحياء / ","","","",null,117,"عابدين حافظ عابدين موسى",148.50000787401575,{"$error":"#N/A"}]
[118,"عبدالرحمن صبرى عثمان محسن اليهرى","10 - 4",17.5,24,21,15.5,22,12.5,21,17.5,12,163,"دور ثانى",0.60370370370370374,"مقبول",null,"الأحياء / ",null,"","","","","","x","","","x",6,1,"دور ثانى","","","","","","الأحياء / ","","","اللغة الإنجليزية / ",null,118,"عبدالرحمن صبرى عثمان محسن اليهرى",163.0000078125,{"$error":"#N/A"}]
[119,"عبدالله سالم محمد سالم خوار","10 - 4",9,17,20.5,24,13.5,8,14,9,null,115,"دور ثانى",0.42592592592592593,"دون المستوى",null,"الرياضيات / الفيزياء / الأحياء / التربية الإسلامية / ",null,"x","","","","x","x","x","x","x",3,4,"دور ثانى","الرياضيات / ","","","","الفيزياء / ","الأحياء / ","التربية الإسلامية / ","اللغة العربية / ","اللغة الإنجليزية / ",null,119,"عبدالله سالم محمد سالم خوار",115.00000775193799,{"$error":"#N/A"}]
[120,"عبدالله ضيف الله برمان الدوسري","10 - 4",25,26.5,23,26,23,24.5,27,21,23.5,219.5,"ناجح",0.812962962962963,"جيد جدا",null,"",null,"","","","","","","","","",7,0,"ناجح","","","","","","","","","",null,120,"عبدالله ضيف الله برمان الدوسري",219.50000769230769,35]
[121,"عدي فريد احمد حسين","10 - 4",22,27,26,22.5,18.5,19,20.5,25,19.5,200,"ناجح",0.74074074074074081,"جيد",null,"",null,"","","","","","","","","",7,0,"ناجح","","","","","","","","","",null,121,"عدي فريد احمد حسين",200.00000763358778,{"$error":"#N/A"}]
[122,"عزيز خالد سالم ابو شنار","10 - 4",18,20.5,20.5,26.5,20,20,24.5,27,24,201,"ناجح",0.74444444444444446,"جيد",null,"",null,"","","","","","","","","",7,0,"ناجح","","","","","","","","","",null,122,"عزيز خالد سالم ابو شنار",201.00000757575756,{"$error":"#N/A"}]
[123,"على محمد عويض الصقور المرى","10 - 4",12,13,15.5,16,10.5,11,17,18,17.5,130.5,"دور ثانى",0.48333333333333334,"دون المستوى",null,"الرياضيات / الدراسات الاجتماعية / الفيزياء / الأحياء / ",null,"x","x","","","x","x","","","",3,4,"دور ثانى","الرياضيات / ","الدراسات الاجتماعية / ","","","الفيزياء / ","الأحياء / ","","","",null,123,"على محمد عويض الصقور المرى",130.50000751879699,{"$error":"#N/A"}]
[124,"علي عاطف سالم ابراهيم سالم","10 - 4",11.5,19,20,16,7,13,24,21,24,155.5,"دور ثانى",0.57592592592592595,"مقبول",null,"الرياضيات / الفيزياء / الأحياء / ",null,"x","","","","x","x","","","",4,3,"دور ثانى","الرياضيات / ","","","","الفيزياء / ","الأحياء / ","","","",null,124,"علي عاطف سالم ابراهيم سالم",155.50000746268657,{"$error":"#N/A"}]
[125,"علي محمد عبدالله احمد شمس","10 - 4",20.5,12,17.5,24,18,16,21,21.5,17.5,168,"دور ثانى",0.62222222222222223,"مقبول",null,"الدراسات الاجتماعية / ",null,"","x","","","","","","","",6,1,"دور ثانى","","الدراسات الاجتماعية / ","","","","","","","",null,125,"علي محمد عبدالله احمد شمس",168.0000074074074,{"$error":"#N/A"}]
[126,"عمر محمد محمود ابوزاهر","10 - 4",30,29,26,30,30,29,29,29,22.5,254.5,"ناجح",0.94259259259259254,"ممتاز",null,"",null,"","","","","","","","","",7,0,"ناجح","","","","","","","","","",null,126,"عمر محمد محمود ابوزاهر",254.50000735294117,{"$error":"#N/A"}]
[127,"فهد سويد سلطان محمد الخوار","10 - 4",10,19,18,10.5,12,7.5,20,15,17.5,129.5,"دور ثانى",0.47962962962962963,"دون المستوى",null,"الرياضيات / الكيمياء / الفيزياء / الأحياء / ",null,"x","","","x","x","x","","","",3,4,"دور ثانى","الرياضيات / ","","","الكيمياء / ","الفيزياء / ","الأحياء / ","","","",null,127,"فهد سويد سلطان محمد الخوار",129.50000729927007,{"$error":"#N/A"}]
[128,"محمد حافظ محمد ابوالكلام كبيرالدين","10 - 4",8,24,22,12,16,16,20,20.5,21.5,160,"دور ثانى",0.59259259259259256,"مقبول",null,"الرياضيات / الكيمياء / ",null,"x","","","x","","","","","",5,2,"دور ثانى","الرياضيات / ","","","الكيمياء / ","","","","","",null,128,"محمد حافظ محمد ابوالكلام كبيرالدين",160.00000724637681,{"$error":"#N/A"}]
[129,"محمد حسن حسن ناجى الجدره","10 - 4",17,20.5,19,12,14,14,22.5,19.5,16,{"$f":"IF(B139=\"\",\"\",IF(AND(D139=\"غ\",E139=\"غ\",F139=\"غ\",G139=\"غ\",H139=\"غ\",I139=\"غ\",J139=\"غ\",K139=\"غ\",L139=\"غ\"),\"غ\",SUM(D139,E139,F139,G139,H139,I139,J139,K139,L139)))","v":154.5},{"$f":"IF(B139=\"\",\"\",AE139)","v":"دور ثانى"},{"$f":"IF(B139=\"\",\"\",IF(M139=\"غ\",\"غ\",M139/$M$10*100/100))","v":0.57222222222222219},"مقبول",null,"الكيمياء / الفيزياء / الأحياء / ",null,"","","","x","x","x","","","",{"$f":"IF(B139=\"\",\"\",COUNTBLANK(T139:Z139))","v":4},{"$f":"IF(B139=\"\",\"\",COUNTIF(T139:Z139,\"x\"))","v":3},{"$f":"IF(B139=\"\",\"\",IF(AC139=7,\"ناجح\",\"دور ثانى\"))","v":"دور ثانى"},"","","","الكيمياء / ","الفيزياء / ","الأحياء / ","","","",null,129,"محمد حسن حسن ناجى الجدره",154.5000071942446,{"$error":"#N/A"}]
[{"$f":"ROW()-10","v":130},"محمد حمد محمد صالح الصرامى","10 - 4",12,10,19.5,14,24,10,24,20,21,154.5,"دور ثانى",0.57222222222222219,{"$f":"IF(M140=\"\",\"\",IF(M140=\"غ\",\"غ\",IF(M140=0,\"دون المستوى\",IF(M140/$M$10*100>=85,\"ممتاز\",IF(M140/$M$10*100>=75,\"جيد جدا\",IF(M140/$M$10*100>=65,\"جيد\",IF(M140/$M$10*100>=50,\"مقبول\",IF(M140/$M$10*100<50,\"دون المستوى\"))))))))","v":"مقبول"},null,"الرياضيات / الدراسات الاجتماعية / الكيمياء / الأحياء / ",null,{"$f":"IF($B140=\"\",\"\",IF(OR(D140<15,D140=\"\",D140=\"غ\",D140=\"صفر\"=\"\"),\"x\",\"\"))","v":"x"},{"$f":"IF($B140=\"\",\"\",IF(OR(E140<15,E140=\"\",E140=\"غ\",E140=\"صفر\"=\"\"),\"x\",\"\"))","v":"x"},{"$f":"IF($B140=\"\",\"\",IF(OR(F140<15,F140=\"\",F140=\"غ\",F140=\"صفر\"=\"\"),\"x\",\"\"))","v":""},{"$f":"IF($B140=\"\",\"\",IF(OR(G140<15,G140=\"\",G140=\"غ\",G140=\"صفر\"=\"\"),\"x\",\"\"))","v":"x"},{"$f":"IF($B140=\"\",\"\",IF(OR(H140<15,H140=\"\",H140=\"غ\",H140=\"صفر\"=\"\"),\"x\",\"\"))","v":""},{"$f":"IF($B140=\"\",\"\",IF(OR(I140<15,I140=\"\",I140=\"غ\",I140=\"صفر\"=\"\"),\"x\",\"\"))","v":"x"},{"$f":"IF($B140=\"\",\"\",IF(OR(J140<15,J140=\"\",J140=\"غ\",J140=\"صفر\"=\"\"),\"x\",\"\"))","v":""},{"$f":"IF($B140=\"\",\"\",IF(OR(K140<15,K140=\"\",K140=\"غ\",K140=\"صفر\"=\"\"),\"x\",\"\"))","v":""},{"$f":"IF($B140=\"\",\"\",IF(OR(L140<15,L140=\"\",L140=\"غ\",L140=\"صفر\"=\"\"),\"x\",\"\"))","v":""},3,4,"دور ثانى",{"$f":"IF(T140=\"x\",\"الرياضيات / \",\"\")","v":"الرياضيات / "},{"$f":"IF(U140=\"x\",\"الدراسات الاجتماعية / \",\"\")","v":"الدراسات الاجتماعية / "},{"$f":"IF(V140=\"x\",\"الحوسبة وتكنولوجيا المعلومات / \",\"\")","v":""},{"$f":"IF(W140=\"x\",\"الكيمياء / \",\"\")","v":"الكيمياء / "},{"$f":"IF(X140=\"x\",\"الفيزياء / \",\"\")","v":""},{"$f":"IF(Y140=\"x\",\"الأحياء / \",\"\")","v":"الأحياء / "},{"$f":"IF(Z140=\"x\",\"التربية الإسلامية / \",\"\")","v":""},{"$f":"IF(AA140=\"x\",\"اللغة العربية / \",\"\")","v":""},{"$f":"IF(AB140=\"x\",\"اللغة الإنجليزية / \",\"\")","v":""},null,130,"محمد حمد محمد صالح الصرامى",154.50000714285713,{"$error":"#N/A"}]
[131,"محمد عبدالعزيز عبدالكريم يحى يعقوب","10 - 4",22.5,19.5,23,25.5,24,24,24,20,26.5,209,"ناجح",0.77407407407407403,"جيد جدا",null,"",null,"","","","","","","","","",7,0,"ناجح","","","","","","","","","",null,131,"محمد عبدالعزيز عبدالكريم يحى يعقوب",209.00000709219859,{"$error":"#N/A"}]
[132,"محمد عبدالله بخيت محمد المهيري","10 - 4",26.5,28,16,24.5,17,26,24.5,22,25.5,210,"ناجح",0.7777777777777779,"جيد جدا",null,"",null,"","","","","","","","","",7,0,"ناجح","","","","","","","","","",null,132,"محمد عبدالله بخيت محمد المهيري",210.00000704225351,39]
[133,"محمد هشام حامد على ابوخطيطه","10 - 4",29.5,25,26.5,29.5,30,29,26,27.5,27,250,"ناجح",0.92592592592592593,"ممتاز",null,"",null,"","","","","","","","","",7,0,"ناجح","","","","","","","","","",null,133,"محمد هشام حامد على ابوخطيطه",250.00000699300699,{"$error":"#N/A"}]
[134,"محمد يوسف محمد ابراهيم محمد","10 - 4",5,16.5,15,10.5,11.5,10,17,16,11.5,113,"دور ثانى",0.41851851851851846,"دون المستوى",null,"الرياضيات / الكيمياء / الفيزياء / الأحياء / ",null,"x","","","x","x","x","","","x",3,4,"دور ثانى","الرياضيات / ","","","الكيمياء / ","الفيزياء / ","الأحياء / ","","","اللغة الإنجليزية / ",null,134,"محمد يوسف محمد ابراهيم محمد",113.00000694444445,{"$error":"#N/A"}]
[135,"محمد يونس محمد زحمت كش","10 - 4",11.5,17.5,15,17.5,21,13,21.5,15,14.5,146.5,"دور ثانى",0.54259259259259263,"مقبول",null,"الرياضيات / الأحياء / ",null,"x","","","","","x","","","x",5,2,"دور ثانى","الرياضيات / ","","","","","الأحياء / ","","","اللغة الإنجليزية / ",null,135,"محمد يونس محمد زحمت كش",146.50000689655172,{"$error":"#N/A"}]
[136,"بدر ناصر جابر سهل المرى","10 - 5",20.5,11,16,13,18,17,12,16,16,139.5,"دور ثانى",0.51666666666666672,"مقبول",null,"الدراسات الاجتماعية / الكيمياء / التربية الإسلامية / ",null,"","x","","x","","","x","","",4,3,"دور ثانى","","الدراسات الاجتماعية / ","","الكيمياء / ","","","التربية الإسلامية / ","","",null,136,"بدر ناصر جابر سهل المرى",139.50000684931507,{"$error":"#N/A"}]
[137,"حزام زيد راشد المري","10 - 5",12,16,10.5,16,19,19.5,14,14,15,136,"دور ثانى",0.50370370370370365,"مقبول",null,"الرياضيات / الحوسبة وتكنولوجيا المعلومات / التربية الإسلامية / ",null,"x","","x","","","","x","x","",4,3,"دور ثانى","الرياضيات / ","","الحوسبة وتكنولوجيا المعلومات / ","","","","التربية الإسلامية / ","اللغة العربية / ","",null,137,"حزام زيد راشد المري",136.00000680272109,{"$error":"#N/A"}]
[138,"حسن محمود ابراهيم علي البنا","10 - 5",29,28,28.5,29,28,27,29,26.5,22,247,"ناجح",0.91481481481481486,"ممتاز",null,"",null,"","","","","","","","","",7,0,"ناجح","","","","","","","","","",null,138,"حسن محمود ابراهيم علي البنا",247.00000675675676,{"$error":"#N/A"}]
[139,"حمد سعيد سويلم سعد الخوار","10 - 5",15,9,6.5,8,15,2,13.5,12.5,15.5,97,"دور ثانى",0.35925925925925933,"دون المستوى",null,"الدراسات الاجتماعية / الحوسبة وتكنولوجيا المعلومات / الكيمياء / الأحياء / التربية الإسلامية / ",null,"","x","x","x","","x","x","x","",2,5,"دور ثانى","","الدراسات الاجتماعية / ","الحوسبة وتكنولوجيا المعلومات / ","الكيمياء / ","","الأحياء / ","التربية الإسلامية / ","اللغة العربية / ","",null,139,"حمد سعيد سويلم سعد الخوار",97.000006711409398,{"$error":"#N/A"}]
[140,"حمد مبارك مفتاح فرج العبدالله","10 - 5",9,8,14.5,13,11,9.5,16,12,8,101,"دور ثانى",0.37407407407407406,"دون المستوى",null,"الرياضيات / الدراسات الاجتماعية / الحوسبة وتكنولوجيا المعلومات / الكيمياء / الفيزياء / الأحياء / ",null,"x","x","x","x","x","x","","x","x",1,6,"دور ثانى","الرياضيات / ","الدراسات الاجتماعية / ","الحوسبة وتكنولوجيا المعلومات / ","الكيمياء / ","الفيزياء / ","الأحياء / ","","اللغة العربية / ","اللغة الإنجليزية / ",null,140,"حمد مبارك مفتاح فرج العبدالله",101.00000666666666,{"$error":"#N/A"}]
[141,"خالد عزيز حسن عبدربه حسن","10 - 5",20,17,15,9,21,20.5,23,21.5,18,165,"دور ثانى",0.61111111111111116,"مقبول",null,"الكيمياء / ",null,"","","","x","","","","","",6,1,"دور ثانى","","","","الكيمياء / ","","","","","",null,141,"خالد عزيز حسن عبدربه حسن",165.00000662251657,{"$error":"#N/A"}]
[142,"دغش بريك دغش الجربوعى المرى","10 - 5",12.5,19,21,22,17,18.5,16,18.5,15,159.5,"دور ثانى",0.59074074074074079,"مقبول",null,"الرياضيات / ",null,"x","","","","","","","","",6,1,"دور ثانى","الرياضيات / ","","","","","","","","",null,142,"دغش بريك دغش الجربوعى المرى",159.50000657894736,{"$error":"#N/A"}]
[143,"راشد حمد ناصر المري","10 - 5",8,18,17,15.5,22,13.5,19.5,17,20,150.5,"دور ثانى",0.55740740740740746,"مقبول",null,"الرياضيات / الأحياء / ",null,"x","","","","","x","","","",5,2,"دور ثانى","الرياضيات / ","","","","","الأحياء / ","","","",null,143,"راشد حمد ناصر المري",150.5000065359477,{"$error":"#N/A"}]
[144,"راشد شريف خان عيسى خان","10 - 5",19,16,8.5,16,19,16,17,16,23,150.5,"دور ثانى",0.55740740740740746,"مقبول",null,"الحوسبة وتكنولوجيا المعلومات / ",null,"","","x","","","","","","",6,1,"دور ثانى","","","الحوسبة وتكنولوجيا المعلومات / ","","","","","","",null,144,"راشد شريف خان عيسى خان",150.5000064935065,{"$error":"#N/A"}]
[145,"زياد مصطفى كامل محمد ابوالبها","10 - 5",29.5,25.5,22,20,28,23,20,23.5,25.5,217,"ناجح",0.8037037037037037,"جيد جدا",null,"",null,"","","","","","","","","",7,0,"ناجح","","","","","","","","","",null,145,"زياد مصطفى كامل محمد ابوالبها",217.0000064516129,{"$error":"#N/A"}]
[146,"سالم محمد راشد طفله الفهيده","10 - 5",8.5,11,18.5,8,13,5,16,10,10,100,"دور ثانى",0.37037037037037041,"دون المستوى",null,"الرياضيات / الدراسات الاجتماعية / الكيمياء / الفيزياء / الأحياء / ",null,"x","x","","x","x","x","","x","x",2,5,"دور ثانى","الرياضيات / ","الدراسات الاجتماعية / ","","الكيمياء / ","الفيزياء / ","الأحياء / ","","اللغة العربية / ","اللغة الإنجليزية / ",null,146,"سالم محمد راشد طفله الفهيده",100.0000064102564,{"$error":"#N/A"}]
[147,"سعد حمد سعد البويصم المرى","10 - 5",16,15,13.5,15,20,13.5,19,20.5,16,148.5,"دور ثانى",0.55000000000000004,"مقبول",null,"الحوسبة وتكنولوجيا المعلومات / الأحياء / ",null,"","","x","","","x","","","",5,2,"دور ثانى","","","الحوسبة وتكنولوجيا المعلومات / ","","","الأحياء / ","","","",null,147,{"$f":"B157","v":"سعد حمد سعد البويصم المرى"},148.50000636942676,{"$error":"#N/A"}]
[148,"سعيد محمد سالم عمار خوار","10 - 5",23,21,22,21.5,26,26.5,25,21.5,20.5,207,"ناجح",0.76666666666666672,"جيد جدا",null,"",null,"","","","","","","","","",7,0,"ناجح","","","","","","","","","",null,148,"سعيد محمد سالم عمار خوار",207.00000632911392,{"$error":"#N/A"}]
[149,"صلاح عارف احمد عبده جمن","10 - 5",15,18,15,13.5,21,20,19,20,23,164.5,"دور ثانى",0.60925925925925928,"مقبول",null,"الكيمياء / ",null,"","","","x","","","","","",6,1,"دور ثانى","","","","الكيمياء / ","","","","","",null,149,"صلاح عارف احمد عبده جمن",164.50000628930817,{"$error":"#N/A"}]
[150,"عبدالعزيز نايف عبدالله نايف","10 - 5",17,22,26.5,21,26,20,26.5,26,13,198,"ناجح",0.73333333333333328,"جيد",null,"",null,"","","","","","","","","x",7,0,"ناجح","","","","","","","","","اللغة الإنجليزية / ",null,150,"عبدالعزيز نايف عبدالله نايف",198.00000625000001,{"$error":"#N/A"}]
[151,"عبدالله عبدالرحمن","10 - 5",15.5,15,14.5,16.5,22,12,15,20,20,150.5,"دور ثانى",0.55740740740740746,"مقبول",null,"الحوسبة وتكنولوجيا المعلومات / الأحياء / ",null,"","","x","","","x","","","",5,2,"دور ثانى","","","الحوسبة وتكنولوجيا المعلومات / ","","","الأحياء / ","","","",null,151,"عبدالله عبدالرحمن",150.50000621118014,{"$error":"#N/A"}]
[152,"عبدالله فهد عبدالله عبدالعزيز الرميحى","10 - 5",22,24,20,20,24,21.5,25.5,23,23,203,"ناجح",0.75185185185185188,"جيد جدا",null,"",null,"","","","","","","","","",7,0,"ناجح","","","","","","","","","",null,152,"عبدالله فهد عبدالله عبدالعزيز الرميحى",203.00000617283951,{"$error":"#N/A"}]
[153,"عبدالله فؤاد حازم شريف","10 - 5",26.5,21.5,20.5,24,24,26,24,21.5,20.5,208.5,"ناجح",0.77222222222222225,"جيد جدا",null,"",null,"","","","","","","","","",7,0,"ناجح","","","","","","","","","",null,153,"عبدالله فؤاد حازم شريف",208.50000613496931,{"$error":"#N/A"}]
[154,"عبدالمحسن عادل عبدالمحسن محمد الدهنيم","10 - 5",14,19,14.5,15,18.5,18,17,17,18,151,"دور ثانى",0.55925925925925923,"مقبول",null,"الرياضيات / الحوسبة وتكنولوجيا المعلومات / ",null,"x","","x","","","","","","",5,2,"دور ثانى","الرياضيات / ","","الحوسبة وتكنولوجيا المعلومات / ","","","","","","",null,154,"عبدالمحسن عادل عبدالمحسن محمد الدهنيم",151.00000609756097,{"$error":"#N/A"}]
[155,"على حسن مبخوت سعيد الراشدى","10 - 5",16,10.5,8.5,14,17.5,12,9.5,16,11,115,"دور ثانى",0.42592592592592593,"دون المستوى",null,"الدراسات الاجتماعية / الحوسبة وتكنولوجيا المعلومات / الكيمياء / الأحياء / التربية الإسلامية / ",null,"","x","x","x","","x","x","","x",2,5,"دور ثانى","","الدراسات الاجتماعية / ","الحوسبة وتكنولوجيا المعلومات / ","الكيمياء / ","","الأحياء / ","التربية الإسلامية / ","","اللغة الإنجليزية / ",null,155,"على حسن مبخوت سعيد الراشدى",115.00000606060605,{"$error":"#N/A"}]
[156,"على سالم ظافر ال حثيث الاحبابى","10 - 5",23,23,21.5,17.5,28,12.5,15.5,19,17.5,177.5,"دور ثانى",0.65740740740740744,"جيد",null,"الأحياء / ",null,"","","","","","x","","","",6,1,"دور ثانى","","","","","","الأحياء / ","","","",null,156,"على سالم ظافر ال حثيث الاحبابى",177.50000602409639,{"$error":"#N/A"}]
[157,"عمر شادي نعيم زهران","10 - 5",null,null,null,null,null,null,null,null,null,0,"دور ثانى",0,"دون المستوى",null,"الرياضيات / الدراسات الاجتماعية / الحوسبة وتكنولوجيا المعلومات / الكيمياء / الفيزياء / الأحياء / التربية الإسلامية / ",null,"x","x","x","x","x","x","x","x","x",0,7,"دور ثانى","الرياضيات / ","الدراسات الاجتماعية / ","الحوسبة وتكنولوجيا المعلومات / ","الكيمياء / ","الفيزياء / ","الأحياء / ","التربية الإسلامية / ","اللغة العربية / ","اللغة الإنجليزية / ",null,157,"عمر شادي نعيم زهران",5.9880239520958085E-6,49]
[158,"غانم حمد صالح سعيد القريصى","10 - 5",10,7,11.5,9,9,11,11,9,9,86.5,"دور ثانى",0.32037037037037036,"دون المستوى",null,"الرياضيات / الدراسات الاجتماعية / الحوسبة وتكنولوجيا المعلومات / الكيمياء / الفيزياء / الأحياء / التربية الإسلامية / ",null,"x","x","x","x","x","x","x","x","x",0,7,"دور ثانى","الرياضيات / ","الدراسات الاجتماعية / ","الحوسبة وتكنولوجيا المعلومات / ","الكيمياء / ","الفيزياء / ","الأحياء / ","التربية الإسلامية / ","اللغة العربية / ","اللغة الإنجليزية / ",null,158,"غانم حمد صالح سعيد القريصى",86.500005952380945,{"$error":"#N/A"}]
[159,"فهد سعد سعيد بخيت الخوار","10 - 5",13.5,12.5,21.5,10,17,10,10,13,8.5,116,"دور ثانى",0.42962962962962964,"دون المستوى",null,"الرياضيات / الدراسات الاجتماعية / الكيمياء / الأحياء / التربية الإسلامية / ",null,"x","x","","x","","x","x","x","x",2,5,"دور ثانى","الرياضيات / ","الدراسات الاجتماعية / ","","الكيمياء / ","","الأحياء / ","التربية الإسلامية / ","اللغة العربية / ","اللغة الإنجليزية / ",null,159,"فهد سعد سعيد بخيت الخوار",116.00000591715977,{"$error":"#N/A"}]
[160,"قصي محمد داود ابراهيم ابوديه","10 - 5",11.5,26.5,18,20,20,17.5,22.5,21,13,170,"دور ثانى",0.62962962962962965,"مقبول",null,"الرياضيات / ",null,"x","","","","","","","","x",6,1,"دور ثانى","الرياضيات / ","","","","","","","","اللغة الإنجليزية / ",null,160,"قصي محمد داود ابراهيم ابوديه",170.00000588235295,{"$error":"#N/A"}]
[161,"محمد امين بن عادل قنوني","10 - 5",15.5,22,14.5,9.5,26,12,18.5,24,15,157,"دور ثانى",0.58148148148148149,"مقبول",null,"الحوسبة وتكنولوجيا المعلومات / الكيمياء / الأحياء / ",null,"","","x","x","","x","","","",4,3,"دور ثانى","","","الحوسبة وتكنولوجيا المعلومات / ","الكيمياء / ","","الأحياء / ","","","",null,{"$f":"A171","v":161},"محمد امين بن عادل قنوني",157.00000584795322,{"$f":"IF(M171=\" \",\" \",IF(M171=\"غ\",\"غ\",RANK(M171,$M$11:$M$60)))","v":{"$error":"#N/A"}}]
[162,"محمد جابر محمد الصعاق المرى","10 - 5",16.5,18.5,15,21.5,17,17,22,22,18,167.5,"ناجح",0.62037037037037035,"مقبول",null,"",null,"","","","","","","","","",7,0,"ناجح","","","","","","","","","",null,162,"محمد جابر محمد الصعاق المرى",167.50000581395349,{"$error":"#N/A"}]
[163,"محمد سعيد جابر سالم اليربوعى","10 - 5",null,null,null,null,null,null,null,null,null,0,"دور ثانى",0,"دون المستوى",null,"الرياضيات / الدراسات الاجتماعية / الحوسبة وتكنولوجيا المعلومات / الكيمياء / الفيزياء / الأحياء / التربية الإسلامية / ",null,"x","x","x","x","x","x","x","x","x",0,7,"دور ثانى","الرياضيات / ","الدراسات الاجتماعية / ","الحوسبة وتكنولوجيا المعلومات / ","الكيمياء / ","الفيزياء / ","الأحياء / ","التربية الإسلامية / ","اللغة العربية / ","اللغة الإنجليزية / ",null,163,"محمد سعيد جابر سالم اليربوعى",5.780346820809248E-6,49]
[164,"محمد طارق الحاج","10 - 5",20.5,23,18.5,17,21.5,19,20,13,20,172.5,"ناجح",0.63888888888888884,"مقبول",null,"",null,"","","","","","","","x","",7,0,"ناجح","","","","","","","","اللغة العربية / ","",null,164,"محمد طارق الحاج",172.50000574712644,{"$error":"#N/A"}]
[165,"محمد عبدالله شيخ محمد","10 - 5",17,21,13,24,28,23,24.5,22,22,194.5,"دور ثانى",0.72037037037037033,"جيد",null,"الحوسبة وتكنولوجيا المعلومات / ",null,"","","x","","","","","","",6,1,"دور ثانى","","","الحوسبة وتكنولوجيا المعلومات / ","","","","","","",null,165,"محمد عبدالله شيخ محمد",194.50000571428572,{"$error":"#N/A"}]
[166,"محمد محسن محمد دخيل اليربوعى","10 - 5",8.5,13,11,5.5,11,8,6,13,9,85,"دور ثانى",0.31481481481481483,"دون المستوى",null,"الرياضيات / الدراسات الاجتماعية / الحوسبة وتكنولوجيا المعلومات / الكيمياء / الفيزياء / الأحياء / التربية الإسلامية / ",null,"x","x","x","x","x","x","x","x","x",0,7,"دور ثانى","الرياضيات / ","الدراسات الاجتماعية / ","الحوسبة وتكنولوجيا المعلومات / ","الكيمياء / ","الفيزياء / ","الأحياء / ","التربية الإسلامية / ","اللغة العربية / ","اللغة الإنجليزية / ",null,166,"محمد محسن محمد دخيل اليربوعى",85.00000568181818,{"$error":"#N/A"}]
[167,"مصطفى اسامه محمد زهدي سيد","10 - 5",24.5,25.5,26.5,23.5,26,19,22.5,18.5,26,212,"ناجح",0.78518518518518521,"جيد جدا",null,"",null,"","","","","","","","","",7,0,"ناجح","","","","","","","","","",null,167,"مصطفى اسامه محمد زهدي سيد",212.00000564971751,{"$error":"#N/A"}]
[168,"مهند عمر سمير كلباني","10 - 5",23,21.5,21,16.5,27,22,19.5,24,27,201.5,"ناجح",0.74629629629629635,"جيد",null,"",null,"","","","","","","","","",7,0,"ناجح","","","","","","","","","",null,168,"مهند عمر سمير كلباني",201.50000561797754,{"$error":"#N/A"}]
[169,"نصر على نصر على النصر","10 - 5",7,16,16,9,15,12.5,12,14,10,111.5,"دور ثانى",0.41296296296296298,"دون المستوى",null,"الرياضيات / الكيمياء / الأحياء / التربية الإسلامية / ",null,"x","","","x","","x","x","x","x",3,4,"دور ثانى","الرياضيات / ","","","الكيمياء / ","","الأحياء / ","التربية الإسلامية / ","اللغة العربية / ","اللغة الإنجليزية / ",null,169,"نصر على نصر على النصر",111.50000558659218,{"$error":"#N/A"}]
[170,"حمد اصغر خان نواب خان","10 - 6",7,6,null,4,10,6.5,8,7,19,67.5,"دور ثانى",0.25,"دون المستوى",null,"الرياضيات / الدراسات الاجتماعية / الحوسبة وتكنولوجيا المعلومات / الكيمياء / الفيزياء / الأحياء / التربية الإسلامية / ",null,"x","x","x","x","x","x","x","x","",0,7,"دور ثانى","الرياضيات / ","الدراسات الاجتماعية / ","الحوسبة وتكنولوجيا المعلومات / ","الكيمياء / ","الفيزياء / ","الأحياء / ","التربية الإسلامية / ","اللغة العربية / ","",null,170,"حمد اصغر خان نواب خان",67.50000555555556,{"$error":"#N/A"}]
[171,"خالد سلطان حسن عباس الجمالى","10 - 6",21.5,15.5,26,12,20,14,17,13,18,157,"دور ثانى",0.58148148148148149,"مقبول",null,"الكيمياء / الأحياء / ",null,"","","","x","","x","","x","",5,2,"دور ثانى","","","","الكيمياء / ","","الأحياء / ","","اللغة العربية / ","",null,171,"خالد سلطان حسن عباس الجمالى",157.00000552486188,{"$error":"#N/A"}]
[172,"شفيع فهد على شفيع الفهيده","10 - 6",28,29,28,23,30,23,26.5,26,21,234.5,"ناجح",0.86851851851851847,"ممتاز",null,"",null,"","","","","","","","","",7,0,"ناجح","","","","","","","","","",null,172,"شفيع فهد على شفيع الفهيده",234.5000054945055,22]
[173,"عبدالرجمن يارمحمد معين خان","10 - 6",19.5,10,1,17,24,14,18.5,15,13.5,132.5,"دور ثانى",0.49074074074074076,"دون المستوى",null,"الدراسات الاجتماعية / الحوسبة وتكنولوجيا المعلومات / الأحياء / ",null,"","x","x","","","x","","","x",4,3,"دور ثانى","","الدراسات الاجتماعية / ","الحوسبة وتكنولوجيا المعلومات / ","","","الأحياء / ","","","اللغة الإنجليزية / ",null,173,"عبدالرجمن يارمحمد معين خان",132.50000546448086,{"$error":"#N/A"}]
[174,"عبدالرحمن جاسم محمد قاسم العمادى","10 - 6",19.5,15.5,9,10,17,14.5,15,13,19.5,133,"دور ثانى",0.49259259259259258,"دون المستوى",null,"الحوسبة وتكنولوجيا المعلومات / الكيمياء / الأحياء / ",null,"","","x","x","","x","","x","",4,3,"دور ثانى","","","الحوسبة وتكنولوجيا المعلومات / ","الكيمياء / ","","الأحياء / ","","اللغة العربية / ","",null,174,"عبدالرحمن جاسم محمد قاسم العمادى",133.00000543478262,{"$error":"#N/A"}]
[175,"عبدالرحمن حسين عبدي","10 - 6",18,7,3,8,15,9.5,17.5,12,21,111,"دور ثانى",0.41111111111111109,"دون المستوى",null,"الدراسات الاجتماعية / الحوسبة وتكنولوجيا المعلومات / الكيمياء / الأحياء / ",null,"","x","x","x","","x","","x","",3,4,"دور ثانى","","الدراسات الاجتماعية / ","الحوسبة وتكنولوجيا المعلومات / ","الكيمياء / ","","الأحياء / ","","اللغة العربية / ","",null,175,"عبدالرحمن حسين عبدي",111.0000054054054,{"$error":"#N/A"}]
[176,"عبدالرحمن محماس غزاى المقاطى العتيبى","10 - 6",11.5,10,null,9,12,8.5,18,20,9,98,"دور ثانى",0.36296296296296299,"دون المستوى",null,"الرياضيات / الدراسات الاجتماعية / الحوسبة وتكنولوجيا المعلومات / الكيمياء / الفيزياء / الأحياء / ",null,"x","x","x","x","x","x","","","x",1,6,"دور ثانى","الرياضيات / ","الدراسات الاجتماعية / ","الحوسبة وتكنولوجيا المعلومات / ","الكيمياء / ","الفيزياء / ","الأحياء / ","","","اللغة الإنجليزية / ",null,176,"عبدالرحمن محماس غزاى المقاطى العتيبى",98.000005376344092,{"$error":"#N/A"}]
[177,"عبدالرحمن مرتضى عبدالعال ساتى الحسن","10 - 6",28,18,26,24,29,20,19,15.5,24.5,204,"ناجح",0.75555555555555554,"جيد جدا",null,"",null,"","","","","","","","","",7,0,"ناجح","","","","","","","","","",null,177,"عبدالرحمن مرتضى عبدالعال ساتى الحسن",204.00000534759357,{"$error":"#N/A"}]
[178,"عبدالعزيز جهان بخش مرادك درزاده","10 - 6",14,7,8,10,16,12.5,16.5,11,15,110,"دور ثانى",0.40740740740740738,"دون المستوى",null,"الرياضيات / الدراسات الاجتماعية / الحوسبة وتكنولوجيا المعلومات / الكيمياء / الأحياء / ",null,"x","x","x","x","","x","","x","",2,5,"دور ثانى","الرياضيات / ","الدراسات الاجتماعية / ","الحوسبة وتكنولوجيا المعلومات / ","الكيمياء / ","","الأحياء / ","","اللغة العربية / ","",null,178,"عبدالعزيز جهان بخش مرادك درزاده",110.00000531914894,{"$error":"#N/A"}]
[179,"عبدالعزيز سلطان حسن سالم الكثيرى","10 - 6",20.5,16.5,16,21,19,13,22,17,17.5,162.5,"دور ثانى",0.60185185185185186,"مقبول",null,{"$f":"CONCATENATE(AF189,AG189,AH189,AI189,AJ189,AK189,AL189)","v":"الأحياء / "},null,"","","","","","x","","","",6,1,"دور ثانى","","","","","","الأحياء / ","","","",null,179,{"$f":"B189","v":"عبدالعزيز سلطان حسن سالم الكثيرى"},{"$f":"IF(M189=\"\",\"\",IF(M189=\"غ\",\"غ\",M189+1/ROW()*0.001))","v":162.50000529100529},{"$error":"#N/A"}]
[180,"عبدالغني عثمان عمر ورسمة","10 - 6",18,18.5,1.5,16,17,14,18,12,13.5,128.5,"دور ثانى",0.47592592592592597,"دون المستوى",null,"الحوسبة وتكنولوجيا المعلومات / الأحياء / ",null,"","","x","","","x","","x","x",5,2,"دور ثانى","","","الحوسبة وتكنولوجيا المعلومات / ","","","الأحياء / ","","اللغة العربية / ","اللغة الإنجليزية / ",null,180,"عبدالغني عثمان عمر ورسمة",128.5000052631579,{"$error":"#N/A"}]
[181,"عبدالقادر انس العمر","10 - 6",30,30,26,29,28,30,28,28,17.5,246.5,"ناجح",0.91296296296296309,"ممتاز",null,"",null,"","","","","","","","","",7,0,"ناجح","","","","","","","","","",null,181,"عبدالقادر انس العمر",246.50000523560209,{"$error":"#N/A"}]
[182,"عبدالله جاسم على محمد القايد","10 - 6",25.5,17,12.5,15,18,10,22.5,15,18.5,154,"دور ثانى",0.57037037037037042,"مقبول",null,"الحوسبة وتكنولوجيا المعلومات / الأحياء / ",null,"","","x","","","x","","","",5,2,"دور ثانى","","","الحوسبة وتكنولوجيا المعلومات / ","","","الأحياء / ","","","",null,182,"عبدالله جاسم على محمد القايد",154.00000520833333,{"$error":"#N/A"}]
[183,"عبدالله حمد سالم العيسائى اليافعى","10 - 6",24.5,21,21.5,24,29,21,24,18,23,206,"ناجح",0.76296296296296295,"جيد جدا",null,"",null,"","","","","","","","","",7,0,"ناجح","","","","","","","","","",null,183,"عبدالله حمد سالم العيسائى اليافعى",206.00000518134715,{"$error":"#N/A"}]
[184,"عبدالله على عبدالمحسن راشد الهميمى","10 - 6",27.5,20.5,29,28,27,22,21,20,21.5,216.5,"ناجح",0.80185185185185182,"جيد جدا",null,"",null,"","","","","","","","","",7,0,"ناجح","","","","","","","","","",null,184,"عبدالله على عبدالمحسن راشد الهميمى",216.50000515463918,{"$error":"#N/A"}]
[185,"عبدالله محماس غزاى المقاطى العتيبى","10 - 6",12.5,11,9.5,21,19,9.5,12,19,7.5,121,"دور ثانى",0.44814814814814807,"دون المستوى",null,"الرياضيات / الدراسات الاجتماعية / الحوسبة وتكنولوجيا المعلومات / الأحياء / التربية الإسلامية / ",null,"x","x","x","","","x","x","","x",2,5,"دور ثانى","الرياضيات / ","الدراسات الاجتماعية / ","الحوسبة وتكنولوجيا المعلومات / ","","","الأحياء / ","التربية الإسلامية / ","","اللغة الإنجليزية / ",null,185,"عبدالله محماس غزاى المقاطى العتيبى",121.00000512820513,{"$error":"#N/A"}]
[186,"عبدالله ناصر عبده السعدى اليافعى","10 - 6",25,18,12,19,24,16,23,17,25,179,"دور ثانى",0.66296296296296309,"جيد",null,"الحوسبة وتكنولوجيا المعلومات / ",null,"","","x","","","","","","",6,1,"دور ثانى","","","الحوسبة وتكنولوجيا المعلومات / ","","","","","","",null,186,"عبدالله ناصر عبده السعدى اليافعى",179.0000051020408,{"$error":"#N/A"}]
[187,"على احمد عبدالله احمد العبدالله","10 - 6",23.5,22,20.5,22,20.5,16.5,20,17,18.5,180.5,"ناجح",0.66851851851851851,"جيد",null,"",null,"","","","","","","","","",7,0,"ناجح","","","","","","","","","",null,187,"على احمد عبدالله احمد العبدالله",180.50000507614214,{"$error":"#N/A"}]
[188,"على فهد على شفيع الفهيده","10 - 6",17,28,7,14,23,18.5,19,19,18,163.5,"دور ثانى",0.60555555555555551,"مقبول",null,"الحوسبة وتكنولوجيا المعلومات / الكيمياء / ",null,"","","x","x","","","","","",5,2,"دور ثانى","","","الحوسبة وتكنولوجيا المعلومات / ","الكيمياء / ","","","","","",null,188,"على فهد على شفيع الفهيده",163.50000505050505,{"$error":"#N/A"}]
[189,"فارس وليد محي الدين","10 - 6",15.5,14.5,21.5,15,18,10.5,16,18,25.5,154.5,"دور ثانى",0.57222222222222219,"مقبول",null,"الدراسات الاجتماعية / الأحياء / ",null,"","x","","","","x","","","",5,2,"دور ثانى","","الدراسات الاجتماعية / ","","","","الأحياء / ","","","",null,189,"فارس وليد محي الدين",154.50000502512563,{"$error":"#N/A"}]
[190,"قطبى ياسر القطبي ادريس","10 - 6",null,null,null,null,null,null,null,null,null,0,"دور ثانى",0,"دون المستوى",null,"الرياضيات / الدراسات الاجتماعية / الحوسبة وتكنولوجيا المعلومات / الكيمياء / الفيزياء / الأحياء / التربية الإسلامية / ",null,"x","x","x","x","x","x","x","x","x",0,7,"دور ثانى","الرياضيات / ","الدراسات الاجتماعية / ","الحوسبة وتكنولوجيا المعلومات / ","الكيمياء / ","الفيزياء / ","الأحياء / ","التربية الإسلامية / ","اللغة العربية / ","اللغة الإنجليزية / ",null,190,"قطبى ياسر القطبي ادريس",5.0000000000000004E-6,49]
[191,"محمد الفاضل يوسف محمد","10 - 6",21,21,17,25,18,20,25,20,23.5,190.5,"ناجح",0.7055555555555556,"جيد",null,"",null,"","","","","","","","","",7,0,"ناجح","","","","","","","","","",null,191,"محمد الفاضل يوسف محمد",190.50000497512437,{"$error":"#N/A"}]
[192,"محمد جابر حسين على الجرحب","10 - 6",18.5,21,24,12,16,17,18,17,14.5,158,"دور ثانى",0.58518518518518514,"مقبول",null,"الكيمياء / ",null,"","","","x","","","","","x",6,1,"دور ثانى","","","","الكيمياء / ","","","","","اللغة الإنجليزية / ",null,192,"محمد جابر حسين على الجرحب",158.00000495049505,{"$error":"#N/A"}]
[193,"محمد حمد حسين بن عباس الخزاعى","10 - 6",30,26,20,25,22,16,22,20,26.5,{"$f":"IF(B203=\"\",\"\",IF(AND(D203=\"غ\",E203=\"غ\",F203=\"غ\",G203=\"غ\",H203=\"غ\",I203=\"غ\",J203=\"غ\",K203=\"غ\",L203=\"غ\"),\"غ\",SUM(D203,E203,F203,G203,H203,I203,J203,K203,L203)))","v":207.5},{"$f":"IF(B203=\"\",\"\",AE203)","v":"ناجح"},{"$f":"IF(B203=\"\",\"\",IF(M203=\"غ\",\"غ\",M203/$M$10*100/100))","v":0.76851851851851849},"جيد جدا",null,"",null,"","","","","","","","","",{"$f":"IF(B203=\"\",\"\",COUNTBLANK(T203:Z203))","v":7},{"$f":"IF(B203=\"\",\"\",COUNTIF(T203:Z203,\"x\"))","v":0},{"$f":"IF(B203=\"\",\"\",IF(AC203=7,\"ناجح\",\"دور ثانى\"))","v":"ناجح"},"","","","","","","","","",null,193,"محمد حمد حسين بن عباس الخزاعى",207.50000492610837,{"$error":"#N/A"}]
[{"$f":"ROW()-10","v":194},"محمد على سالم حمد جبران","10 - 6",5.5,13,7,3,16,12,17,13.5,12.5,99.5,"دور ثانى",0.36851851851851852,{"$f":"IF(M204=\"\",\"\",IF(M204=\"غ\",\"غ\",IF(M204=0,\"دون المستوى\",IF(M204/$M$10*100>=85,\"ممتاز\",IF(M204/$M$10*100>=75,\"جيد جدا\",IF(M204/$M$10*100>=65,\"جيد\",IF(M204/$M$10*100>=50,\"مقبول\",IF(M204/$M$10*100<50,\"دون المستوى\"))))))))","v":"دون المستوى"},null,"الرياضيات / الدراسات الاجتماعية / الحوسبة وتكنولوجيا المعلومات / الكيمياء / الأحياء / ",null,{"$f":"IF($B204=\"\",\"\",IF(OR(D204<15,D204=\"\",D204=\"غ\",D204=\"صفر\"=\"\"),\"x\",\"\"))","v":"x"},{"$f":"IF($B204=\"\",\"\",IF(OR(E204<15,E204=\"\",E204=\"غ\",E204=\"صفر\"=\"\"),\"x\",\"\"))","v":"x"},{"$f":"IF($B204=\"\",\"\",IF(OR(F204<15,F204=\"\",F204=\"غ\",F204=\"صفر\"=\"\"),\"x\",\"\"))","v":"x"},{"$f":"IF($B204=\"\",\"\",IF(OR(G204<15,G204=\"\",G204=\"غ\",G204=\"صفر\"=\"\"),\"x\",\"\"))","v":"x"},{"$f":"IF($B204=\"\",\"\",IF(OR(H204<15,H204=\"\",H204=\"غ\",H204=\"صفر\"=\"\"),\"x\",\"\"))","v":""},{"$f":"IF($B204=\"\",\"\",IF(OR(I204<15,I204=\"\",I204=\"غ\",I204=\"صفر\"=\"\"),\"x\",\"\"))","v":"x"},{"$f":"IF($B204=\"\",\"\",IF(OR(J204<15,J204=\"\",J204=\"غ\",J204=\"صفر\"=\"\"),\"x\",\"\"))","v":""},{"$f":"IF($B204=\"\",\"\",IF(OR(K204<15,K204=\"\",K204=\"غ\",K204=\"صفر\"=\"\"),\"x\",\"\"))","v":"x"},{"$f":"IF($B204=\"\",\"\",IF(OR(L204<15,L204=\"\",L204=\"غ\",L204=\"صفر\"=\"\"),\"x\",\"\"))","v":"x"},2,5,"دور ثانى",{"$f":"IF(T204=\"x\",\"الرياضيات / \",\"\")","v":"الرياضيات / "},{"$f":"IF(U204=\"x\",\"الدراسات الاجتماعية / \",\"\")","v":"الدراسات الاجتماعية / "},{"$f":"IF(V204=\"x\",\"الحوسبة وتكنولوجيا المعلومات / \",\"\")","v":"الحوسبة وتكنولوجيا المعلومات / "},{"$f":"IF(W204=\"x\",\"الكيمياء / \",\"\")","v":"الكيمياء / "},{"$f":"IF(X204=\"x\",\"الفيزياء / \",\"\")","v":""},{"$f":"IF(Y204=\"x\",\"الأحياء / \",\"\")","v":"الأحياء / "},{"$f":"IF(Z204=\"x\",\"التربية الإسلامية / \",\"\")","v":""},{"$f":"IF(AA204=\"x\",\"اللغة العربية / \",\"\")","v":"اللغة العربية / "},{"$f":"IF(AB204=\"x\",\"اللغة الإنجليزية / \",\"\")","v":"اللغة الإنجليزية / "},null,194,"محمد على سالم حمد جبران",99.500004901960779,{"$error":"#N/A"}]
[195,"محمد محمود صلاح الدين محمود محمد","10 - 6",29,19,28.5,20.5,22,21,23,19,18.5,200.5,"ناجح",0.74259259259259247,"جيد",null,"",null,"","","","","","","","","",7,0,"ناجح","","","","","","","","","",null,195,"محمد محمود صلاح الدين محمود محمد",200.50000487804877,{"$error":"#N/A"}]
[196,"محمد وليد سيد حسن عبدالمجيد","10 - 6",30,27,29,27,26,28.5,28,27,27.5,250,"ناجح",0.92592592592592593,"ممتاز",null,"",null,"","","","","","","","","",7,0,"ناجح","","","","","","","","","",null,196,"محمد وليد سيد حسن عبدالمجيد",250.00000485436894,{"$error":"#N/A"}]
[197,"محمدنذير محمداياد الحريري","10 - 6",28,17.5,29,23.5,29,25,26,21.5,26,225.5,"ناجح",0.83518518518518514,"جيد جدا",null,"",null,"","","","","","","","","",7,0,"ناجح","","","","","","","","","",null,197,"محمدنذير محمداياد الحريري",225.50000483091787,{"$error":"#N/A"}]
[198,"مشعل عبدالرحمن عبدالله عبدالعزيز الاسحاق","10 - 6",22,17.5,26,18,13,13.5,18.5,15,21.5,165,"دور ثانى",0.61111111111111116,"مقبول",null,"الفيزياء / الأحياء / ",null,"","","","","x","x","","","",5,2,"دور ثانى","","","","","الفيزياء / ","الأحياء / ","","","",null,198,"مشعل عبدالرحمن عبدالله عبدالعزيز الاسحاق",165.00000480769231,{"$error":"#N/A"}]
[199,"مصطفى محمد مصطفى العبيد احمد","10 - 6",20.5,29,15,26.5,23,23.5,25.5,20,14.5,197.5,"ناجح",0.73148148148148151,"جيد",null,"",null,"","","","","","","","","x",7,0,"ناجح","","","","","","","","","اللغة الإنجليزية / ",null,199,"مصطفى محمد مصطفى العبيد احمد",197.500004784689,{"$error":"#N/A"}]
[200,"نايف حسن احمد الحيى النعيمى","10 - 6",7.5,10,1.5,8.5,8,7,18.5,16,7,84,"دور ثانى",0.31111111111111112,"دون المستوى",null,"الرياضيات / الدراسات الاجتماعية / الحوسبة وتكنولوجيا المعلومات / الكيمياء / الفيزياء / الأحياء / ",null,"x","x","x","x","x","x","","","x",1,6,"دور ثانى","الرياضيات / ","الدراسات الاجتماعية / ","الحوسبة وتكنولوجيا المعلومات / ","الكيمياء / ","الفيزياء / ","الأحياء / ","","","اللغة الإنجليزية / ",null,200,"نايف حسن احمد الحيى النعيمى",84.000004761904762,{"$error":"#N/A"}]
[201,"نواف على هادى الجربوعى المرى","10 - 6",19,7.5,1,15,15,15,20,10,7,109.5,"دور ثانى",0.40555555555555556,"دون المستوى",null,"الدراسات الاجتماعية / الحوسبة وتكنولوجيا المعلومات / ",null,"","x","x","","","","","x","x",5,2,"دور ثانى","","الدراسات الاجتماعية / ","الحوسبة وتكنولوجيا المعلومات / ","","","","","اللغة العربية / ","اللغة الإنجليزية / ",null,201,"نواف على هادى الجربوعى المرى",109.50000473933649,{"$error":"#N/A"}]
[202,"يوسف خالد ناصر عبدالكريم مثنى","10 - 6",12,9,5.5,11.5,18,13.5,15,9,9,102.5,"دور ثانى",0.37962962962962959,"دون المستوى",null,"الرياضيات / الدراسات الاجتماعية / الحوسبة وتكنولوجيا المعلومات / الكيمياء / الأحياء / ",null,"x","x","x","x","","x","","x","x",2,5,"دور ثانى","الرياضيات / ","الدراسات الاجتماعية / ","الحوسبة وتكنولوجيا المعلومات / ","الكيمياء / ","","الأحياء / ","","اللغة العربية / ","اللغة الإنجليزية / ",null,202,"يوسف خالد ناصر عبدالكريم مثنى",102.50000471698114,{"$error":"#N/A"}]
[203,"يوسف عادل احمد محمد مدني","10 - 6",29,19.5,17.5,26.5,21,20,23,20,26,202.5,"ناجح",0.75,"جيد جدا",null,"",null,"","","","","","","","","",7,0,"ناجح","","","","","","","","","",null,203,"يوسف عادل احمد محمد مدني",202.50000469483567,{"$error":"#N/A"}]
[204,"السيدهاشم جعفر علي شبر الوداعي","10 - 7",19.5,21,26.5,16.5,26,25,26,18,26,204.5,"ناجح",0.75740740740740753,"جيد جدا",null,"",null,"","","","","","","","","",7,0,"ناجح","","","","","","","","","",null,204,"السيدهاشم جعفر علي شبر الوداعي",204.50000467289721,{"$error":"#N/A"}]
[205,"بلال ابراهيم","10 - 7",null,null,null,null,null,null,null,null,null,0,"دور ثانى",0,"دون المستوى",null,"الرياضيات / الدراسات الاجتماعية / الحوسبة وتكنولوجيا المعلومات / الكيمياء / الفيزياء / الأحياء / التربية الإسلامية / ",null,"x","x","x","x","x","x","x","x","x",0,7,"دور ثانى","الرياضيات / ","الدراسات الاجتماعية / ","الحوسبة وتكنولوجيا المعلومات / ","الكيمياء / ","الفيزياء / ","الأحياء / ","التربية الإسلامية / ","اللغة العربية / ","اللغة الإنجليزية / ",null,205,"بلال ابراهيم",4.6511627906976743E-6,49]
[206,"تركى مبارك تركى سعد التركى","10 - 7",10.5,25,10,10,23,17,16,16,10,137.5,"دور ثانى",0.5092592592592593,"مقبول",null,"الرياضيات / الحوسبة وتكنولوجيا المعلومات / الكيمياء / ",null,"x","","x","x","","","","","x",4,3,"دور ثانى","الرياضيات / ","","الحوسبة وتكنولوجيا المعلومات / ","الكيمياء / ","","","","","اللغة الإنجليزية / ",null,206,"تركى مبارك تركى سعد التركى",137.50000462962964,{"$error":"#N/A"}]
[207,"تميم على يوسف محمد الحمادى","10 - 7",14,13.5,21.5,11.5,18,16,12.5,8,7.5,122.5,"دور ثانى",0.45370370370370372,"دون المستوى",null,"الرياضيات / الدراسات الاجتماعية / الكيمياء / التربية الإسلامية / ",null,"x","x","","x","","","x","x","x",3,4,"دور ثانى","الرياضيات / ","الدراسات الاجتماعية / ","","الكيمياء / ","","","التربية الإسلامية / ","اللغة العربية / ","اللغة الإنجليزية / ",null,207,"تميم على يوسف محمد الحمادى",122.50000460829493,{"$error":"#N/A"}]
[208,"جاسم حسين جاسم على بوكربل","10 - 7",22.5,14,15,20,22,27,24,21.5,18.5,184.5,"دور ثانى",0.68333333333333324,"جيد",null,"الدراسات الاجتماعية / ",null,"","x","","","","","","","",6,1,"دور ثانى","","الدراسات الاجتماعية / ","","","","","","","",null,208,"جاسم حسين جاسم على بوكربل",184.50000458715596,{"$error":"#N/A"}]
[209,"جاسم محمد فرج البريص المري","10 - 7",13,14,11.5,8,16,11,18.5,16,null,108,"دور ثانى",0.4,"دون المستوى",null,"الرياضيات / الدراسات الاجتماعية / الحوسبة وتكنولوجيا المعلومات / الكيمياء / الأحياء / ",null,"x","x","x","x","","x","","","x",2,5,"دور ثانى","الرياضيات / ","الدراسات الاجتماعية / ","الحوسبة وتكنولوجيا المعلومات / ","الكيمياء / ","","الأحياء / ","","","اللغة الإنجليزية / ",null,209,"جاسم محمد فرج البريص المري",108.00000456621005,{"$error":"#N/A"}]
[210,"جوعان حمد محمد على بن نوره","10 - 7",29.5,25,29,27,26,24,23,22,25,230.5,"ناجح",0.85370370370370385,"ممتاز",null,"",null,"","","","","","","","","",7,0,"ناجح","","","","","","","","","",null,210,"جوعان حمد محمد على بن نوره",230.50000454545454,27]
[211,"خالد ناصر محمد اللواء المرى","10 - 7",10.5,11,21.5,19.5,17,11.5,14,13,19,137,"دور ثانى",0.50740740740740742,"مقبول",null,"الرياضيات / الدراسات الاجتماعية / الأحياء / التربية الإسلامية / ",null,"x","x","","","","x","x","x","",3,4,"دور ثانى","الرياضيات / ","الدراسات الاجتماعية / ","","","","الأحياء / ","التربية الإسلامية / ","اللغة العربية / ","",null,211,{"$f":"B221","v":"خالد ناصر محمد اللواء المرى"},137.00000452488689,{"$error":"#N/A"}]
[212,"سالم عبدالله سالم سعيد خوار","10 - 7",15,19,16.5,16,16,6.5,14.5,12.5,13,129,"دور ثانى",0.4777777777777778,"دون المستوى",null,"الأحياء / التربية الإسلامية / ",null,"","","","","","x","x","x","x",5,2,"دور ثانى","","","","","","الأحياء / ","التربية الإسلامية / ","اللغة العربية / ","اللغة الإنجليزية / ",null,212,"سالم عبدالله سالم سعيد خوار",129.00000450450452,{"$error":"#N/A"}]
[213,"سعد مبارك تركى سعد التركى","10 - 7",13,23,7.5,9,23,11.5,21,15.5,11.5,135,"دور ثانى",0.5,"مقبول",null,"الرياضيات / الحوسبة وتكنولوجيا المعلومات / الكيمياء / الأحياء / ",null,"x","","x","x","","x","","","x",3,4,"دور ثانى","الرياضيات / ","","الحوسبة وتكنولوجيا المعلومات / ","الكيمياء / ","","الأحياء / ","","","اللغة الإنجليزية / ",null,213,"سعد مبارك تركى سعد التركى",135.00000448430492,{"$error":"#N/A"}]
[214,"سعود خالد محمود بومحمود الشيخ","10 - 7",16.5,11.5,21,16.5,14,20,15,18,15.5,148,"دور ثانى",0.54814814814814816,"مقبول",null,"الدراسات الاجتماعية / الفيزياء / ",null,"","x","","","x","","","","",5,2,"دور ثانى","","الدراسات الاجتماعية / ","","","الفيزياء / ","","","","",null,214,"سعود خالد محمود بومحمود الشيخ",148.00000446428572,{"$error":"#N/A"}]
[215,"سلطان سعيد سالم غلفيص النابت","10 - 7",5,11.5,18.5,9.5,11,8.5,13.5,15.5,10,103,"دور ثانى",0.38148148148148148,"دون المستوى",null,"الرياضيات / الدراسات الاجتماعية / الكيمياء / الفيزياء / الأحياء / التربية الإسلامية / ",null,"x","x","","x","x","x","x","","x",1,6,"دور ثانى","الرياضيات / ","الدراسات الاجتماعية / ","","الكيمياء / ","الفيزياء / ","الأحياء / ","التربية الإسلامية / ","","اللغة الإنجليزية / ",null,215,"سلطان سعيد سالم غلفيص النابت",103.00000444444444,{"$error":"#N/A"}]
[216,"عبدالرحمن عبدالحميد محمد صالح العمودى","10 - 7",14,25,8.5,14.5,20,12,20.5,8,null,122.5,"دور ثانى",0.45370370370370372,"دون المستوى",null,"الرياضيات / الحوسبة وتكنولوجيا المعلومات / الكيمياء / الأحياء / ",null,"x","","x","x","","x","","x","x",3,4,"دور ثانى","الرياضيات / ","","الحوسبة وتكنولوجيا المعلومات / ","الكيمياء / ","","الأحياء / ","","اللغة العربية / ","اللغة الإنجليزية / ",null,216,"عبدالرحمن عبدالحميد محمد صالح العمودى",122.50000442477877,{"$error":"#N/A"}]
[217,"عبدالله راشد محسن حزام انديله","10 - 7",22.5,18.5,22.5,21.5,25,12,21,15.5,null,158.5,"دور ثانى",0.58703703703703702,"مقبول",null,"الأحياء / ",null,"","","","","","x","","","x",6,1,"دور ثانى","","","","","","الأحياء / ","","","اللغة الإنجليزية / ",null,217,"عبدالله راشد محسن حزام انديله",158.50000440528635,{"$error":"#N/A"}]
[218,"على سالم محمد ابوعرقوه المرى","10 - 7",16.5,22.5,27,25,26,27,24,22,25,215,"ناجح",0.79629629629629628,"جيد جدا",null,"",null,"","","","","","","","","",7,0,"ناجح","","","","","","","","","",null,218,"على سالم محمد ابوعرقوه المرى",215.0000043859649,{"$error":"#N/A"}]
[219,"على ناصر على ال مشروم المرى","10 - 7",27,26,25.5,26.5,22,18.5,22.5,13,23,204,"ناجح",0.75555555555555554,"جيد جدا",null,"",null,"","","","","","","","x","",7,0,"ناجح","","","","","","","","اللغة العربية / ","",null,219,"على ناصر على ال مشروم المرى",204.00000436681222,{"$error":"#N/A"}]
[220,"عمر عصام الدين محي حسن","10 - 7",null,null,null,null,null,null,null,null,null,0,"دور ثانى",0,"دون المستوى",null,"الرياضيات / الدراسات الاجتماعية / الحوسبة وتكنولوجيا المعلومات / الكيمياء / الفيزياء / الأحياء / التربية الإسلامية / ",null,"x","x","x","x","x","x","x","x","x",0,7,"دور ثانى","الرياضيات / ","الدراسات الاجتماعية / ","الحوسبة وتكنولوجيا المعلومات / ","الكيمياء / ","الفيزياء / ","الأحياء / ","التربية الإسلامية / ","اللغة العربية / ","اللغة الإنجليزية / ",null,220,"عمر عصام الدين محي حسن",4.3478260869565222E-6,49]
[221,"عيسى محمد عبد الله عامرى","10 - 7",14.5,23.5,20.5,21,19,18,20,20.5,18,175,"دور ثانى",0.64814814814814814,"مقبول",null,"الرياضيات / ",null,"x","","","","","","","","",6,1,"دور ثانى","الرياضيات / ","","","","","","","","",null,221,"عيسى محمد عبد الله عامرى",175.00000432900433,45]
[222,"فارس سالم حسن سالم الكثيرى","10 - 7",18,25.5,19,19.5,17,14,22,24,27.5,186.5,"دور ثانى",0.69074074074074077,"جيد",null,"الأحياء / ",null,"","","","","","x","","","",6,1,"دور ثانى","","","","","","الأحياء / ","","","",null,222,"فارس سالم حسن سالم الكثيرى",186.50000431034482,{"$error":"#N/A"}]
[223,"فهد ابوبكر محمد مبخوت الصيعرى","10 - 7",10,7.5,2.5,13,15.5,4,13.5,13,14,93,"دور ثانى",0.34444444444444444,"دون المستوى",null,"الرياضيات / الدراسات الاجتماعية / الحوسبة وتكنولوجيا المعلومات / الكيمياء / الأحياء / التربية الإسلامية / ",null,"x","x","x","x","","x","x","x","x",1,6,"دور ثانى","الرياضيات / ","الدراسات الاجتماعية / ","الحوسبة وتكنولوجيا المعلومات / ","الكيمياء / ","","الأحياء / ","التربية الإسلامية / ","اللغة العربية / ","اللغة الإنجليزية / ",null,223,"فهد ابوبكر محمد مبخوت الصيعرى",93.000004291845499,{"$error":"#N/A"}]
[224,"مبارك سالم مبارك النابت المرى","10 - 7",12.5,15,10,18.5,16,12.5,17,7,14,122.5,"دور ثانى",0.45370370370370372,"دون المستوى",null,"الرياضيات / الحوسبة وتكنولوجيا المعلومات / الأحياء / ",null,"x","","x","","","x","","x","x",4,3,"دور ثانى","الرياضيات / ","","الحوسبة وتكنولوجيا المعلومات / ","","","الأحياء / ","","اللغة العربية / ","اللغة الإنجليزية / ",null,224,"مبارك سالم مبارك النابت المرى",122.50000427350427,{"$error":"#N/A"}]
[225,"مجتبى كامل عبدالله محمد","10 - 7",25,15,20,18,18,18,22,21,25,182,"ناجح",0.67407407407407405,"جيد",null,"",null,"","","","","","","","","",7,0,"ناجح","","","","","","","","","",null,{"$f":"A235","v":225},"مجتبى كامل عبدالله محمد",182.00000425531914,{"$f":"IF(M235=\" \",\" \",IF(M235=\"غ\",\"غ\",RANK(M235,$M$11:$M$60)))","v":{"$error":"#N/A"}}]
[226,"محمد احمد جمعه احمد السبيعى","10 - 7",16,12,20.5,10.5,22,15.5,14.5,17,17.5,145.5,"دور ثانى",0.53888888888888886,"مقبول",null,"الدراسات الاجتماعية / الكيمياء / التربية الإسلامية / ",null,"","x","","x","","","x","","",4,3,"دور ثانى","","الدراسات الاجتماعية / ","","الكيمياء / ","","","التربية الإسلامية / ","","",null,226,"محمد احمد جمعه احمد السبيعى",145.50000423728812,{"$error":"#N/A"}]
[227,"محمد بدرالدين ميرغنى ادم على","10 - 7",10.5,10.5,17.5,18,12,14.5,21,24,15,143,"دور ثانى",0.52962962962962967,"مقبول",null,"الرياضيات / الدراسات الاجتماعية / الفيزياء / الأحياء / ",null,"x","x","","","x","x","","","",3,4,"دور ثانى","الرياضيات / ","الدراسات الاجتماعية / ","","","الفيزياء / ","الأحياء / ","","","",null,227,"محمد بدرالدين ميرغنى ادم على",143.00000421940928,{"$error":"#N/A"}]
[228,"محمد راشد سالم صالح لحيمر","10 - 7",14,22,19.5,16,14,16,16.5,17,16,151,"دور ثانى",0.55925925925925923,"مقبول",null,"الرياضيات / الفيزياء / ",null,"x","","","","x","","","","",5,2,"دور ثانى","الرياضيات / ","","","","الفيزياء / ","","","","",null,228,"محمد راشد سالم صالح لحيمر",151.00000420168067,{"$error":"#N/A"}]
[229,"محمد راشد عبدالمحسن راشد الهميمى","10 - 7",30,29,30,28,28,30,29,28,26,258,"ناجح",0.9555555555555556,"ممتاز",null,"",null,"","","","","","","","","",7,0,"ناجح","","","","","","","","","",null,229,"محمد راشد عبدالمحسن راشد الهميمى",258.00000418410042,{"$error":"#N/A"}]
[230,"محمد رائد عبدالرحيم","10 - 7",13,19.5,25,19,13,11.5,18,18,19.5,156.5,"دور ثانى",0.57962962962962961,"مقبول",null,"الرياضيات / الفيزياء / الأحياء / ",null,"x","","","","x","x","","","",4,3,"دور ثانى","الرياضيات / ","","","","الفيزياء / ","الأحياء / ","","","",null,230,"محمد رائد عبدالرحيم",156.50000416666666,{"$error":"#N/A"}]
[231,"محمد سعيد سعد خالد مقبل","10 - 7",21,28,26,23,26,24,24,20,20,212,"ناجح",0.78518518518518521,"جيد جدا",null,"",null,"","","","","","","","","",7,0,"ناجح","","","","","","","","","",null,231,"محمد سعيد سعد خالد مقبل",212.00000414937759,{"$error":"#N/A"}]
[232,"محمد عادل عبدالله محمد الخورى","10 - 7",8,6.5,10,15,13,9.5,18.5,12,11,103.5,"دور ثانى",0.38333333333333336,"دون المستوى",null,"الرياضيات / الدراسات الاجتماعية / الحوسبة وتكنولوجيا المعلومات / الفيزياء / الأحياء / ",null,"x","x","x","","x","x","","x","x",2,5,"دور ثانى","الرياضيات / ","الدراسات الاجتماعية / ","الحوسبة وتكنولوجيا المعلومات / ","","الفيزياء / ","الأحياء / ","","اللغة العربية / ","اللغة الإنجليزية / ",null,232,"محمد عادل عبدالله محمد الخورى",103.50000413223141,{"$error":"#N/A"}]
[233,"محمد عبدالله محمد امين ابراهيم","10 - 7",22.5,11,25,16,26.5,15,22.5,22.5,23,184,"دور ثانى",0.68148148148148158,"جيد",null,"الدراسات الاجتماعية / ",null,"","x","","","","","","","",6,1,"دور ثانى","","الدراسات الاجتماعية / ","","","","","","","",null,233,"محمد عبدالله محمد امين ابراهيم",184.00000411522635,{"$error":"#N/A"}]
[234,"محمد واصف عارف حيدر","10 - 7",29,25,27.5,29,30,26,25,26,23,240.5,"ناجح",0.89074074074074072,"ممتاز",null,"",null,"","","","","","","","","",7,0,"ناجح","","","","","","","","","",null,234,"محمد واصف عارف حيدر",240.50000409836065,18]
[235,"مشعل خالد احمد سليمان الهيل","10 - 7",19.5,16,21,22.5,27,14,24,18,23,185,"دور ثانى",0.68518518518518523,"جيد",null,"الأحياء / ",null,"","","","","","x","","","",6,1,"دور ثانى","","","","","","الأحياء / ","","","",null,235,"مشعل خالد احمد سليمان الهيل",185.00000408163265,{"$error":"#N/A"}]
[236,"ناصر راشد على العلى المعاضيد","10 - 7",12.5,14.5,15,15,17,7,13,13,11,118,"دور ثانى",0.437037037037037,"دون المستوى",null,"الرياضيات / الدراسات الاجتماعية / الأحياء / التربية الإسلامية / ",null,"x","x","","","","x","x","x","x",3,4,"دور ثانى","الرياضيات / ","الدراسات الاجتماعية / ","","","","الأحياء / ","التربية الإسلامية / ","اللغة العربية / ","اللغة الإنجليزية / ",null,236,"ناصر راشد على العلى المعاضيد",118.00000406504066,{"$error":"#N/A"}]
[237,"نايف على هادف انديله الحسناء","10 - 7",8.5,12.5,13,10.5,17,10.5,14,16,10,112,"دور ثانى",0.4148148148148148,"دون المستوى",null,"الرياضيات / الدراسات الاجتماعية / الحوسبة وتكنولوجيا المعلومات / الكيمياء / الأحياء / التربية الإسلامية / ",null,"x","x","x","x","","x","x","","x",1,6,"دور ثانى","الرياضيات / ","الدراسات الاجتماعية / ","الحوسبة وتكنولوجيا المعلومات / ","الكيمياء / ","","الأحياء / ","التربية الإسلامية / ","","اللغة الإنجليزية / ",null,237,"نايف على هادف انديله الحسناء",112.00000404858299,{"$error":"#N/A"}]

{"sheet":"ناجح","index":1,"n_rows":0,"n_cols":0,"rows_kept":0,"cut":false,"hidden":false,"merged":[]}

{"sheet":"دور ثانى","index":2,"n_rows":0,"n_cols":0,"rows_kept":0,"cut":false,"hidden":false,"merged":[]}

{"sheet":"كشف بالتلاميذ الناجحين","index":3,"n_rows":32,"n_cols":10,"rows_kept":32,"cut":false,"hidden":false,"merged":[[32,8,32,9],[33,8,33,9],[7,8,7,9],[33,4,33,5],[0,3,1,3],[0,2,1,2],[32,4,32,5],[5,6,5,7]]}
[null,null,0]
[]
[]
[]
[]
[null,null,null,null,null,null,"كشف الطلاب الناجحين"]
[]
[null,null,null,null,null,null,"الصف"]
[null,null,null,null,"م","رقم الجلوس","اسم الطالب","النتيجة","المجموع","النسبة المئوية"]
[null,null,null,{"$f":"C1","v":0},{"$f":"IF(G10=0,\"\",D10)","v":{"$error":"#REF!"}},{"$f":"_xlfn.SINGLE(IF(G10=0,\"\",INDEX(ناجح!#REF!,$D10,2)))","v":{"$error":"#REF!"}},{"$f":"_xlfn.SINGLE(INDEX(ناجح!#REF!,$D10,3))","v":{"$error":"#REF!"}},{"$f":"_xlfn.SINGLE(IF(G10=0,\"\",INDEX(ناجح!#REF!,$D10,39)))","v":{"$error":"#REF!"}},{"$f":"_xlfn.SINGLE(IF(G10=0,\"\",INDEX(ناجح!#REF!,$D10,31)))","v":{"$error":"#REF!"}},{"$f":"_xlfn.SINGLE(IF(G10=0,\"\",INDEX(ناجح!#REF!,$D10,40)))","v":{"$error":"#REF!"}}]
[null,null,null,{"$f":"D10+1","v":1},{"$f":"IF(G11=0,\"\",D10+1)","v":{"$error":"#REF!"}},{"$f":"_xlfn.SINGLE(IF(G11=0,\"\",INDEX(ناجح!#REF!,$D11,2)))","v":{"$error":"#REF!"}},{"$f":"_xlfn.SINGLE(INDEX(ناجح!#REF!,$D11,3))","v":{"$error":"#REF!"}},{"$f":"_xlfn.SINGLE(IF(G11=0,\"\",INDEX(ناجح!#REF!,$D11,39)))","v":{"$error":"#REF!"}},{"$f":"_xlfn.SINGLE(IF(G11=0,\"\",INDEX(ناجح!#REF!,$D11,31)))","v":{"$error":"#REF!"}},{"$f":"_xlfn.SINGLE(IF(G11=0,\"\",INDEX(ناجح!#REF!,$D11,40)))","v":{"$error":"#REF!"}}]
[null,null,null,{"$f":"D11+1","v":2},{"$f":"IF(G12=0,\"\",D11+1)","v":{"$error":"#REF!"}},{"$f":"_xlfn.SINGLE(IF(G12=0,\"\",INDEX(ناجح!#REF!,$D12,2)))","v":{"$error":"#REF!"}},{"$f":"_xlfn.SINGLE(INDEX(ناجح!#REF!,$D12,3))","v":{"$error":"#REF!"}},{"$f":"_xlfn.SINGLE(IF(G12=0,\"\",INDEX(ناجح!#REF!,$D12,39)))","v":{"$error":"#REF!"}},{"$f":"_xlfn.SINGLE(IF(G12=0,\"\",INDEX(ناجح!#REF!,$D12,31)))","v":{"$error":"#REF!"}},{"$f":"_xlfn.SINGLE(IF(G12=0,\"\",INDEX(ناجح!#REF!,$D12,40)))","v":{"$error":"#REF!"}}]
[null,null,null,3,{"$error":"#REF!"},{"$f":"_xlfn.SINGLE(IF(G13=0,\"\",INDEX(ناجح!#REF!,$D13,2)))","v":{"$error":"#REF!"}},{"$f":"_xlfn.SINGLE(INDEX(ناجح!#REF!,$D13,3))","v":{"$error":"#REF!"}},{"$f":"_xlfn.SINGLE(IF(G13=0,\"\",INDEX(ناجح!#REF!,$D13,39)))","v":{"$error":"#REF!"}},{"$f":"_xlfn.SINGLE(IF(G13=0,\"\",INDEX(ناجح!#REF!,$D13,31)))","v":{"$error":"#REF!"}},{"$f":"_xlfn.SINGLE(IF(G13=0,\"\",INDEX(ناجح!#REF!,$D13,40)))","v":{"$error":"#REF!"}}]
[null,null,null,4,{"$error":"#REF!"},{"$f":"_xlfn.SINGLE(IF(G14=0,\"\",INDEX(ناجح!#REF!,$D14,2)))","v":{"$error":"#REF!"}},{"$f":"_xlfn.SINGLE(INDEX(ناجح!#REF!,$D14,3))","v":{"$error":"#REF!"}},{"$f":"_xlfn.SINGLE(IF(G14=0,\"\",INDEX(ناجح!#REF!,$D14,39)))","v":{"$error":"#REF!"}},{"$f":"_xlfn.SINGLE(IF(G14=0,\"\",INDEX(ناجح!#REF!,$D14,31)))","v":{"$error":"#REF!"}},{"$f":"_xlfn.SINGLE(IF(G14=0,\"\",INDEX(ناجح!#REF!,$D14,40)))","v":{"$error":"#REF!"}}]
[null,null,null,5,{"$error":"#REF!"},{"$f":"_xlfn.SINGLE(IF(G15=0,\"\",INDEX(ناجح!#REF!,$D15,2)))","v":{"$error":"#REF!"}},{"$f":"_xlfn.SINGLE(INDEX(ناجح!#REF!,$D15,3))","v":{"$error":"#REF!"}},{"$f":"_xlfn.SINGLE(IF(G15=0,\"\",INDEX(ناجح!#REF!,$D15,39)))","v":{"$error":"#REF!"}},{"$f":"_xlfn.SINGLE(IF(G15=0,\"\",INDEX(ناجح!#REF!,$D15,31)))","v":{"$error":"#REF!"}},{"$f":"_xlfn.SINGLE(IF(G15=0,\"\",INDEX(ناجح!#REF!,$D15,40)))","v":{"$error":"#REF!"}}]
[null,null,null,6,{"$error":"#REF!"},{"$f":"_xlfn.SINGLE(IF(G16=0,\"\",INDEX(ناجح!#REF!,$D16,2)))","v":{"$error":"#REF!"}},{"$f":"_xlfn.SINGLE(INDEX(ناجح!#REF!,$D16,3))","v":{"$error":"#REF!"}},{"$f":"_xlfn.SINGLE(IF(G16=0,\"\",INDEX(ناجح!#REF!,$D16,39)))","v":{"$error":"#REF!"}},{"$f":"_xlfn.SINGLE(IF(G16=0,\"\",INDEX(ناجح!#REF!,$D16,31)))","v":{"$error":"#REF!"}},{"$f":"_xlfn.SINGLE(IF(G16=0,\"\",INDEX(ناجح!#REF!,$D16,40)))","v":{"$error":"#REF!"}}]
[null,null,null,7,{"$error":"#REF!"},{"$f":"_xlfn.SINGLE(IF(G17=0,\"\",INDEX(ناجح!#REF!,$D17,2)))","v":{"$error":"#REF!"}},{"$f":"_xlfn.SINGLE(INDEX(ناجح!#REF!,$D17,3))","v":{"$error":"#REF!"}},{"$f":"_xlfn.SINGLE(IF(G17=0,\"\",INDEX(ناجح!#REF!,$D17,39)))","v":{"$error":"#REF!"}},{"$f":"_xlfn.SINGLE(IF(G17=0,\"\",INDEX(ناجح!#REF!,$D17,31)))","v":{"$error":"#REF!"}},{"$f":"_xlfn.SINGLE(IF(G17=0,\"\",INDEX(ناجح!#REF!,$D17,40)))","v":{"$error":"#REF!"}}]
[null,null,null,8,{"$error":"#REF!"},{"$f":"_xlfn.SINGLE(IF(G18=0,\"\",INDEX(ناجح!#REF!,$D18,2)))","v":{"$error":"#REF!"}},{"$f":"_xlfn.SINGLE(INDEX(ناجح!#REF!,$D18,3))","v":{"$error":"#REF!"}},{"$f":"_xlfn.SINGLE(IF(G18=0,\"\",INDEX(ناجح!#REF!,$D18,39)))","v":{"$error":"#REF!"}},{"$f":"_xlfn.SINGLE(IF(G18=0,\"\",INDEX(ناجح!#REF!,$D18,31)))","v":{"$error":"#REF!"}},{"$f":"_xlfn.SINGLE(IF(G18=0,\"\",INDEX(ناجح!#REF!,$D18,40)))","v":{"$error":"#REF!"}}]
[null,null,null,9,{"$error":"#REF!"},{"$f":"_xlfn.SINGLE(IF(G19=0,\"\",INDEX(ناجح!#REF!,$D19,2)))","v":{"$error":"#REF!"}},{"$f":"_xlfn.SINGLE(INDEX(ناجح!#REF!,$D19,3))","v":{"$error":"#REF!"}},{"$f":"_xlfn.SINGLE(IF(G19=0,\"\",INDEX(ناجح!#REF!,$D19,39)))","v":{"$error":"#REF!"}},{"$f":"_xlfn.SINGLE(IF(G19=0,\"\",INDEX(ناجح!#REF!,$D19,31)))","v":{"$error":"#REF!"}},{"$f":"_xlfn.SINGLE(IF(G19=0,\"\",INDEX(ناجح!#REF!,$D19,40)))","v":{"$error":"#REF!"}}]
[null,null,null,10,{"$error":"#REF!"},{"$f":"_xlfn.SINGLE(IF(G20=0,\"\",INDEX(ناجح!#REF!,$D20,2)))","v":{"$error":"#REF!"}},{"$f":"_xlfn.SINGLE(INDEX(ناجح!#REF!,$D20,3))","v":{"$error":"#REF!"}},{"$f":"_xlfn.SINGLE(IF(G20=0,\"\",INDEX(ناجح!#REF!,$D20,39)))","v":{"$error":"#REF!"}},{"$f":"_xlfn.SINGLE(IF(G20=0,\"\",INDEX(ناجح!#REF!,$D20,31)))","v":{"$error":"#REF!"}},{"$f":"_xlfn.SINGLE(IF(G20=0,\"\",INDEX(ناجح!#REF!,$D20,40)))","v":{"$error":"#REF!"}}]
[null,null,null,11,{"$error":"#REF!"},{"$f":"_xlfn.SINGLE(IF(G21=0,\"\",INDEX(ناجح!#REF!,$D21,2)))","v":{"$error":"#REF!"}},{"$f":"_xlfn.SINGLE(INDEX(ناجح!#REF!,$D21,3))","v":{"$error":"#REF!"}},{"$f":"_xlfn.SINGLE(IF(G21=0,\"\",INDEX(ناجح!#REF!,$D21,39)))","v":{"$error":"#REF!"}},{"$f":"_xlfn.SINGLE(IF(G21=0,\"\",INDEX(ناجح!#REF!,$D21,31)))","v":{"$error":"#REF!"}},{"$f":"_xlfn.SINGLE(IF(G21=0,\"\",INDEX(ناجح!#REF!,$D21,40)))","v":{"$error":"#REF!"}}]
[null,null,null,12,{"$error":"#REF!"},{"$f":"_xlfn.SINGLE(IF(G22=0,\"\",INDEX(ناجح!#REF!,$D22,2)))","v":{"$error":"#REF!"}},{"$f":"_xlfn.SINGLE(INDEX(ناجح!#REF!,$D22,3))","v":{"$error":"#REF!"}},{"$f":"_xlfn.SINGLE(IF(G22=0,\"\",INDEX(ناجح!#REF!,$D22,39)))","v":{"$error":"#REF!"}},{"$f":"_xlfn.SINGLE(IF(G22=0,\"\",INDEX(ناجح!#REF!,$D22,31)))","v":{"$error":"#REF!"}},{"$f":"_xlfn.SINGLE(IF(G22=0,\"\",INDEX(ناجح!#REF!,$D22,40)))","v":{"$error":"#REF!"}}]
[null,null,null,13,{"$error":"#REF!"},{"$f":"_xlfn.SINGLE(IF(G23=0,\"\",INDEX(ناجح!#REF!,$D23,2)))","v":{"$error":"#REF!"}},{"$f":"_xlfn.SINGLE(INDEX(ناجح!#REF!,$D23,3))","v":{"$error":"#REF!"}},{"$f":"_xlfn.SINGLE(IF(G23=0,\"\",INDEX(ناجح!#REF!,$D23,39)))","v":{"$error":"#REF!"}},{"$f":"_xlfn.SINGLE(IF(G23=0,\"\",INDEX(ناجح!#REF!,$D23,31)))","v":{"$error":"#REF!"}},{"$f":"_xlfn.SINGLE(IF(G23=0,\"\",INDEX(ناجح!#REF!,$D23,40)))","v":{"$error":"#REF!"}}]
[null,null,null,14,{"$error":"#REF!"},{"$f":"_xlfn.SINGLE(IF(G24=0,\"\",INDEX(ناجح!#REF!,$D24,2)))","v":{"$error":"#REF!"}},{"$f":"_xlfn.SINGLE(INDEX(ناجح!#REF!,$D24,3))","v":{"$error":"#REF!"}},{"$f":"_xlfn.SINGLE(IF(G24=0,\"\",INDEX(ناجح!#REF!,$D24,39)))","v":{"$error":"#REF!"}},{"$f":"_xlfn.SINGLE(IF(G24=0,\"\",INDEX(ناجح!#REF!,$D24,31)))","v":{"$error":"#REF!"}},{"$f":"_xlfn.SINGLE(IF(G24=0,\"\",INDEX(ناجح!#REF!,$D24,40)))","v":{"$error":"#REF!"}}]
[null,null,null,15,{"$error":"#REF!"},{"$f":"_xlfn.SINGLE(IF(G25=0,\"\",INDEX(ناجح!#REF!,$D25,2)))","v":{"$error":"#REF!"}},{"$f":"_xlfn.SINGLE(INDEX(ناجح!#REF!,$D25,3))","v":{"$error":"#REF!"}},{"$f":"_xlfn.SINGLE(IF(G25=0,\"\",INDEX(ناجح!#REF!,$D25,39)))","v":{"$error":"#REF!"}},{"$f":"_xlfn.SINGLE(IF(G25=0,\"\",INDEX(ناجح!#REF!,$D25,31)))","v":{"$error":"#REF!"}},{"$f":"_xlfn.SINGLE(IF(G25=0,\"\",INDEX(ناجح!#REF!,$D25,40)))","v":{"$error":"#REF!"}}]
[null,null,null,16,{"$error":"#REF!"},{"$f":"_xlfn.SINGLE(IF(G26=0,\"\",INDEX(ناجح!#REF!,$D26,2)))","v":{"$error":"#REF!"}},{"$f":"_xlfn.SINGLE(INDEX(ناجح!#REF!,$D26,3))","v":{"$error":"#REF!"}},{"$f":"_xlfn.SINGLE(IF(G26=0,\"\",INDEX(ناجح!#REF!,$D26,39)))","v":{"$error":"#REF!"}},{"$f":"_xlfn.SINGLE(IF(G26=0,\"\",INDEX(ناجح!#REF!,$D26,31)))","v":{"$error":"#REF!"}},{"$f":"_xlfn.SINGLE(IF(G26=0,\"\",INDEX(ناجح!#REF!,$D26,40)))","v":{"$error":"#REF!"}}]
[null,null,null,17,{"$error":"#REF!"},{"$f":"_xlfn.SINGLE(IF(G27=0,\"\",INDEX(ناجح!#REF!,$D27,2)))","v":{"$error":"#REF!"}},{"$f":"_xlfn.SINGLE(INDEX(ناجح!#REF!,$D27,3))","v":{"$error":"#REF!"}},{"$f":"_xlfn.SINGLE(IF(G27=0,\"\",INDEX(ناجح!#REF!,$D27,39)))","v":{"$error":"#REF!"}},{"$f":"_xlfn.SINGLE(IF(G27=0,\"\",INDEX(ناجح!#REF!,$D27,31)))","v":{"$error":"#REF!"}},{"$f":"_xlfn.SINGLE(IF(G27=0,\"\",INDEX(ناجح!#REF!,$D27,40)))","v":{"$error":"#REF!"}}]
[null,null,null,18,{"$error":"#REF!"},{"$f":"_xlfn.SINGLE(IF(G28=0,\"\",INDEX(ناجح!#REF!,$D28,2)))","v":{"$error":"#REF!"}},{"$f":"_xlfn.SINGLE(INDEX(ناجح!#REF!,$D28,3))","v":{"$error":"#REF!"}},{"$f":"_xlfn.SINGLE(IF(G28=0,\"\",INDEX(ناجح!#REF!,$D28,39)))","v":{"$error":"#REF!"}},{"$f":"_xlfn.SINGLE(IF(G28=0,\"\",INDEX(ناجح!#REF!,$D28,31)))","v":{"$error":"#REF!"}},{"$f":"_xlfn.SINGLE(IF(G28=0,\"\",INDEX(ناجح!#REF!,$D28,40)))","v":{"$error":"#REF!"}}]
[null,null,null,19,{"$error":"#REF!"},{"$f":"_xlfn.SINGLE(IF(G29=0,\"\",INDEX(ناجح!#REF!,$D29,2)))","v":{"$error":"#REF!"}},{"$f":"_xlfn.SINGLE(INDEX(ناجح!#REF!,$D29,3))","v":{"$error":"#REF!"}},{"$f":"_xlfn.SINGLE(IF(G29=0,\"\",INDEX(ناجح!#REF!,$D29,39)))","v":{"$error":"#REF!"}},{"$f":"_xlfn.SINGLE(IF(G29=0,\"\",INDEX(ناجح!#REF!,$D29,31)))","v":{"$error":"#REF!"}},{"$f":"_xlfn.SINGLE(IF(G29=0,\"\",INDEX(ناجح!#REF!,$D29,40)))","v":{"$error":"#REF!"}}]
[null,null,null,20,{"$error":"#REF!"},{"$f":"_xlfn.SINGLE(IF(G30=0,\"\",INDEX(ناجح!#REF!,$D30,2)))","v":{"$error":"#REF!"}},{"$f":"_xlfn.SINGLE(INDEX(ناجح!#REF!,$D30,3))","v":{"$error":"#REF!"}},{"$f":"_xlfn.SINGLE(IF(G30=0,\"\",INDEX(ناجح!#REF!,$D30,39)))","v":{"$error":"#REF!"}},{"$f":"_xlfn.SINGLE(IF(G30=0,\"\",INDEX(ناجح!#REF!,$D30,31)))","v":{"$error":"#REF!"}},{"$f":"_xlfn.SINGLE(IF(G30=0,\"\",INDEX(ناجح!#REF!,$D30,40)))","v":{"$error":"#REF!"}}]
[null,null,null,21,{"$error":"#REF!"},{"$f":"_xlfn.SINGLE(IF(G31=0,\"\",INDEX(ناجح!#REF!,$D31,2)))","v":{"$error":"#REF!"}},{"$f":"_xlfn.SINGLE(INDEX(ناجح!#REF!,$D31,3))","v":{"$error":"#REF!"}},{"$f":"_xlfn.SINGLE(IF(G31=0,\"\",INDEX(ناجح!#REF!,$D31,39)))","v":{"$error":"#REF!"}},{"$f":"_xlfn.SINGLE(IF(G31=0,\"\",INDEX(ناجح!#REF!,$D31,31)))","v":{"$error":"#REF!"}},{"$f":"_xlfn.SINGLE(IF(G31=0,\"\",INDEX(ناجح!#REF!,$D31,40)))","v":{"$error":"#REF!"}}]
[null,null,null,22,{"$error":"#REF!"},{"$f":"_xlfn.SINGLE(IF(G32=0,\"\",INDEX(ناجح!#REF!,$D32,2)))","v":{"$error":"#REF!"}},{"$f":"_xlfn.SINGLE(INDEX(ناجح!#REF!,$D32,3))","v":{"$error":"#REF!"}},{"$f":"_xlfn.SINGLE(IF(G32=0,\"\",INDEX(ناجح!#REF!,$D32,39)))","v":{"$error":"#REF!"}},{"$f":"_xlfn.SINGLE(IF(G32=0,\"\",INDEX(ناجح!#REF!,$D32,31)))","v":{"$error":"#REF!"}},{"$f":"_xlfn.SINGLE(IF(G32=0,\"\",INDEX(ناجح!#REF!,$D32,40)))","v":{"$error":"#REF!"}}]

{"sheet":"كشف مواد الدور الثاني","index":4,"n_rows":34,"n_cols":9,"rows_kept":34,"cut":false,"hidden":false,"merged":[[3,4,3,5],[0,2,1,2],[32,4,32,5],[32,7,32,8],[33,4,33,5],[33,7,33,8]]}
[null,null,0]
[]
[]
[]
[]
[]
[]
[null,null,null,null,null,null,"الصف",{"$f":"#REF!","v":{"$error":"#REF!"}}]
[null,null,null,null,"م","رقم الجلوس","اسم الطالب","مواد الدور الثانى","توقيع الطالب"]
[null,null,null,{"$f":"C1","v":0},{"$f":"IF(G10=0,\"\",D10)","v":{"$error":"#REF!"}},{"$f":"_xlfn.SINGLE(IF(G10=0,\"\",INDEX('دور ثانى'!#REF!,$D10,2)))","v":{"$error":"#REF!"}},{"$f":"_xlfn.SINGLE(INDEX('دور ثانى'!#REF!,$D10,3))","v":{"$error":"#REF!"}},{"$f":"_xlfn.SINGLE(IF(G10=0,\"\",INDEX('دور ثانى'!#REF!,$D10,43)))","v":{"$error":"#REF!"}}]
[null,null,null,{"$f":"D10+1","v":1},{"$f":"IF(G11=0,\"\",E10+1)","v":{"$error":"#REF!"}},{"$f":"_xlfn.SINGLE(IF(G11=0,\"\",INDEX('دور ثانى'!#REF!,$D11,2)))","v":{"$error":"#REF!"}},{"$f":"_xlfn.SINGLE(INDEX('دور ثانى'!#REF!,$D11,3))","v":{"$error":"#REF!"}},{"$f":"_xlfn.SINGLE(IF(G11=0,\"\",INDEX('دور ثانى'!#REF!,$D11,43)))","v":{"$error":"#REF!"}}]
[null,null,null,{"$f":"D11+1","v":2},{"$f":"IF(G12=0,\"\",E11+1)","v":{"$error":"#REF!"}},{"$f":"_xlfn.SINGLE(IF(G12=0,\"\",INDEX('دور ثانى'!#REF!,$D12,2)))","v":{"$error":"#REF!"}},{"$f":"_xlfn.SINGLE(INDEX('دور ثانى'!#REF!,$D12,3))","v":{"$error":"#REF!"}},{"$f":"_xlfn.SINGLE(IF(G12=0,\"\",INDEX('دور ثانى'!#REF!,$D12,43)))","v":{"$error":"#REF!"}}]
[null,null,null,3,{"$error":"#REF!"},{"$f":"_xlfn.SINGLE(IF(G13=0,\"\",INDEX('دور ثانى'!#REF!,$D13,2)))","v":{"$error":"#REF!"}},{"$f":"_xlfn.SINGLE(INDEX('دور ثانى'!#REF!,$D13,3))","v":{"$error":"#REF!"}},{"$f":"_xlfn.SINGLE(IF(G13=0,\"\",INDEX('دور ثانى'!#REF!,$D13,43)))","v":{"$error":"#REF!"}}]
[null,null,null,4,{"$error":"#REF!"},{"$f":"_xlfn.SINGLE(IF(G14=0,\"\",INDEX('دور ثانى'!#REF!,$D14,2)))","v":{"$error":"#REF!"}},{"$f":"_xlfn.SINGLE(INDEX('دور ثانى'!#REF!,$D14,3))","v":{"$error":"#REF!"}},{"$f":"_xlfn.SINGLE(IF(G14=0,\"\",INDEX('دور ثانى'!#REF!,$D14,43)))","v":{"$error":"#REF!"}}]
[null,null,null,5,{"$error":"#REF!"},{"$f":"_xlfn.SINGLE(IF(G15=0,\"\",INDEX('دور ثانى'!#REF!,$D15,2)))","v":{"$error":"#REF!"}},{"$f":"_xlfn.SINGLE(INDEX('دور ثانى'!#REF!,$D15,3))","v":{"$error":"#REF!"}},{"$f":"_xlfn.SINGLE(IF(G15=0,\"\",INDEX('دور ثانى'!#REF!,$D15,43)))","v":{"$error":"#REF!"}}]
[null,null,null,6,{"$error":"#REF!"},{"$f":"_xlfn.SINGLE(IF(G16=0,\"\",INDEX('دور ثانى'!#REF!,$D16,2)))","v":{"$error":"#REF!"}},{"$f":"_xlfn.SINGLE(INDEX('دور ثانى'!#REF!,$D16,3))","v":{"$error":"#REF!"}},{"$f":"_xlfn.SINGLE(IF(G16=0,\"\",INDEX('دور ثانى'!#REF!,$D16,43)))","v":{"$error":"#REF!"}}]
[null,null,null,7,{"$error":"#REF!"},{"$f":"_xlfn.SINGLE(IF(G17=0,\"\",INDEX('دور ثانى'!#REF!,$D17,2)))","v":{"$error":"#REF!"}},{"$f":"_xlfn.SINGLE(INDEX('دور ثانى'!#REF!,$D17,3))","v":{"$error":"#REF!"}},{"$f":"_xlfn.SINGLE(IF(G17=0,\"\",INDEX('دور ثانى'!#REF!,$D17,43)))","v":{"$error":"#REF!"}}]
[null,null,null,8,{"$error":"#REF!"},{"$f":"_xlfn.SINGLE(IF(G18=0,\"\",INDEX('دور ثانى'!#REF!,$D18,2)))","v":{"$error":"#REF!"}},{"$f":"_xlfn.SINGLE(INDEX('دور ثانى'!#REF!,$D18,3))","v":{"$error":"#REF!"}},{"$f":"_xlfn.SINGLE(IF(G18=0,\"\",INDEX('دور ثانى'!#REF!,$D18,43)))","v":{"$error":"#REF!"}}]
[null,null,null,9,{"$error":"#REF!"},{"$f":"_xlfn.SINGLE(IF(G19=0,\"\",INDEX('دور ثانى'!#REF!,$D19,2)))","v":{"$error":"#REF!"}},{"$f":"_xlfn.SINGLE(INDEX('دور ثانى'!#REF!,$D19,3))","v":{"$error":"#REF!"}},{"$f":"_xlfn.SINGLE(IF(G19=0,\"\",INDEX('دور ثانى'!#REF!,$D19,43)))","v":{"$error":"#REF!"}}]
[null,null,null,10,{"$error":"#REF!"},{"$f":"_xlfn.SINGLE(IF(G20=0,\"\",INDEX('دور ثانى'!#REF!,$D20,2)))","v":{"$error":"#REF!"}},{"$f":"_xlfn.SINGLE(INDEX('دور ثانى'!#REF!,$D20,3))","v":{"$error":"#REF!"}},{"$f":"_xlfn.SINGLE(IF(G20=0,\"\",INDEX('دور ثانى'!#REF!,$D20,43)))","v":{"$error":"#REF!"}}]
[null,null,null,11,{"$error":"#REF!"},{"$f":"_xlfn.SINGLE(IF(G21=0,\"\",INDEX('دور ثانى'!#REF!,$D21,2)))","v":{"$error":"#REF!"}},{"$f":"_xlfn.SINGLE(INDEX('دور ثانى'!#REF!,$D21,3))","v":{"$error":"#REF!"}},{"$f":"_xlfn.SINGLE(IF(G21=0,\"\",INDEX('دور ثانى'!#REF!,$D21,43)))","v":{"$error":"#REF!"}}]
[null,null,null,12,{"$error":"#REF!"},{"$f":"_xlfn.SINGLE(IF(G22=0,\"\",INDEX('دور ثانى'!#REF!,$D22,2)))","v":{"$error":"#REF!"}},{"$f":"_xlfn.SINGLE(INDEX('دور ثانى'!#REF!,$D22,3))","v":{"$error":"#REF!"}},{"$f":"_xlfn.SINGLE(IF(G22=0,\"\",INDEX('دور ثانى'!#REF!,$D22,43)))","v":{"$error":"#REF!"}}]
[null,null,null,13,{"$error":"#REF!"},{"$f":"_xlfn.SINGLE(IF(G23=0,\"\",INDEX('دور ثانى'!#REF!,$D23,2)))","v":{"$error":"#REF!"}},{"$f":"_xlfn.SINGLE(INDEX('دور ثانى'!#REF!,$D23,3))","v":{"$error":"#REF!"}},{"$f":"_xlfn.SINGLE(IF(G23=0,\"\",INDEX('دور ثانى'!#REF!,$D23,43)))","v":{"$error":"#REF!"}}]
[null,null,null,14,{"$error":"#REF!"},{"$f":"_xlfn.SINGLE(IF(G24=0,\"\",INDEX('دور ثانى'!#REF!,$D24,2)))","v":{"$error":"#REF!"}},{"$f":"_xlfn.SINGLE(INDEX('دور ثانى'!#REF!,$D24,3))","v":{"$error":"#REF!"}},{"$f":"_xlfn.SINGLE(IF(G24=0,\"\",INDEX('دور ثانى'!#REF!,$D24,43)))","v":{"$error":"#REF!"}}]
[null,null,null,15,{"$error":"#REF!"},{"$f":"_xlfn.SINGLE(IF(G25=0,\"\",INDEX('دور ثانى'!#REF!,$D25,2)))","v":{"$error":"#REF!"}},{"$f":"_xlfn.SINGLE(INDEX('دور ثانى'!#REF!,$D25,3))","v":{"$error":"#REF!"}},{"$f":"_xlfn.SINGLE(IF(G25=0,\"\",INDEX('دور ثانى'!#REF!,$D25,43)))","v":{"$error":"#REF!"}}]
[null,null,null,16,{"$error":"#REF!"},{"$f":"_xlfn.SINGLE(IF(G26=0,\"\",INDEX('دور ثانى'!#REF!,$D26,2)))","v":{"$error":"#REF!"}},{"$f":"_xlfn.SINGLE(INDEX('دور ثانى'!#REF!,$D26,3))","v":{"$error":"#REF!"}},{"$f":"_xlfn.SINGLE(IF(G26=0,\"\",INDEX('دور ثانى'!#REF!,$D26,43)))","v":{"$error":"#REF!"}}]
[null,null,null,17,{"$error":"#REF!"},{"$f":"_xlfn.SINGLE(IF(G27=0,\"\",INDEX('دور ثانى'!#REF!,$D27,2)))","v":{"$error":"#REF!"}},{"$f":"_xlfn.SINGLE(INDEX('دور ثانى'!#REF!,$D27,3))","v":{"$error":"#REF!"}},{"$f":"_xlfn.SINGLE(IF(G27=0,\"\",INDEX('دور ثانى'!#REF!,$D27,43)))","v":{"$error":"#REF!"}}]
[null,null,null,18,{"$error":"#REF!"},{"$f":"_xlfn.SINGLE(IF(G28=0,\"\",INDEX('دور ثانى'!#REF!,$D28,2)))","v":{"$error":"#REF!"}},{"$f":"_xlfn.SINGLE(INDEX('دور ثانى'!#REF!,$D28,3))","v":{"$error":"#REF!"}},{"$f":"_xlfn.SINGLE(IF(G28=0,\"\",INDEX('دور ثانى'!#REF!,$D28,43)))","v":{"$error":"#REF!"}}]
[null,null,null,19,{"$error":"#REF!"},{"$f":"_xlfn.SINGLE(IF(G29=0,\"\",INDEX('دور ثانى'!#REF!,$D29,2)))","v":{"$error":"#REF!"}},{"$f":"_xlfn.SINGLE(INDEX('دور ثانى'!#REF!,$D29,3))","v":{"$error":"#REF!"}},{"$f":"_xlfn.SINGLE(IF(G29=0,\"\",INDEX('دور ثانى'!#REF!,$D29,43)))","v":{"$error":"#REF!"}}]
[null,null,null,20,{"$error":"#REF!"},{"$f":"_xlfn.SINGLE(IF(G30=0,\"\",INDEX('دور ثانى'!#REF!,$D30,2)))","v":{"$error":"#REF!"}},{"$f":"_xlfn.SINGLE(INDEX('دور ثانى'!#REF!,$D30,3))","v":{"$error":"#REF!"}},{"$f":"_xlfn.SINGLE(IF(G30=0,\"\",INDEX('دور ثانى'!#REF!,$D30,43)))","v":{"$error":"#REF!"}}]
[null,null,null,21,{"$error":"#REF!"},{"$f":"_xlfn.SINGLE(IF(G31=0,\"\",INDEX('دور ثانى'!#REF!,$D31,2)))","v":{"$error":"#REF!"}},{"$f":"_xlfn.SINGLE(INDEX('دور ثانى'!#REF!,$D31,3))","v":{"$error":"#REF!"}},{"$f":"_xlfn.SINGLE(IF(G31=0,\"\",INDEX('دور ثانى'!#REF!,$D31,43)))","v":{"$error":"#REF!"}}]
[null,null,null,22,{"$error":"#REF!"},{"$f":"_xlfn.SINGLE(IF(G32=0,\"\",INDEX('دور ثانى'!#REF!,$D32,2)))","v":{"$error":"#REF!"}},{"$f":"_xlfn.SINGLE(INDEX('دور ثانى'!#REF!,$D32,3))","v":{"$error":"#REF!"}},{"$f":"_xlfn.SINGLE(IF(G32=0,\"\",INDEX('دور ثانى'!#REF!,$D32,43)))","v":{"$error":"#REF!"}}]
[null,null,null,null,"رئيس الكنترول",null,null,"شيخ المعهد"]
[null,null,null,null,{"$f":"#REF!","v":{"$error":"#REF!"}},null,null,{"$f":"#REF!","v":{"$error":"#REF!"}}]

{"sheet":"الغائبين عن الاختبار","index":5,"n_rows":34,"n_cols":25,"rows_kept":34,"cut":false,"hidden":false,"merged":[[34,2,34,3],[34,6,34,7],[35,6,35,7],[34,12,34,14],[34,17,34,18],[35,17,35,18],[1,2,1,3],[1,12,1,13],[4,2,4,4],[4,5,4,7],[4,12,4,15],[4,16,4,18],[5,2,5,4],[5,5,5,7],[5,12,5,14],[12,5,12,6],[12,14,12,15],[12,16,12,17],[9,5,9,6],[9,14,9,15],[9,16,9,17],[10,5,10,6],[10,14,10,15],[18,5,18,6],[18,14,18,15],[18,16,18,17],[19,5,19,6],[9,24,33,25],[8,14,8,15],[5,22,5,23],[5,24,5,25],[7,1,8,1],[7,2,8,2],[7,3,8,3],[7,5,8,6],[7,7,8,7],[7,11,8,11],[7,12,8,12],[7,13,8,13],[7,14,7,15],[7,16,8,17],[7,18,8,18],[7,21,8,21],[7,23,8,23],[7,24,8,25],[5,15,5,18],[15,5,15,6],[15,14,15,15],[15,16,15,17],[16,5,16,6],[16,14,16,15],[16,16,16,17],[17,5,17,6],[17,14,17,15],[17,16,17,17],[11,5,11,6],[11,14,11,15],[11,16,11,17],[13,5,13,6],[13,14,13,15],[13,16,13,17],[14,5,14,6],[14,14,14,15],[14,16,14,17],[19,14,19,15],[19,16,19,17],[20,5,20,6],[20,14,20,15],[20,16,20,17],[21,5,21,6],[21,14,21,15],[21,16,21,17],[22,5,22,6],[22,14,22,15],[22,16,22,17],[28,5,28,6],[28,14,28,15],[28,16,28,17],[29,5,29,6],[29,14,29,15],[29,16,29,17],[23,5,23,6],[23,14,23,15],[23,16,23,17],[24,5,24,6],[24,14,24,15],[24,16,24,17],[25,5,25,6],[25,14,25,15],[25,16,25,17],[35,21,35,22],[43,16,43,17],[34,21,34,22],[10,16,10,17],[4,22,4,24],[7,22,8,22],[26,5,26,6],[26,14,26,15],[26,16,26,17],[27,5,27,6],[27,14,27,15],[27,16,27,17],[33,5,33,6],[33,14,33,15],[33,16,33,17],[30,5,30,6],[30,14,30,15],[30,16,30,17],[31,5,31,6],[31,14,31,15],[31,16,31,17],[32,5,32,6],[32,14,32,15],[32,16,32,17]]}
[]
[]
[]
[]
[]
[null,null,"مادة",null,null,"الرياضيات",null,null,null,null,null,null,"مادة",null,null,"الدراسات الاجتماعية",null,null,null,null,null,null,"مادة",null,"الحوسبة وتكنولوجيا المعلومات"]
[]
[null,"م","رقم الجلوس","اسم الطالب","الدرجة","الدرجـــــــة بالحروف",null,"ملاحظــــات",null,null,null,"م","رقم الجلوس","اســــم التلميذ ولقبه","الدرجــــــــة بالأرقام",null,"الدرجـــــــة بالحروف",null,"ملاحظــــات",null,null,"م","رقم الجلوس","اســــم التلميذ ولقبه","ملاحظــــــــــات"]
[null,null,null,null,30,null,null,null,null,null,null,null,null,null,50]
[null,{"$f":"IF(ROW($B1)<=COUNTIF(شيت!$D$11:$D$60,\"غ\"),ROW($B1),\"\")","v":""},{"$f":"IF($B10=\"\",\"\",INDEX(شيت!A$11:A$60,SMALL(IF(شيت!$D$11:$D$60=\"غ\",ROW($13:$62)-13),$B10)))","v":""},{"$f":"IF($B10=\"\",\"\",INDEX(شيت!B$11:B$60,SMALL(IF(شيت!$D$11:$D$60=\"غ\",ROW($13:$62)-13),$B10)))","v":""},null,null,null,null,null,null,null,{"$f":"IF(ROW($L1)<=COUNTIF(شيت!$K$11:$K$60,\"غ\"),ROW($L1),\"\")","v":""},{"$f":"IF($L10=\"\",\"\",INDEX(شيت!A$11:A$60,SMALL(IF(شيت!$K$11:$K$60=\"غ\",ROW($13:$62)-13),$L10)))","v":""},{"$f":"IF($L10=\"\",\"\",INDEX(شيت!B$11:B$60,SMALL(IF(شيت!$K$11:$K$60=\"غ\",ROW($13:$62)-13),$L10)))","v":""},null,null,null,null,null,null,null,{"$f":"IF(ROW($V1)<=COUNTIF(شيت!$E$11:$E$60,\"غ\"),ROW($V1),\"\")","v":""},{"$f":"IF($V10=\"\",\"\",INDEX(شيت!A$11:A$60,SMALL(IF(شيت!$E$11:$E$60=\"غ\",ROW($13:$62)-13),$V10)))","v":""},{"$f":"IF($V10=\"\",\"\",INDEX(شيت!B$11:B$60,SMALL(IF(شيت!$E$11:$E$60=\"غ\",ROW($13:$62)-13),$V10)))","v":""}]
[null,{"$f":"IF(ROW($B2)<=COUNTIF(شيت!$D$11:$D$60,\"غ\"),ROW($B2),\"\")","v":""},{"$f":"IF($B11=\"\",\"\",INDEX(شيت!A$11:A$60,SMALL(IF(شيت!$D$11:$D$60=\"غ\",ROW($13:$62)-13),$B11)))","v":""},{"$f":"IF($B11=\"\",\"\",INDEX(شيت!B$11:B$60,SMALL(IF(شيت!$D$11:$D$60=\"غ\",ROW($13:$62)-13),$B11)))","v":""},null,null,null,null,null,null,null,{"$f":"IF(ROW($L2)<=COUNTIF(شيت!$K$11:$K$60,\"غ\"),ROW($L2),\"\")","v":""},{"$f":"IF($L11=\"\",\"\",INDEX(شيت!A$11:A$60,SMALL(IF(شيت!$K$11:$K$60=\"غ\",ROW($13:$62)-13),$L11)))","v":""},{"$f":"IF($L11=\"\",\"\",INDEX(شيت!B$11:B$60,SMALL(IF(شيت!$K$11:$K$60=\"غ\",ROW($13:$62)-13),$L11)))","v":""},null,null,null,null,null,null,null,{"$f":"IF(ROW($V2)<=COUNTIF(شيت!$E$11:$E$60,\"غ\"),ROW($V2),\"\")","v":""},{"$f":"IF($V11=\"\",\"\",INDEX(شيت!A$11:A$60,SMALL(IF(شيت!$E$11:$E$60=\"غ\",ROW($13:$62)-13),$V11)))","v":""},{"$f":"IF($V11=\"\",\"\",INDEX(شيت!B$11:B$60,SMALL(IF(شيت!$E$11:$E$60=\"غ\",ROW($13:$62)-13),$V11)))","v":""}]
[null,{"$f":"IF(ROW($B3)<=COUNTIF(شيت!$D$11:$D$60,\"غ\"),ROW($B3),\"\")","v":""},{"$f":"IF($B12=\"\",\"\",INDEX(شيت!A$11:A$60,SMALL(IF(شيت!$D$11:$D$60=\"غ\",ROW($13:$62)-13),$B12)))","v":""},{"$f":"IF($B12=\"\",\"\",INDEX(شيت!B$11:B$60,SMALL(IF(شيت!$D$11:$D$60=\"غ\",ROW($13:$62)-13),$B12)))","v":""},null,null,null,null,null,null,null,{"$f":"IF(ROW($L3)<=COUNTIF(شيت!$K$11:$K$60,\"غ\"),ROW($L3),\"\")","v":""},{"$f":"IF($L12=\"\",\"\",INDEX(شيت!A$11:A$60,SMALL(IF(شيت!$K$11:$K$60=\"غ\",ROW($13:$62)-13),$L12)))","v":""},{"$f":"IF($L12=\"\",\"\",INDEX(شيت!B$11:B$60,SMALL(IF(شيت!$K$11:$K$60=\"غ\",ROW($13:$62)-13),$L12)))","v":""},null,null,null,null,null,null,null,{"$f":"IF(ROW($V3)<=COUNTIF(شيت!$E$11:$E$60,\"غ\"),ROW($V3),\"\")","v":""},{"$f":"IF($V12=\"\",\"\",INDEX(شيت!A$11:A$60,SMALL(IF(شيت!$E$11:$E$60=\"غ\",ROW($13:$62)-13),$V12)))","v":""},{"$f":"IF($V12=\"\",\"\",INDEX(شيت!B$11:B$60,SMALL(IF(شيت!$E$11:$E$60=\"غ\",ROW($13:$62)-13),$V12)))","v":""}]
[null,{"$f":"IF(ROW($B4)<=COUNTIF(شيت!$D$11:$D$60,\"غ\"),ROW($B4),\"\")","v":""},{"$f":"IF($B13=\"\",\"\",INDEX(شيت!A$11:A$60,SMALL(IF(شيت!$D$11:$D$60=\"غ\",ROW($13:$62)-13),$B13)))","v":""},{"$f":"IF($B13=\"\",\"\",INDEX(شيت!B$11:B$60,SMALL(IF(شيت!$D$11:$D$60=\"غ\",ROW($13:$62)-13),$B13)))","v":""},null,null,null,null,null,null,null,{"$f":"IF(ROW($L4)<=COUNTIF(شيت!$K$11:$K$60,\"غ\"),ROW($L4),\"\")","v":""},{"$f":"IF($L13=\"\",\"\",INDEX(شيت!A$11:A$60,SMALL(IF(شيت!$K$11:$K$60=\"غ\",ROW($13:$62)-13),$L13)))","v":""},{"$f":"IF($L13=\"\",\"\",INDEX(شيت!B$11:B$60,SMALL(IF(شيت!$K$11:$K$60=\"غ\",ROW($13:$62)-13),$L13)))","v":""},null,null,null,null,null,null,null,{"$f":"IF(ROW($V4)<=COUNTIF(شيت!$E$11:$E$60,\"غ\"),ROW($V4),\"\")","v":""},{"$f":"IF($V13=\"\",\"\",INDEX(شيت!A$11:A$60,SMALL(IF(شيت!$E$11:$E$60=\"غ\",ROW($13:$62)-13),$V13)))","v":""},{"$f":"IF($V13=\"\",\"\",INDEX(شيت!B$11:B$60,SMALL(IF(شيت!$E$11:$E$60=\"غ\",ROW($13:$62)-13),$V13)))","v":""}]
[null,{"$f":"IF(ROW($B5)<=COUNTIF(شيت!$D$11:$D$60,\"غ\"),ROW($B5),\"\")","v":""},{"$f":"IF($B14=\"\",\"\",INDEX(شيت!A$11:A$60,SMALL(IF(شيت!$D$11:$D$60=\"غ\",ROW($13:$62)-13),$B14)))","v":""},{"$f":"IF($B14=\"\",\"\",INDEX(شيت!B$11:B$60,SMALL(IF(شيت!$D$11:$D$60=\"غ\",ROW($13:$62)-13),$B14)))","v":""},null,null,null,null,null,null,null,{"$f":"IF(ROW($L5)<=COUNTIF(شيت!$K$11:$K$60,\"غ\"),ROW($L5),\"\")","v":""},{"$f":"IF($L14=\"\",\"\",INDEX(شيت!A$11:A$60,SMALL(IF(شيت!$K$11:$K$60=\"غ\",ROW($13:$62)-13),$L14)))","v":""},{"$f":"IF($L14=\"\",\"\",INDEX(شيت!B$11:B$60,SMALL(IF(شيت!$K$11:$K$60=\"غ\",ROW($13:$62)-13),$L14)))","v":""},null,null,null,null,null,null,null,{"$f":"IF(ROW($V5)<=COUNTIF(شيت!$E$11:$E$60,\"غ\"),ROW($V5),\"\")","v":""},{"$f":"IF($V14=\"\",\"\",INDEX(شيت!A$11:A$60,SMALL(IF(شيت!$E$11:$E$60=\"غ\",ROW($13:$62)-13),$V14)))","v":""},{"$f":"IF($V14=\"\",\"\",INDEX(شيت!B$11:B$60,SMALL(IF(شيت!$E$11:$E$60=\"غ\",ROW($13:$62)-13),$V14)))","v":""}]
[null,{"$f":"IF(ROW($B6)<=COUNTIF(شيت!$D$11:$D$60,\"غ\"),ROW($B6),\"\")","v":""},{"$f":"IF($B15=\"\",\"\",INDEX(شيت!A$11:A$60,SMALL(IF(شيت!$D$11:$D$60=\"غ\",ROW($13:$62)-13),$B15)))","v":""},{"$f":"IF($B15=\"\",\"\",INDEX(شيت!B$11:B$60,SMALL(IF(شيت!$D$11:$D$60=\"غ\",ROW($13:$62)-13),$B15)))","v":""},null,null,null,null,null,null,null,{"$f":"IF(ROW($L6)<=COUNTIF(شيت!$K$11:$K$60,\"غ\"),ROW($L6),\"\")","v":""},{"$f":"IF($L15=\"\",\"\",INDEX(شيت!A$11:A$60,SMALL(IF(شيت!$K$11:$K$60=\"غ\",ROW($13:$62)-13),$L15)))","v":""},{"$f":"IF($L15=\"\",\"\",INDEX(شيت!B$11:B$60,SMALL(IF(شيت!$K$11:$K$60=\"غ\",ROW($13:$62)-13),$L15)))","v":""},null,null,null,null,null,null,null,{"$f":"IF(ROW($V6)<=COUNTIF(شيت!$E$11:$E$60,\"غ\"),ROW($V6),\"\")","v":""},{"$f":"IF($V15=\"\",\"\",INDEX(شيت!A$11:A$60,SMALL(IF(شيت!$E$11:$E$60=\"غ\",ROW($13:$62)-13),$V15)))","v":""},{"$f":"IF($V15=\"\",\"\",INDEX(شيت!B$11:B$60,SMALL(IF(شيت!$E$11:$E$60=\"غ\",ROW($13:$62)-13),$V15)))","v":""}]
[null,{"$f":"IF(ROW($B7)<=COUNTIF(شيت!$D$11:$D$60,\"غ\"),ROW($B7),\"\")","v":""},{"$f":"IF($B16=\"\",\"\",INDEX(شيت!A$11:A$60,SMALL(IF(شيت!$D$11:$D$60=\"غ\",ROW($13:$62)-13),$B16)))","v":""},{"$f":"IF($B16=\"\",\"\",INDEX(شيت!B$11:B$60,SMALL(IF(شيت!$D$11:$D$60=\"غ\",ROW($13:$62)-13),$B16)))","v":""},null,null,null,null,null,null,null,{"$f":"IF(ROW($L7)<=COUNTIF(شيت!$K$11:$K$60,\"غ\"),ROW($L7),\"\")","v":""},{"$f":"IF($L16=\"\",\"\",INDEX(شيت!A$11:A$60,SMALL(IF(شيت!$K$11:$K$60=\"غ\",ROW($13:$62)-13),$L16)))","v":""},{"$f":"IF($L16=\"\",\"\",INDEX(شيت!B$11:B$60,SMALL(IF(شيت!$K$11:$K$60=\"غ\",ROW($13:$62)-13),$L16)))","v":""},null,null,null,null,null,null,null,{"$f":"IF(ROW($V7)<=COUNTIF(شيت!$E$11:$E$60,\"غ\"),ROW($V7),\"\")","v":""},{"$f":"IF($V16=\"\",\"\",INDEX(شيت!A$11:A$60,SMALL(IF(شيت!$E$11:$E$60=\"غ\",ROW($13:$62)-13),$V16)))","v":""},{"$f":"IF($V16=\"\",\"\",INDEX(شيت!B$11:B$60,SMALL(IF(شيت!$E$11:$E$60=\"غ\",ROW($13:$62)-13),$V16)))","v":""}]
[null,{"$f":"IF(ROW($B8)<=COUNTIF(شيت!$D$11:$D$60,\"غ\"),ROW($B8),\"\")","v":""},{"$f":"IF($B17=\"\",\"\",INDEX(شيت!A$11:A$60,SMALL(IF(شيت!$D$11:$D$60=\"غ\",ROW($13:$62)-13),$B17)))","v":""},{"$f":"IF($B17=\"\",\"\",INDEX(شيت!B$11:B$60,SMALL(IF(شيت!$D$11:$D$60=\"غ\",ROW($13:$62)-13),$B17)))","v":""},null,null,null,null,null,null,null,{"$f":"IF(ROW($L8)<=COUNTIF(شيت!$K$11:$K$60,\"غ\"),ROW($L8),\"\")","v":""},{"$f":"IF($L17=\"\",\"\",INDEX(شيت!A$11:A$60,SMALL(IF(شيت!$K$11:$K$60=\"غ\",ROW($13:$62)-13),$L17)))","v":""},{"$f":"IF($L17=\"\",\"\",INDEX(شيت!B$11:B$60,SMALL(IF(شيت!$K$11:$K$60=\"غ\",ROW($13:$62)-13),$L17)))","v":""},null,null,null,null,null,null,null,{"$f":"IF(ROW($V8)<=COUNTIF(شيت!$E$11:$E$60,\"غ\"),ROW($V8),\"\")","v":""},{"$f":"IF($V17=\"\",\"\",INDEX(شيت!A$11:A$60,SMALL(IF(شيت!$E$11:$E$60=\"غ\",ROW($13:$62)-13),$V17)))","v":""},{"$f":"IF($V17=\"\",\"\",INDEX(شيت!B$11:B$60,SMALL(IF(شيت!$E$11:$E$60=\"غ\",ROW($13:$62)-13),$V17)))","v":""}]
[null,{"$f":"IF(ROW($B9)<=COUNTIF(شيت!$D$11:$D$60,\"غ\"),ROW($B9),\"\")","v":""},{"$f":"IF($B18=\"\",\"\",INDEX(شيت!A$11:A$60,SMALL(IF(شيت!$D$11:$D$60=\"غ\",ROW($13:$62)-13),$B18)))","v":""},{"$f":"IF($B18=\"\",\"\",INDEX(شيت!B$11:B$60,SMALL(IF(شيت!$D$11:$D$60=\"غ\",ROW($13:$62)-13),$B18)))","v":""},null,null,null,null,null,null,null,{"$f":"IF(ROW($L9)<=COUNTIF(شيت!$K$11:$K$60,\"غ\"),ROW($L9),\"\")","v":""},{"$f":"IF($L18=\"\",\"\",INDEX(شيت!A$11:A$60,SMALL(IF(شيت!$K$11:$K$60=\"غ\",ROW($13:$62)-13),$L18)))","v":""},{"$f":"IF($L18=\"\",\"\",INDEX(شيت!B$11:B$60,SMALL(IF(شيت!$K$11:$K$60=\"غ\",ROW($13:$62)-13),$L18)))","v":""},null,null,null,null,null,null,null,{"$f":"IF(ROW($V9)<=COUNTIF(شيت!$E$11:$E$60,\"غ\"),ROW($V9),\"\")","v":""},{"$f":"IF($V18=\"\",\"\",INDEX(شيت!A$11:A$60,SMALL(IF(شيت!$E$11:$E$60=\"غ\",ROW($13:$62)-13),$V18)))","v":""},{"$f":"IF($V18=\"\",\"\",INDEX(شيت!B$11:B$60,SMALL(IF(شيت!$E$11:$E$60=\"غ\",ROW($13:$62)-13),$V18)))","v":""}]
[null,{"$f":"IF(ROW($B10)<=COUNTIF(شيت!$D$11:$D$60,\"غ\"),ROW($B10),\"\")","v":""},{"$f":"IF($B19=\"\",\"\",INDEX(شيت!A$11:A$60,SMALL(IF(شيت!$D$11:$D$60=\"غ\",ROW($13:$62)-13),$B19)))","v":""},{"$f":"IF($B19=\"\",\"\",INDEX(شيت!B$11:B$60,SMALL(IF(شيت!$D$11:$D$60=\"غ\",ROW($13:$62)-13),$B19)))","v":""},null,null,null,null,null,null,null,{"$f":"IF(ROW($L10)<=COUNTIF(شيت!$K$11:$K$60,\"غ\"),ROW($L10),\"\")","v":""},{"$f":"IF($L19=\"\",\"\",INDEX(شيت!A$11:A$60,SMALL(IF(شيت!$K$11:$K$60=\"غ\",ROW($13:$62)-13),$L19)))","v":""},{"$f":"IF($L19=\"\",\"\",INDEX(شيت!B$11:B$60,SMALL(IF(شيت!$K$11:$K$60=\"غ\",ROW($13:$62)-13),$L19)))","v":""},null,null,null,null,null,null,null,{"$f":"IF(ROW($V10)<=COUNTIF(شيت!$E$11:$E$60,\"غ\"),ROW($V10),\"\")","v":""},{"$f":"IF($V19=\"\",\"\",INDEX(شيت!A$11:A$60,SMALL(IF(شيت!$E$11:$E$60=\"غ\",ROW($13:$62)-13),$V19)))","v":""},{"$f":"IF($V19=\"\",\"\",INDEX(شيت!B$11:B$60,SMALL(IF(شيت!$E$11:$E$60=\"غ\",ROW($13:$62)-13),$V19)))","v":""}]
[null,{"$f":"IF(ROW($B11)<=COUNTIF(شيت!$D$11:$D$60,\"غ\"),ROW($B11),\"\")","v":""},{"$f":"IF($B20=\"\",\"\",INDEX(شيت!A$11:A$60,SMALL(IF(شيت!$D$11:$D$60=\"غ\",ROW($13:$62)-13),$B20)))","v":""},{"$f":"IF($B20=\"\",\"\",INDEX(شيت!B$11:B$60,SMALL(IF(شيت!$D$11:$D$60=\"غ\",ROW($13:$62)-13),$B20)))","v":""},null,null,null,null,null,null,null,{"$f":"IF(ROW($L11)<=COUNTIF(شيت!$K$11:$K$60,\"غ\"),ROW($L11),\"\")","v":""},{"$f":"IF($L20=\"\",\"\",INDEX(شيت!A$11:A$60,SMALL(IF(شيت!$K$11:$K$60=\"غ\",ROW($13:$62)-13),$L20)))","v":""},{"$f":"IF($L20=\"\",\"\",INDEX(شيت!B$11:B$60,SMALL(IF(شيت!$K$11:$K$60=\"غ\",ROW($13:$62)-13),$L20)))","v":""},null,null,null,null,null,null,null,{"$f":"IF(ROW($V11)<=COUNTIF(شيت!$E$11:$E$60,\"غ\"),ROW($V11),\"\")","v":""},{"$f":"IF($V20=\"\",\"\",INDEX(شيت!A$11:A$60,SMALL(IF(شيت!$E$11:$E$60=\"غ\",ROW($13:$62)-13),$V20)))","v":""},{"$f":"IF($V20=\"\",\"\",INDEX(شيت!B$11:B$60,SMALL(IF(شيت!$E$11:$E$60=\"غ\",ROW($13:$62)-13),$V20)))","v":""}]
[null,{"$f":"IF(ROW($B12)<=COUNTIF(شيت!$D$11:$D$60,\"غ\"),ROW($B12),\"\")","v":""},{"$f":"IF($B21=\"\",\"\",INDEX(شيت!A$11:A$60,SMALL(IF(شيت!$D$11:$D$60=\"غ\",ROW($13:$62)-13),$B21)))","v":""},{"$f":"IF($B21=\"\",\"\",INDEX(شيت!B$11:B$60,SMALL(IF(شيت!$D$11:$D$60=\"غ\",ROW($13:$62)-13),$B21)))","v":""},null,null,null,null,null,null,null,{"$f":"IF(ROW($L12)<=COUNTIF(شيت!$K$11:$K$60,\"غ\"),ROW($L12),\"\")","v":""},{"$f":"IF($L21=\"\",\"\",INDEX(شيت!A$11:A$60,SMALL(IF(شيت!$K$11:$K$60=\"غ\",ROW($13:$62)-13),$L21)))","v":""},{"$f":"IF($L21=\"\",\"\",INDEX(شيت!B$11:B$60,SMALL(IF(شيت!$K$11:$K$60=\"غ\",ROW($13:$62)-13),$L21)))","v":""},null,null,null,null,null,null,null,{"$f":"IF(ROW($V12)<=COUNTIF(شيت!$E$11:$E$60,\"غ\"),ROW($V12),\"\")","v":""},{"$f":"IF($V21=\"\",\"\",INDEX(شيت!A$11:A$60,SMALL(IF(شيت!$E$11:$E$60=\"غ\",ROW($13:$62)-13),$V21)))","v":""},{"$f":"IF($V21=\"\",\"\",INDEX(شيت!B$11:B$60,SMALL(IF(شيت!$E$11:$E$60=\"غ\",ROW($13:$62)-13),$V21)))","v":""}]
[null,{"$f":"IF(ROW($B13)<=COUNTIF(شيت!$D$11:$D$60,\"غ\"),ROW($B13),\"\")","v":""},{"$f":"IF($B22=\"\",\"\",INDEX(شيت!A$11:A$60,SMALL(IF(شيت!$D$11:$D$60=\"غ\",ROW($13:$62)-13),$B22)))","v":""},{"$f":"IF($B22=\"\",\"\",INDEX(شيت!B$11:B$60,SMALL(IF(شيت!$D$11:$D$60=\"غ\",ROW($13:$62)-13),$B22)))","v":""},null,null,null,null,null,null,null,{"$f":"IF(ROW($L13)<=COUNTIF(شيت!$K$11:$K$60,\"غ\"),ROW($L13),\"\")","v":""},{"$f":"IF($L22=\"\",\"\",INDEX(شيت!A$11:A$60,SMALL(IF(شيت!$K$11:$K$60=\"غ\",ROW($13:$62)-13),$L22)))","v":""},{"$f":"IF($L22=\"\",\"\",INDEX(شيت!B$11:B$60,SMALL(IF(شيت!$K$11:$K$60=\"غ\",ROW($13:$62)-13),$L22)))","v":""},null,null,null,null,null,null,null,{"$f":"IF(ROW($V13)<=COUNTIF(شيت!$E$11:$E$60,\"غ\"),ROW($V13),\"\")","v":""},{"$f":"IF($V22=\"\",\"\",INDEX(شيت!A$11:A$60,SMALL(IF(شيت!$E$11:$E$60=\"غ\",ROW($13:$62)-13),$V22)))","v":""},{"$f":"IF($V22=\"\",\"\",INDEX(شيت!B$11:B$60,SMALL(IF(شيت!$E$11:$E$60=\"غ\",ROW($13:$62)-13),$V22)))","v":""}]
[null,{"$f":"IF(ROW($B14)<=COUNTIF(شيت!$D$11:$D$60,\"غ\"),ROW($B14),\"\")","v":""},{"$f":"IF($B23=\"\",\"\",INDEX(شيت!A$11:A$60,SMALL(IF(شيت!$D$11:$D$60=\"غ\",ROW($13:$62)-13),$B23)))","v":""},{"$f":"IF($B23=\"\",\"\",INDEX(شيت!B$11:B$60,SMALL(IF(شيت!$D$11:$D$60=\"غ\",ROW($13:$62)-13),$B23)))","v":""},null,null,null,null,null,null,null,{"$f":"IF(ROW($L14)<=COUNTIF(شيت!$K$11:$K$60,\"غ\"),ROW($L14),\"\")","v":""},{"$f":"IF($L23=\"\",\"\",INDEX(شيت!A$11:A$60,SMALL(IF(شيت!$K$11:$K$60=\"غ\",ROW($13:$62)-13),$L23)))","v":""},{"$f":"IF($L23=\"\",\"\",INDEX(شيت!B$11:B$60,SMALL(IF(شيت!$K$11:$K$60=\"غ\",ROW($13:$62)-13),$L23)))","v":""},null,null,null,null,null,null,null,{"$f":"IF(ROW($V13)<=COUNTIF(شيت!$E$11:$E$60,\"غ\"),ROW($V13),\"\")","v":""},{"$f":"IF($V23=\"\",\"\",INDEX(شيت!A$11:A$60,SMALL(IF(شيت!$E$11:$E$60=\"غ\",ROW($13:$62)-13),$V23)))","v":""},{"$f":"IF($V23=\"\",\"\",INDEX(شيت!B$11:B$60,SMALL(IF(شيت!$E$11:$E$60=\"غ\",ROW($13:$62)-13),$V23)))","v":""}]
[null,{"$f":"IF(ROW($B15)<=COUNTIF(شيت!$D$11:$D$60,\"غ\"),ROW($B15),\"\")","v":""},{"$f":"IF($B24=\"\",\"\",INDEX(شيت!A$11:A$60,SMALL(IF(شيت!$D$11:$D$60=\"غ\",ROW($13:$62)-13),$B24)))","v":""},{"$f":"IF($B24=\"\",\"\",INDEX(شيت!B$11:B$60,SMALL(IF(شيت!$D$11:$D$60=\"غ\",ROW($13:$62)-13),$B24)))","v":""},null,null,null,null,null,null,null,{"$f":"IF(ROW($L15)<=COUNTIF(شيت!$K$11:$K$60,\"غ\"),ROW($L15),\"\")","v":""},{"$f":"IF($L24=\"\",\"\",INDEX(شيت!A$11:A$60,SMALL(IF(شيت!$K$11:$K$60=\"غ\",ROW($13:$62)-13),$L24)))","v":""},{"$f":"IF($L24=\"\",\"\",INDEX(شيت!B$11:B$60,SMALL(IF(شيت!$K$11:$K$60=\"غ\",ROW($13:$62)-13),$L24)))","v":""},null,null,null,null,null,null,null,{"$f":"IF(ROW($V14)<=COUNTIF(شيت!$E$11:$E$60,\"غ\"),ROW($V14),\"\")","v":""},{"$f":"IF($V24=\"\",\"\",INDEX(شيت!A$11:A$60,SMALL(IF(شيت!$E$11:$E$60=\"غ\",ROW($13:$62)-13),$V24)))","v":""},{"$f":"IF($V24=\"\",\"\",INDEX(شيت!B$11:B$60,SMALL(IF(شيت!$E$11:$E$60=\"غ\",ROW($13:$62)-13),$V24)))","v":""}]
[null,{"$f":"IF(ROW($B16)<=COUNTIF(شيت!$D$11:$D$60,\"غ\"),ROW($B16),\"\")","v":""},{"$f":"IF($B25=\"\",\"\",INDEX(شيت!A$11:A$60,SMALL(IF(شيت!$D$11:$D$60=\"غ\",ROW($13:$62)-13),$B25)))","v":""},{"$f":"IF($B25=\"\",\"\",INDEX(شيت!B$11:B$60,SMALL(IF(شيت!$D$11:$D$60=\"غ\",ROW($13:$62)-13),$B25)))","v":""},null,null,null,null,null,null,null,{"$f":"IF(ROW($L16)<=COUNTIF(شيت!$K$11:$K$60,\"غ\"),ROW($L16),\"\")","v":""},{"$f":"IF($L25=\"\",\"\",INDEX(شيت!A$11:A$60,SMALL(IF(شيت!$K$11:$K$60=\"غ\",ROW($13:$62)-13),$L25)))","v":""},{"$f":"IF($L25=\"\",\"\",INDEX(شيت!B$11:B$60,SMALL(IF(شيت!$K$11:$K$60=\"غ\",ROW($13:$62)-13),$L25)))","v":""},null,null,null,null,null,null,null,{"$f":"IF(ROW($V15)<=COUNTIF(شيت!$E$11:$E$60,\"غ\"),ROW($V15),\"\")","v":""},{"$f":"IF($V25=\"\",\"\",INDEX(شيت!A$11:A$60,SMALL(IF(شيت!$E$11:$E$60=\"غ\",ROW($13:$62)-13),$V25)))","v":""},{"$f":"IF($V25=\"\",\"\",INDEX(شيت!B$11:B$60,SMALL(IF(شيت!$E$11:$E$60=\"غ\",ROW($13:$62)-13),$V25)))","v":""}]
[null,{"$f":"IF(ROW($B17)<=COUNTIF(شيت!$D$11:$D$60,\"غ\"),ROW($B17),\"\")","v":""},{"$f":"IF($B26=\"\",\"\",INDEX(شيت!A$11:A$60,SMALL(IF(شيت!$D$11:$D$60=\"غ\",ROW($13:$62)-13),$B26)))","v":""},{"$f":"IF($B26=\"\",\"\",INDEX(شيت!B$11:B$60,SMALL(IF(شيت!$D$11:$D$60=\"غ\",ROW($13:$62)-13),$B26)))","v":""},null,null,null,null,null,null,null,{"$f":"IF(ROW($L17)<=COUNTIF(شيت!$K$11:$K$60,\"غ\"),ROW($L17),\"\")","v":""},{"$f":"IF($L26=\"\",\"\",INDEX(شيت!A$11:A$60,SMALL(IF(شيت!$K$11:$K$60=\"غ\",ROW($13:$62)-13),$L26)))","v":""},{"$f":"IF($L26=\"\",\"\",INDEX(شيت!B$11:B$60,SMALL(IF(شيت!$K$11:$K$60=\"غ\",ROW($13:$62)-13),$L26)))","v":""},null,null,null,null,null,null,null,{"$f":"IF(ROW($V16)<=COUNTIF(شيت!$E$11:$E$60,\"غ\"),ROW($V16),\"\")","v":""},{"$f":"IF($V26=\"\",\"\",INDEX(شيت!A$11:A$60,SMALL(IF(شيت!$E$11:$E$60=\"غ\",ROW($13:$62)-13),$V26)))","v":""},{"$f":"IF($V26=\"\",\"\",INDEX(شيت!B$11:B$60,SMALL(IF(شيت!$E$11:$E$60=\"غ\",ROW($13:$62)-13),$V26)))","v":""}]
[null,{"$f":"IF(ROW($B18)<=COUNTIF(شيت!$D$11:$D$60,\"غ\"),ROW($B18),\"\")","v":""},{"$f":"IF($B27=\"\",\"\",INDEX(شيت!A$11:A$60,SMALL(IF(شيت!$D$11:$D$60=\"غ\",ROW($13:$62)-13),$B27)))","v":""},{"$f":"IF($B27=\"\",\"\",INDEX(شيت!B$11:B$60,SMALL(IF(شيت!$D$11:$D$60=\"غ\",ROW($13:$62)-13),$B27)))","v":""},null,null,null,null,null,null,null,{"$f":"IF(ROW($L18)<=COUNTIF(شيت!$K$11:$K$60,\"غ\"),ROW($L18),\"\")","v":""},{"$f":"IF($L27=\"\",\"\",INDEX(شيت!A$11:A$60,SMALL(IF(شيت!$K$11:$K$60=\"غ\",ROW($13:$62)-13),$L27)))","v":""},{"$f":"IF($L27=\"\",\"\",INDEX(شيت!B$11:B$60,SMALL(IF(شيت!$K$11:$K$60=\"غ\",ROW($13:$62)-13),$L27)))","v":""},null,null,null,null,null,null,null,{"$f":"IF(ROW($V17)<=COUNTIF(شيت!$E$11:$E$60,\"غ\"),ROW($V17),\"\")","v":""},{"$f":"IF($V27=\"\",\"\",INDEX(شيت!A$11:A$60,SMALL(IF(شيت!$E$11:$E$60=\"غ\",ROW($13:$62)-13),$V27)))","v":""},{"$f":"IF($V27=\"\",\"\",INDEX(شيت!B$11:B$60,SMALL(IF(شيت!$E$11:$E$60=\"غ\",ROW($13:$62)-13),$V27)))","v":""}]
[null,{"$f":"IF(ROW($B19)<=COUNTIF(شيت!$D$11:$D$60,\"غ\"),ROW($B19),\"\")","v":""},{"$f":"IF($B28=\"\",\"\",INDEX(شيت!A$11:A$60,SMALL(IF(شيت!$D$11:$D$60=\"غ\",ROW($13:$62)-13),$B28)))","v":""},{"$f":"IF($B28=\"\",\"\",INDEX(شيت!B$11:B$60,SMALL(IF(شيت!$D$11:$D$60=\"غ\",ROW($13:$62)-13),$B28)))","v":""},null,null,null,null,null,null,null,{"$f":"IF(ROW($L19)<=COUNTIF(شيت!$K$11:$K$60,\"غ\"),ROW($L19),\"\")","v":""},{"$f":"IF($L28=\"\",\"\",INDEX(شيت!A$11:A$60,SMALL(IF(شيت!$K$11:$K$60=\"غ\",ROW($13:$62)-13),$L28)))","v":""},{"$f":"IF($L28=\"\",\"\",INDEX(شيت!B$11:B$60,SMALL(IF(شيت!$K$11:$K$60=\"غ\",ROW($13:$62)-13),$L28)))","v":""},null,null,null,null,null,null,null,{"$f":"IF(ROW($V18)<=COUNTIF(شيت!$E$11:$E$60,\"غ\"),ROW($V18),\"\")","v":""},{"$f":"IF($V28=\"\",\"\",INDEX(شيت!A$11:A$60,SMALL(IF(شيت!$E$11:$E$60=\"غ\",ROW($13:$62)-13),$V28)))","v":""},{"$f":"IF($V28=\"\",\"\",INDEX(شيت!B$11:B$60,SMALL(IF(شيت!$E$11:$E$60=\"غ\",ROW($13:$62)-13),$V28)))","v":""}]
[null,{"$f":"IF(ROW($B20)<=COUNTIF(شيت!$D$11:$D$60,\"غ\"),ROW($B20),\"\")","v":""},{"$f":"IF($B29=\"\",\"\",INDEX(شيت!A$11:A$60,SMALL(IF(شيت!$D$11:$D$60=\"غ\",ROW($13:$62)-13),$B29)))","v":""},{"$f":"IF($B29=\"\",\"\",INDEX(شيت!B$11:B$60,SMALL(IF(شيت!$D$11:$D$60=\"غ\",ROW($13:$62)-13),$B29)))","v":""},null,null,null,null,null,null,null,{"$f":"IF(ROW($L20)<=COUNTIF(شيت!$K$11:$K$60,\"غ\"),ROW($L20),\"\")","v":""},{"$f":"IF($L29=\"\",\"\",INDEX(شيت!A$11:A$60,SMALL(IF(شيت!$K$11:$K$60=\"غ\",ROW($13:$62)-13),$L29)))","v":""},{"$f":"IF($L29=\"\",\"\",INDEX(شيت!B$11:B$60,SMALL(IF(شيت!$K$11:$K$60=\"غ\",ROW($13:$62)-13),$L29)))","v":""},null,null,null,null,null,null,null,{"$f":"IF(ROW($V19)<=COUNTIF(شيت!$E$11:$E$60,\"غ\"),ROW($V19),\"\")","v":""},{"$f":"IF($V29=\"\",\"\",INDEX(شيت!A$11:A$60,SMALL(IF(شيت!$E$11:$E$60=\"غ\",ROW($13:$62)-13),$V29)))","v":""},{"$f":"IF($V29=\"\",\"\",INDEX(شيت!B$11:B$60,SMALL(IF(شيت!$E$11:$E$60=\"غ\",ROW($13:$62)-13),$V29)))","v":""}]
[null,{"$f":"IF(ROW($B21)<=COUNTIF(شيت!$D$11:$D$60,\"غ\"),ROW($B21),\"\")","v":""},{"$f":"IF($B30=\"\",\"\",INDEX(شيت!A$11:A$60,SMALL(IF(شيت!$D$11:$D$60=\"غ\",ROW($13:$62)-13),$B30)))","v":""},{"$f":"IF($B30=\"\",\"\",INDEX(شيت!B$11:B$60,SMALL(IF(شيت!$D$11:$D$60=\"غ\",ROW($13:$62)-13),$B30)))","v":""},null,null,null,null,null,null,null,{"$f":"IF(ROW($L21)<=COUNTIF(شيت!$K$11:$K$60,\"غ\"),ROW($L21),\"\")","v":""},{"$f":"IF($L30=\"\",\"\",INDEX(شيت!A$11:A$60,SMALL(IF(شيت!$K$11:$K$60=\"غ\",ROW($13:$62)-13),$L30)))","v":""},{"$f":"IF($L30=\"\",\"\",INDEX(شيت!B$11:B$60,SMALL(IF(شيت!$K$11:$K$60=\"غ\",ROW($13:$62)-13),$L30)))","v":""},null,null,null,null,null,null,null,{"$f":"IF(ROW($V20)<=COUNTIF(شيت!$E$11:$E$60,\"غ\"),ROW($V20),\"\")","v":""},{"$f":"IF($V30=\"\",\"\",INDEX(شيت!A$11:A$60,SMALL(IF(شيت!$E$11:$E$60=\"غ\",ROW($13:$62)-13),$V30)))","v":""},{"$f":"IF($V30=\"\",\"\",INDEX(شيت!B$11:B$60,SMALL(IF(شيت!$E$11:$E$60=\"غ\",ROW($13:$62)-13),$V30)))","v":""}]
[null,{"$f":"IF(ROW($B22)<=COUNTIF(شيت!$D$11:$D$60,\"غ\"),ROW($B22),\"\")","v":""},{"$f":"IF($B31=\"\",\"\",INDEX(شيت!A$11:A$60,SMALL(IF(شيت!$D$11:$D$60=\"غ\",ROW($13:$62)-13),$B31)))","v":""},{"$f":"IF($B31=\"\",\"\",INDEX(شيت!B$11:B$60,SMALL(IF(شيت!$D$11:$D$60=\"غ\",ROW($13:$62)-13),$B31)))","v":""},null,null,null,null,null,null,null,{"$f":"IF(ROW($L22)<=COUNTIF(شيت!$K$11:$K$60,\"غ\"),ROW($L22),\"\")","v":""},{"$f":"IF($L31=\"\",\"\",INDEX(شيت!A$11:A$60,SMALL(IF(شيت!$K$11:$K$60=\"غ\",ROW($13:$62)-13),$L31)))","v":""},{"$f":"IF($L31=\"\",\"\",INDEX(شيت!B$11:B$60,SMALL(IF(شيت!$K$11:$K$60=\"غ\",ROW($13:$62)-13),$L31)))","v":""},null,null,null,null,null,null,null,{"$f":"IF(ROW($V21)<=COUNTIF(شيت!$E$11:$E$60,\"غ\"),ROW($V21),\"\")","v":""},{"$f":"IF($V31=\"\",\"\",INDEX(شيت!A$11:A$60,SMALL(IF(شيت!$E$11:$E$60=\"غ\",ROW($13:$62)-13),$V31)))","v":""},{"$f":"IF($V31=\"\",\"\",INDEX(شيت!B$11:B$60,SMALL(IF(شيت!$E$11:$E$60=\"غ\",ROW($13:$62)-13),$V31)))","v":""}]
[null,{"$f":"IF(ROW($B23)<=COUNTIF(شيت!$D$11:$D$60,\"غ\"),ROW($B23),\"\")","v":""},{"$f":"IF($B32=\"\",\"\",INDEX(شيت!A$11:A$60,SMALL(IF(شيت!$D$11:$D$60=\"غ\",ROW($13:$62)-13),$B32)))","v":""},{"$f":"IF($B32=\"\",\"\",INDEX(شيت!B$11:B$60,SMALL(IF(شيت!$D$11:$D$60=\"غ\",ROW($13:$62)-13),$B32)))","v":""},null,null,null,null,null,null,null,{"$f":"IF(ROW($L23)<=COUNTIF(شيت!$K$11:$K$60,\"غ\"),ROW($L23),\"\")","v":""},{"$f":"IF($L32=\"\",\"\",INDEX(شيت!A$11:A$60,SMALL(IF(شيت!$K$11:$K$60=\"غ\",ROW($13:$62)-13),$L32)))","v":""},{"$f":"IF($L32=\"\",\"\",INDEX(شيت!B$11:B$60,SMALL(IF(شيت!$K$11:$K$60=\"غ\",ROW($13:$62)-13),$L32)))","v":""},null,null,null,null,null,null,null,{"$f":"IF(ROW($V22)<=COUNTIF(شيت!$E$11:$E$60,\"غ\"),ROW($V22),\"\")","v":""},{"$f":"IF($V32=\"\",\"\",INDEX(شيت!A$11:A$60,SMALL(IF(شيت!$E$11:$E$60=\"غ\",ROW($13:$62)-13),$V32)))","v":""},{"$f":"IF($V32=\"\",\"\",INDEX(شيت!B$11:B$60,SMALL(IF(شيت!$E$11:$E$60=\"غ\",ROW($13:$62)-13),$V32)))","v":""}]
[null,{"$f":"IF(ROW($B24)<=COUNTIF(شيت!$D$11:$D$60,\"غ\"),ROW($B24),\"\")","v":""},{"$f":"IF($B33=\"\",\"\",INDEX(شيت!A$11:A$60,SMALL(IF(شيت!$D$11:$D$60=\"غ\",ROW($13:$62)-13),$B33)))","v":""},{"$f":"IF($B33=\"\",\"\",INDEX(شيت!B$11:B$60,SMALL(IF(شيت!$D$11:$D$60=\"غ\",ROW($13:$62)-13),$B33)))","v":""},null,null,null,null,null,null,null,{"$f":"IF(ROW($L24)<=COUNTIF(شيت!$K$11:$K$60,\"غ\"),ROW($L24),\"\")","v":""},{"$f":"IF($L33=\"\",\"\",INDEX(شيت!A$11:A$60,SMALL(IF(شيت!$K$11:$K$60=\"غ\",ROW($13:$62)-13),$L33)))","v":""},{"$f":"IF($L33=\"\",\"\",INDEX(شيت!B$11:B$60,SMALL(IF(شيت!$K$11:$K$60=\"غ\",ROW($13:$62)-13),$L33)))","v":""},null,null,null,null,null,null,null,{"$f":"IF(ROW($V23)<=COUNTIF(شيت!$E$11:$E$60,\"غ\"),ROW($V23),\"\")","v":""},{"$f":"IF($V33=\"\",\"\",INDEX(شيت!A$11:A$60,SMALL(IF(شيت!$E$11:$E$60=\"غ\",ROW($13:$62)-13),$V33)))","v":""},{"$f":"IF($V33=\"\",\"\",INDEX(شيت!B$11:B$60,SMALL(IF(شيت!$E$11:$E$60=\"غ\",ROW($13:$62)-13),$V33)))","v":""}]
[null,{"$f":"IF(ROW($B25)<=COUNTIF(شيت!$D$11:$D$60,\"غ\"),ROW($B25),\"\")","v":""},{"$f":"IF($B34=\"\",\"\",INDEX(شيت!A$11:A$60,SMALL(IF(شيت!$D$11:$D$60=\"غ\",ROW($13:$62)-13),$B34)))","v":""},{"$f":"IF($B34=\"\",\"\",INDEX(شيت!B$11:B$60,SMALL(IF(شيت!$D$11:$D$60=\"غ\",ROW($13:$62)-13),$B34)))","v":""},null,null,null,null,null,null,null,{"$f":"IF(ROW($L25)<=COUNTIF(شيت!$K$11:$K$60,\"غ\"),ROW($L25),\"\")","v":""},{"$f":"IF($L34=\"\",\"\",INDEX(شيت!A$11:A$60,SMALL(IF(شيت!$K$11:$K$60=\"غ\",ROW($13:$62)-13),$L34)))","v":""},{"$f":"IF($L34=\"\",\"\",INDEX(شيت!B$11:B$60,SMALL(IF(شيت!$K$11:$K$60=\"غ\",ROW($13:$62)-13),$L34)))","v":""},null,null,null,null,null,null,null,{"$f":"IF(ROW($V24)<=COUNTIF(شيت!$E$11:$E$60,\"غ\"),ROW($V24),\"\")","v":""},{"$f":"IF($V34=\"\",\"\",INDEX(شيت!A$11:A$60,SMALL(IF(شيت!$E$11:$E$60=\"غ\",ROW($13:$62)-13),$V34)))","v":""},{"$f":"IF($V34=\"\",\"\",INDEX(شيت!B$11:B$60,SMALL(IF(شيت!$E$11:$E$60=\"غ\",ROW($13:$62)-13),$V34)))","v":""}]

{"sheet":"كشوف الدور الثاني","index":6,"n_rows":34,"n_cols":18,"rows_kept":34,"cut":false,"hidden":false,"merged":[[16,5,16,6],[17,5,17,6],[18,15,18,16],[19,15,19,16],[20,15,20,16],[7,1,8,1],[7,2,8,2],[7,3,8,3],[7,5,8,6],[23,5,23,6],[20,5,20,6],[9,5,9,6],[10,5,10,6],[11,5,11,6],[12,5,12,6],[13,5,13,6],[14,5,14,6],[15,5,15,6],[18,5,18,6],[19,5,19,6],[21,5,21,6],[28,5,28,6],[29,5,29,6],[30,5,30,6],[31,5,31,6],[22,5,22,6],[24,5,24,6],[25,5,25,6],[26,5,26,6],[27,5,27,6],[35,5,35,6],[32,5,32,6],[34,1,34,3],[34,5,34,6],[33,5,33,6],[1,2,1,3],[4,2,4,4],[7,7,8,7],[4,5,4,7],[5,2,5,4],[5,5,5,7],[7,11,8,11],[1,12,1,13],[4,12,4,14],[4,15,4,17],[5,12,5,14],[5,15,5,17],[7,12,8,12],[7,13,8,13],[7,15,8,16],[7,17,8,17],[34,11,34,13],[34,15,34,16],[9,15,9,16],[10,15,10,16],[11,15,11,16],[12,15,12,16],[13,15,13,16],[14,15,14,16],[15,15,15,16],[16,15,16,16],[17,15,17,16],[21,15,21,16],[22,15,22,16],[23,15,23,16],[24,15,24,16],[25,15,25,16],[35,15,35,16],[26,15,26,16],[27,15,27,16],[28,15,28,16],[29,15,29,16],[30,15,30,16],[31,15,31,16],[32,15,32,16],[33,15,33,16]]}
[]
[]
[]
[]
[null,null,"مادة",null,null,"الرياضيات",null,null,null,null,null,null,"مادة",null,null,"الدراسات الاجتماعية"]
[]
[]
[null,"م","رقم الجلوس","اسم الطالب","الدرجــــــــة بالأرقام","الدرجـــــــة بالحروف",null,"ملاحظــــات",null,null,null,"م","رقم الجلوس","اسم الطالب","الدرجــــــــة بالأرقام","الدرجـــــــة بالحروف",null,"ملاحظــــات"]
[null,null,null,null,30,null,null,null,null,null,null,null,null,null,30]
[null,{"$f":"IF(ROW($B1)<=COUNTIF(شيت!$T$11:$T$60,\"x\"),ROW($B1),\"\")","v":1},{"$f":"IF($B10=\"\",\"\",INDEX(شيت!A$11:A$60,SMALL(IF(شيت!$T$11:$T$60=\"x\",ROW($13:$62)-13),$B10)))","v":12},{"$f":"IF($B10=\"\",\"\",INDEX(شيت!B$11:B$60,SMALL(IF(شيت!$T$11:$T$60=\"x\",ROW($13:$62)-13),$B10)))","v":"عبدالرحمن قارى محمد اقبال"}]
[null,{"$f":"IF(ROW($B2)<=COUNTIF(شيت!$T$11:$T$60,\"x\"),ROW($B2),\"\")","v":2},{"$f":"IF($B11=\"\",\"\",INDEX(شيت!A$11:A$60,SMALL(IF(شيت!$T$11:$T$60=\"x\",ROW($13:$62)-13),$B11)))","v":30},{"$f":"IF($B11=\"\",\"\",INDEX(شيت!B$11:B$60,SMALL(IF(شيت!$T$11:$T$60=\"x\",ROW($13:$62)-13),$B11)))","v":"معتز احمد كامل على خوالده"}]
[null,{"$f":"IF(ROW($B3)<=COUNTIF(شيت!$T$11:$T$60,\"x\"),ROW($B3),\"\")","v":3},{"$f":"IF($B12=\"\",\"\",INDEX(شيت!A$11:A$60,SMALL(IF(شيت!$T$11:$T$60=\"x\",ROW($13:$62)-13),$B12)))","v":32},{"$f":"IF($B12=\"\",\"\",INDEX(شيت!B$11:B$60,SMALL(IF(شيت!$T$11:$T$60=\"x\",ROW($13:$62)-13),$B12)))","v":"مؤمن شريف محمد التاج"}]
[null,{"$f":"IF(ROW($B4)<=COUNTIF(شيت!$T$11:$T$60,\"x\"),ROW($B4),\"\")","v":4},{"$f":"IF($B13=\"\",\"\",INDEX(شيت!A$11:A$60,SMALL(IF(شيت!$T$11:$T$60=\"x\",ROW($13:$62)-13),$B13)))","v":42},{"$f":"IF($B13=\"\",\"\",INDEX(شيت!B$11:B$60,SMALL(IF(شيت!$T$11:$T$60=\"x\",ROW($13:$62)-13),$B13)))","v":"حمد ناجى مسعد احمد الطيرى"}]
[null,{"$f":"IF(ROW($B5)<=COUNTIF(شيت!$T$11:$T$60,\"x\"),ROW($B5),\"\")","v":5},{"$f":"IF($B14=\"\",\"\",INDEX(شيت!A$11:A$60,SMALL(IF(شيت!$T$11:$T$60=\"x\",ROW($13:$62)-13),$B14)))","v":43},{"$f":"IF($B14=\"\",\"\",INDEX(شيت!B$11:B$60,SMALL(IF(شيت!$T$11:$T$60=\"x\",ROW($13:$62)-13),$B14)))","v":"خالد طارق عبدالرحمن فوزي رامون"}]
[null,{"$f":"IF(ROW($B6)<=COUNTIF(شيت!$T$11:$T$60,\"x\"),ROW($B6),\"\")","v":6},{"$f":"IF($B15=\"\",\"\",INDEX(شيت!A$11:A$60,SMALL(IF(شيت!$T$11:$T$60=\"x\",ROW($13:$62)-13),$B15)))","v":48},{"$f":"IF($B15=\"\",\"\",INDEX(شيت!B$11:B$60,SMALL(IF(شيت!$T$11:$T$60=\"x\",ROW($13:$62)-13),$B15)))","v":"زيد محمود احمد خشان"}]
[null,{"$f":"IF(ROW($B7)<=COUNTIF(شيت!$T$11:$T$60,\"x\"),ROW($B7),\"\")","v":""},{"$f":"IF($B16=\"\",\"\",INDEX(شيت!A$11:A$60,SMALL(IF(شيت!$T$11:$T$60=\"x\",ROW($13:$62)-13),$B16)))","v":""},{"$f":"IF($B16=\"\",\"\",INDEX(شيت!B$11:B$60,SMALL(IF(شيت!$T$11:$T$60=\"x\",ROW($13:$62)-13),$B16)))","v":""}]
[null,{"$f":"IF(ROW($B8)<=COUNTIF(شيت!$T$11:$T$60,\"x\"),ROW($B8),\"\")","v":""},{"$f":"IF($B17=\"\",\"\",INDEX(شيت!A$11:A$60,SMALL(IF(شيت!$T$11:$T$60=\"x\",ROW($13:$62)-13),$B17)))","v":""},{"$f":"IF($B17=\"\",\"\",INDEX(شيت!B$11:B$60,SMALL(IF(شيت!$T$11:$T$60=\"x\",ROW($13:$62)-13),$B17)))","v":""}]
[null,{"$f":"IF(ROW($B9)<=COUNTIF(شيت!$T$11:$T$60,\"x\"),ROW($B9),\"\")","v":""},{"$f":"IF($B18=\"\",\"\",INDEX(شيت!A$11:A$60,SMALL(IF(شيت!$T$11:$T$60=\"x\",ROW($13:$62)-13),$B18)))","v":""},{"$f":"IF($B18=\"\",\"\",INDEX(شيت!B$11:B$60,SMALL(IF(شيت!$T$11:$T$60=\"x\",ROW($13:$62)-13),$B18)))","v":""}]
[null,{"$f":"IF(ROW($B10)<=COUNTIF(شيت!$T$11:$T$60,\"x\"),ROW($B10),\"\")","v":""},{"$f":"IF($B19=\"\",\"\",INDEX(شيت!A$11:A$60,SMALL(IF(شيت!$T$11:$T$60=\"x\",ROW($13:$62)-13),$B19)))","v":""},{"$f":"IF($B19=\"\",\"\",INDEX(شيت!B$11:B$60,SMALL(IF(شيت!$T$11:$T$60=\"x\",ROW($13:$62)-13),$B19)))","v":""}]
[null,{"$f":"IF(ROW($B11)<=COUNTIF(شيت!$T$11:$T$60,\"x\"),ROW($B11),\"\")","v":""},{"$f":"IF($B20=\"\",\"\",INDEX(شيت!A$11:A$60,SMALL(IF(شيت!$T$11:$T$60=\"x\",ROW($13:$62)-13),$B20)))","v":""},{"$f":"IF($B20=\"\",\"\",INDEX(شيت!B$11:B$60,SMALL(IF(شيت!$T$11:$T$60=\"x\",ROW($13:$62)-13),$B20)))","v":""}]
[null,{"$f":"IF(ROW($B11)<=COUNTIF(شيت!$T$11:$T$60,\"x\"),ROW($B11),\"\")","v":""},{"$f":"IF($B21=\"\",\"\",INDEX(شيت!A$11:A$60,SMALL(IF(شيت!$T$11:$T$60=\"x\",ROW($13:$62)-13),$B21)))","v":""},{"$f":"IF($B21=\"\",\"\",INDEX(شيت!B$11:B$60,SMALL(IF(شيت!$T$11:$T$60=\"x\",ROW($13:$62)-13),$B21)))","v":""}]
[null,{"$f":"IF(ROW($B12)<=COUNTIF(شيت!$T$11:$T$60,\"x\"),ROW($B12),\"\")","v":""},{"$f":"IF($B22=\"\",\"\",INDEX(شيت!A$11:A$60,SMALL(IF(شيت!$T$11:$T$60=\"x\",ROW($13:$62)-13),$B22)))","v":""},{"$f":"IF($B22=\"\",\"\",INDEX(شيت!B$11:B$60,SMALL(IF(شيت!$T$11:$T$60=\"x\",ROW($13:$62)-13),$B22)))","v":""}]
[null,{"$f":"IF(ROW($B13)<=COUNTIF(شيت!$T$11:$T$60,\"x\"),ROW($B13),\"\")","v":""},{"$f":"IF($B23=\"\",\"\",INDEX(شيت!A$11:A$60,SMALL(IF(شيت!$T$11:$T$60=\"x\",ROW($13:$62)-13),$B23)))","v":""},{"$f":"IF($B23=\"\",\"\",INDEX(شيت!B$11:B$60,SMALL(IF(شيت!$T$11:$T$60=\"x\",ROW($13:$62)-13),$B23)))","v":""}]
[null,{"$f":"IF(ROW($B14)<=COUNTIF(شيت!$T$11:$T$60,\"x\"),ROW($B14),\"\")","v":""},{"$f":"IF($B24=\"\",\"\",INDEX(شيت!A$11:A$60,SMALL(IF(شيت!$T$11:$T$60=\"x\",ROW($13:$62)-13),$B24)))","v":""},{"$f":"IF($B24=\"\",\"\",INDEX(شيت!B$11:B$60,SMALL(IF(شيت!$T$11:$T$60=\"x\",ROW($13:$62)-13),$B24)))","v":""}]
[null,{"$f":"IF(ROW($B15)<=COUNTIF(شيت!$T$11:$T$60,\"x\"),ROW($B15),\"\")","v":""},{"$f":"IF($B25=\"\",\"\",INDEX(شيت!A$11:A$60,SMALL(IF(شيت!$T$11:$T$60=\"x\",ROW($13:$62)-13),$B25)))","v":""},{"$f":"IF($B25=\"\",\"\",INDEX(شيت!B$11:B$60,SMALL(IF(شيت!$T$11:$T$60=\"x\",ROW($13:$62)-13),$B25)))","v":""}]
[null,{"$f":"IF(ROW($B16)<=COUNTIF(شيت!$T$11:$T$60,\"x\"),ROW($B16),\"\")","v":""},{"$f":"IF($B26=\"\",\"\",INDEX(شيت!A$11:A$60,SMALL(IF(شيت!$T$11:$T$60=\"x\",ROW($13:$62)-13),$B26)))","v":""},{"$f":"IF($B26=\"\",\"\",INDEX(شيت!B$11:B$60,SMALL(IF(شيت!$T$11:$T$60=\"x\",ROW($13:$62)-13),$B26)))","v":""}]
[null,{"$f":"IF(ROW($B17)<=COUNTIF(شيت!$T$11:$T$60,\"x\"),ROW($B17),\"\")","v":""},{"$f":"IF($B27=\"\",\"\",INDEX(شيت!A$11:A$60,SMALL(IF(شيت!$T$11:$T$60=\"x\",ROW($13:$62)-13),$B27)))","v":""},{"$f":"IF($B27=\"\",\"\",INDEX(شيت!B$11:B$60,SMALL(IF(شيت!$T$11:$T$60=\"x\",ROW($13:$62)-13),$B27)))","v":""}]
[null,{"$f":"IF(ROW($B18)<=COUNTIF(شيت!$T$11:$T$60,\"x\"),ROW($B18),\"\")","v":""},{"$f":"IF($B28=\"\",\"\",INDEX(شيت!A$11:A$60,SMALL(IF(شيت!$T$11:$T$60=\"x\",ROW($13:$62)-13),$B28)))","v":""},{"$f":"IF($B28=\"\",\"\",INDEX(شيت!B$11:B$60,SMALL(IF(شيت!$T$11:$T$60=\"x\",ROW($13:$62)-13),$B28)))","v":""}]
[null,{"$f":"IF(ROW($B19)<=COUNTIF(شيت!$T$11:$T$60,\"x\"),ROW($B19),\"\")","v":""},{"$f":"IF($B29=\"\",\"\",INDEX(شيت!A$11:A$60,SMALL(IF(شيت!$T$11:$T$60=\"x\",ROW($13:$62)-13),$B29)))","v":""},{"$f":"IF($B29=\"\",\"\",INDEX(شيت!B$11:B$60,SMALL(IF(شيت!$T$11:$T$60=\"x\",ROW($13:$62)-13),$B29)))","v":""}]
[null,{"$f":"IF(ROW($B20)<=COUNTIF(شيت!$T$11:$T$60,\"x\"),ROW($B20),\"\")","v":""},{"$f":"IF($B30=\"\",\"\",INDEX(شيت!A$11:A$60,SMALL(IF(شيت!$T$11:$T$60=\"x\",ROW($13:$62)-13),$B30)))","v":""},{"$f":"IF($B30=\"\",\"\",INDEX(شيت!B$11:B$60,SMALL(IF(شيت!$T$11:$T$60=\"x\",ROW($13:$62)-13),$B30)))","v":""}]
[null,{"$f":"IF(ROW($B21)<=COUNTIF(شيت!$T$11:$T$60,\"x\"),ROW($B21),\"\")","v":""},{"$f":"IF($B31=\"\",\"\",INDEX(شيت!A$11:A$60,SMALL(IF(شيت!$T$11:$T$60=\"x\",ROW($13:$62)-13),$B31)))","v":""},{"$f":"IF($B31=\"\",\"\",INDEX(شيت!B$11:B$60,SMALL(IF(شيت!$T$11:$T$60=\"x\",ROW($13:$62)-13),$B31)))","v":""}]
[null,{"$f":"IF(ROW($B22)<=COUNTIF(شيت!$T$11:$T$60,\"x\"),ROW($B22),\"\")","v":""},{"$f":"IF($B32=\"\",\"\",INDEX(شيت!A$11:A$60,SMALL(IF(شيت!$T$11:$T$60=\"x\",ROW($13:$62)-13),$B32)))","v":""},{"$f":"IF($B32=\"\",\"\",INDEX(شيت!B$11:B$60,SMALL(IF(شيت!$T$11:$T$60=\"x\",ROW($13:$62)-13),$B32)))","v":""}]
[null,{"$f":"IF(ROW($B23)<=COUNTIF(شيت!$T$11:$T$60,\"x\"),ROW($B23),\"\")","v":""},{"$f":"IF($B33=\"\",\"\",INDEX(شيت!A$11:A$60,SMALL(IF(شيت!$T$11:$T$60=\"x\",ROW($13:$62)-13),$B33)))","v":""},{"$f":"IF($B33=\"\",\"\",INDEX(شيت!B$11:B$60,SMALL(IF(شيت!$T$11:$T$60=\"x\",ROW($13:$62)-13),$B33)))","v":""}]
[null,{"$f":"IF(ROW($B24)<=COUNTIF(شيت!$T$11:$T$60,\"x\"),ROW($B24),\"\")","v":""},{"$f":"IF($B34=\"\",\"\",INDEX(شيت!A$11:A$60,SMALL(IF(شيت!$T$11:$T$60=\"x\",ROW($13:$62)-13),$B34)))","v":""},{"$f":"IF($B34=\"\",\"\",INDEX(شيت!B$11:B$60,SMALL(IF(شيت!$T$11:$T$60=\"x\",ROW($13:$62)-13),$B34)))","v":""}]

{"sheet":"إحصاء نتيجة الدور الأول جميع ال","index":7,"n_rows":27,"n_cols":13,"rows_kept":27,"cut":false,"hidden":false,"merged":[[7,6,7,9],[23,5,23,7]]}
[]
[]
[]
[]
[]
[]
[]
[null,null,null,null,null,null,"إحصاء نتيجة جميع المواد"]
[null,null,null,null,"القرآن الكريم","التربية الدينية","لغة عربية","خط عربي","الرياضيات","التربية الفنية","الأنشطة","اللغة الانجليزية","ملاحظات"]
[null,null,null,"عدد الطلاب",{"$f":"#REF!","v":{"$error":"#REF!"}},{"$f":"#REF!","v":{"$error":"#REF!"}},{"$f":"#REF!","v":{"$error":"#REF!"}},null,{"$f":"#REF!","v":{"$error":"#REF!"}},{"$f":"#REF!","v":{"$error":"#REF!"}},{"$f":"#REF!","v":{"$error":"#REF!"}},{"$f":"#REF!","v":{"$error":"#REF!"}}]
[null,null,null,"حاضر",{"$f":"E10-E12","v":{"$error":"#REF!"}},{"$error":"#REF!"},{"$error":"#REF!"},null,{"$error":"#REF!"},{"$error":"#REF!"},{"$error":"#REF!"},{"$error":"#REF!"}]
[null,null,null,"غائب",{"$f":"IF(شيت!B11=\"\",\"\",COUNTIF(شيت!#REF!,\"غ\"))","v":{"$error":"#REF!"}},{"$f":"IF(شيت!B11=\"\",\"\",COUNTIF(شيت!#REF!,\"غ\"))","v":{"$error":"#REF!"}},{"$f":"IF(شيت!B11=\"\",\"\",COUNTIF(شيت!#REF!,\"غ\"))","v":{"$error":"#REF!"}},null,{"$f":"IF(شيت!B11=\"\",\"\",COUNTIF(شيت!#REF!,\"غ\"))","v":{"$error":"#REF!"}},{"$f":"IF(شيت!B11=\"\",\"\",COUNTIF(شيت!#REF!,\"غ\"))","v":{"$error":"#REF!"}},{"$f":"IF(شيت!B11=\"\",\"\",COUNTIF(شيت!#REF!,\"غ\"))","v":{"$error":"#REF!"}},{"$f":"IF(شيت!B11=\"\",\"\",COUNTIF(شيت!#REF!,\"غ\"))","v":{"$error":"#REF!"}}]
[null,null,null,"ناجح",{"$f":"E10-E14","v":{"$error":"#REF!"}},{"$error":"#REF!"},{"$error":"#REF!"},null,{"$error":"#REF!"},{"$error":"#REF!"},{"$error":"#REF!"},{"$error":"#REF!"}]
[null,null,null,"دور ثان",{"$f":"شيت!T8","v":6},{"$f":"شيت!U8","v":3},{"$f":"شيت!V8","v":3},null,{"$f":"شيت!W8","v":6},{"$f":"شيت!X8","v":3},{"$f":"شيت!Y8","v":5},{"$f":"شيت!Z8","v":3}]
[null,null,null,"نسبة النجاح",{"$f":"E13/E10*100/100","v":{"$error":"#REF!"}},{"$error":"#REF!"},{"$error":"#REF!"},null,{"$error":"#REF!"},{"$error":"#REF!"},{"$error":"#REF!"},{"$error":"#REF!"}]
[null,null,null,"نسبة الدور الثاني",{"$f":"E14/E10*100/100","v":{"$error":"#REF!"}},{"$error":"#REF!"},{"$error":"#REF!"},null,{"$error":"#REF!"},{"$error":"#REF!"},{"$error":"#REF!"},{"$error":"#REF!"}]
[]
[]
[]
[]
[]
[]
[]
[null,null,null,null,null,"إحصاء نتيجة الـــدور الثاني"]
[]
[null,null,null,null,"عدد الطلاب","حاضر","غائب","ناجح","دور ثان","نسبة الناجحين","نسبة الدور الثان"]
[null,null,null,null,237,{"$f":"E27-G27","v":237},{"$f":"COUNTIF(شيت!M11:M60,\"غ\")","v":0},{"$f":"COUNTIF(شيت!N11:N60,\"ناجح\")","v":39},{"$f":"COUNTIF(شيت!N11:N60,\"دور ثانى\")","v":11},{"$f":"H27/E27*100/100","v":0.16455696202531644},{"$f":"I27/E27*100/100","v":4.6413502109704644E-2}]

{"sheet":"الأوائل العشرة","index":8,"n_rows":30,"n_cols":8,"rows_kept":30,"cut":false,"hidden":false,"merged":[[31,2,31,3],[2,2,2,3],[3,2,3,3],[4,2,4,3],[6,2,7,7],[30,2,30,3]]}
[]
[]
[]
[]
[]
[]
[null,null,"نتيجة العشرة الأوائل "]
[]
[]
[null,null,"م","رقم الجلوس","اسم الطالب","المجموع","الترتيب","المركـــز"]
[null,null,{"$f":"IF(E11=0,\"\",ROW()-10)","v":{"$error":"#REF!"}},{"$f":"_xlfn.SINGLE(IF(E11=0,\"\",INDEX(الجلوس,SUMPRODUCT(--(رابعه+(1/ROW(رابعه))=LARGE(رابعه+(1/ROW(رابعه)),ROW()-ROW(D$11)+1)),--(ROW(رابعه)))-_xlfn.SINGLE(ROW(رابعه))+1,1)))","v":{"$error":"#REF!"}},{"$f":"_xlfn.SINGLE(INDEX(رابع,SUMPRODUCT(--(رابعه+(1/ROW(رابعه))=LARGE(رابعه+(1/ROW(رابعه)),ROW()-ROW(E$11)+1)),--(ROW(رابعه)))-_xlfn.SINGLE(ROW(رابعه))+1,1))","v":{"$error":"#REF!"}},{"$f":"_xlfn.SINGLE(IF(E11=0,\"\",INDEX(رابعه,SUMPRODUCT(--(رابعه+(1/ROW(رابعه))=LARGE(رابعه+(1/ROW(رابعه)),ROW()-ROW(F$11)+1)),--(ROW(رابعه)))-_xlfn.SINGLE(ROW(رابعه))+1,1)))","v":{"$error":"#REF!"}},{"$f":"IF(E11=0,\"\",RANK(F11,$F$11:$F$25))","v":{"$error":"#REF!"}},{"$f":"IF(E11=0,\"\",IF(G11=1,\"الأول\",\"\"))","v":{"$error":"#REF!"}}]
[null,null,{"$f":"IF(E12=0,\"\",ROW()-10)","v":{"$error":"#REF!"}},{"$error":"#REF!"},{"$error":"#REF!"},{"$error":"#REF!"},{"$f":"IF(E12=0,\"\",RANK(F12,$F$11:$F$25))","v":{"$error":"#REF!"}},{"$f":"IF(E12=0,\"\",IF(G12=G11,H11&\" مكرر \",IF(G12=2,\"الثاني \",\"\")))","v":{"$error":"#REF!"}}]
[null,null,{"$error":"#REF!"},{"$error":"#REF!"},{"$error":"#REF!"},{"$error":"#REF!"},{"$error":"#REF!"},{"$f":"IF(E13=0,\"\",IF(G13=G12,H12&\"مكرر \",IF(G13=3,\" الثالث \",\"\")))","v":{"$error":"#REF!"}}]
[null,null,{"$error":"#REF!"},{"$error":"#REF!"},{"$error":"#REF!"},{"$error":"#REF!"},{"$error":"#REF!"},{"$f":"IF(E14=0,\"\",IF(G14=G13,H13&\" \"&\"مكرر \",IF(G14=4,\"الرابع \",\"\")))","v":{"$error":"#REF!"}}]
[null,null,{"$error":"#REF!"},{"$error":"#REF!"},{"$error":"#REF!"},{"$error":"#REF!"},{"$error":"#REF!"},{"$f":"IF(E15=0,\"\",IF(G15=G14,H14&\"\"&\"مكرر \",IF(G15=5,\"الخامس \",\"\")))","v":{"$error":"#REF!"}}]
[null,null,{"$error":"#REF!"},{"$error":"#REF!"},{"$error":"#REF!"},{"$error":"#REF!"},{"$error":"#REF!"},{"$f":"IF(E16=0,\"\",IF(G16=G15,H15&\" \"&\"مكرر \",IF(G16=6,\" السادس \",\"\")))","v":{"$error":"#REF!"}}]
[null,null,{"$error":"#REF!"},{"$error":"#REF!"},{"$error":"#REF!"},{"$error":"#REF!"},{"$error":"#REF!"},{"$f":"IF(E17=0,\"\",IF(G17=G16,H16&\"\"&\" مكرر \",IF(G17=7,\" السابع \",\"\")))","v":{"$error":"#REF!"}}]
[null,null,{"$error":"#REF!"},{"$error":"#REF!"},{"$error":"#REF!"},{"$error":"#REF!"},{"$error":"#REF!"},{"$f":"IF(E18=0,\"\",IF(G18=G17,H17&\"مكرر \",IF(G18=8,\"الثامن\",\"\")))","v":{"$error":"#REF!"}}]
[null,null,{"$error":"#REF!"},{"$error":"#REF!"},{"$error":"#REF!"},{"$error":"#REF!"},{"$error":"#REF!"},{"$f":"IF(E19=0,\"\",IF(G19=G18,H18&\"مكرر \",IF(G19=9,\"التاسع\",\"\")))","v":{"$error":"#REF!"}}]
[null,null,{"$error":"#REF!"},{"$error":"#REF!"},{"$error":"#REF!"},{"$error":"#REF!"},{"$error":"#REF!"},{"$f":"IF(E20=0,\"\",IF(G20=G19,H19&\" مكرر \",IF(G20=10,\"العاشر \",\"\")))","v":{"$error":"#REF!"}}]
[null,null,{"$error":"#REF!"},{"$error":"#REF!"},{"$error":"#REF!"},{"$error":"#REF!"},{"$error":"#REF!"},{"$f":"IF(E21=0,\"\",IF(G21=G20,H20&\" مكرر \",IF(G21=11,\"الحادى عشر \",\"\")))","v":{"$error":"#REF!"}}]
[null,null,{"$error":"#REF!"},{"$error":"#REF!"},{"$error":"#REF!"},{"$error":"#REF!"},{"$error":"#REF!"},{"$f":"IF(E22=0,\"\",IF(G22=G21,H21&\" مكرر \",IF(G22=12,\"الثانى عشر\",\"\")))","v":{"$error":"#REF!"}}]
[null,null,{"$error":"#REF!"},{"$error":"#REF!"},{"$error":"#REF!"},{"$error":"#REF!"},{"$error":"#REF!"},{"$f":"IF(E23=0,\"\",IF(G23=G22,H22&\" مكرر \",IF(G23=13,\"الثالث عشر\",\"\")))","v":{"$error":"#REF!"}}]
[null,null,{"$error":"#REF!"},{"$error":"#REF!"},{"$error":"#REF!"},{"$error":"#REF!"},{"$error":"#REF!"},{"$f":"IF(E24=0,\"\",IF(G24=G23,H23&\" مكرر\",IF(G24=14,\"الرابع عشر\",\"\")))","v":{"$error":"#REF!"}}]
[null,null,{"$error":"#REF!"},{"$error":"#REF!"},{"$error":"#REF!"},{"$error":"#REF!"},{"$error":"#REF!"},{"$f":"IF(E25=0,\"\",IF(G25=G24,H24&\" مكرر\",IF(G25=15,\"الخامس عشر\",\"\")))","v":{"$error":"#REF!"}}]
[null,null,{"$error":"#REF!"},{"$error":"#REF!"},{"$error":"#REF!"},{"$error":"#REF!"},{"$error":"#REF!"},{"$f":"IF(E26=0,\"\",IF(G26=G25,H25&\" مكرر \",IF(G26=16,\"السادس عشر\",\"\")))","v":{"$error":"#REF!"}}]
[null,null,{"$error":"#REF!"},{"$error":"#REF!"},{"$error":"#REF!"},{"$error":"#REF!"},{"$error":"#REF!"},{"$f":"IF(E27=0,\"\",IF(G27=G26,H26&\" مكرر\",IF(G27=17,\"السابع عشر\",\"\")))","v":{"$error":"#REF!"}}]
[null,null,{"$error":"#REF!"},{"$error":"#REF!"},{"$error":"#REF!"},{"$error":"#REF!"},{"$error":"#REF!"},{"$f":"IF(E28=0,\"\",IF(G28=G27,H27&\" مكرر \",IF(G28=18,\"الثامن عشر\",\"\")))","v":{"$error":"#REF!"}}]
[null,null,{"$error":"#REF!"},{"$error":"#REF!"},{"$error":"#REF!"},{"$error":"#REF!"},{"$error":"#REF!"},{"$f":"IF(E29=0,\"\",IF(G29=G28,H28&\"مكرر \",IF(G29=19,\"التاسع عشر\",\"\")))","v":{"$error":"#REF!"}}]
[null,null,{"$error":"#REF!"},{"$error":"#REF!"},{"$error":"#REF!"},{"$error":"#REF!"},{"$error":"#REF!"},{"$f":"IF(E30=0,\"\",IF(G30=G29,H29&\"مكرر \",IF(G30=20,\"العشرون\",\"\")))","v":{"$error":"#REF!"}}]