{"text_format":"1","workbook":"xlsx","n_sheets":9,"sheets":["شيت","ناجح","دور ثانى","كشف بالتلاميذ الناجحين","كشف مواد الدور الثاني","الغائبين عن الاختبار","كشوف الدور الثاني","إحصاء نتيجة الدور الأول جميع ال","الأوائل العشرة"],"not_rendered":{"charts":0,"images":1,"macros":1,"external_links":1,"defined_names":23,"comments":0,"pivot_tables":0},"unopened":[],"bounds":{"document_bytes":16777216,"sheet_cells":100000,"rows_first":2000,"rows_last":500,"rows_between":2000,"halvings":0,"cell_chars":16384,"cell_head_chars":4096},"cells_cut":0,"cells_raw":0,"read":"whole","date_system":"1900"}

{"sheet":"شيت","index":0,"n_rows":247,"n_cols":54,"rows_kept":247,"cut":false,"hidden":false,"merged":[[8,36,9,36],[8,37,9,37],[5,19,6,27],[7,2,9,2],[7,1,9,1],[7,17,9,17],[7,16,9,16],[7,15,9,15],[7,14,9,14],[7,13,9,13],[7,10,8,10],[7,12,8,12],[7,11,8,11],[7,9,8,9],[7,8,8,8],[7,7,8,7],[8,34,9,34],[8,35,9,35],[7,0,9,0],[7,6,8,6],[7,5,8,5],[7,4,8,4],[7,3,8,3],[7,41,8,45],[7,47,8,53],[8,20,9,20],[8,19,9,19],[8,26,9,26],[8,27,9,27],[8,39,9,39],[8,38,9,38],[8,25,9,25],[8,24,9,24],[8,23,9,23],[8,22,9,22],[8,21,9,21],[8,31,9,31],[8,32,9,32],[8,33,9,33]]}
[]
[]
[]
[]
[]
[null,null,null,null,null,null,null,null,null,null,null,null,null,null,null,null,null,null,null,"عدد مواد الرسوب"]
[]
["رقم الجلوس","اسم الطالب","الصف","الرياضيات","الدراسات الاجتماعية","الحوسبة وتكنولوجيا المعلومات","الكيمياء","الفيزياء","الأحياء","التربية الإسلامية","اللغة العربية","اللغة الإنجليزية","المجموع الكلي","نتيجة الطالب","النسبة المئوية","التقدير العام للطالب","الترتيب","مواد الدور الثاني",null,{"$f":"COUNTIF(T11:T60,\"x\")","v":6},3,3,6,3,5,3,2,3,null,null,null,null,null,null,null,null,null,null,null,null,null,"ترتيب الأوائل",null,null,null,null,null,"العشر الأوائل"]
[null,null,null,null,null,null,null,null,null,null,null,null,null,null,null,null,null,null,null,"الرياضيات","الدراسات الاجتماعية","الحوسبة وتكنولوجيا المعلومات","الكيمياء","الفيزياء","الأحياء","التربية الإسلامية","اللغة العربية","اللغة الإنجليزية",null,null,null,"الرياضيات","الدراسات الاجتماعية","الحوسبة وتكنولوجيا المعلومات","الكيمياء","الفيزياء","الأحياء","التربية الإسلامية","اللغة العربية","اللغة الإنجليزية"]
[null,null,null,30,30,30,30,30,30,30,30,30,{"$f":"SUM(D10:L10)","v":270},null,null,null,null,null,null,null,null,null,null,null,null,null,null,null,null,null,null,null,null,null,null,null,null,null,null,null,null,"رقم الجلوس","اسم الطالب","المجموع","الترتيب","النتيجة",null,"م","رقم الجلوس","اسم التلميذ","المجموع","الترتيب","مجموع","المركز"]
{"$rows_left_out":238}
{"sheet":"ناجح","index":1,"n_rows":0,"n_cols":0,"rows_kept":0,"cut":false,"hidden":false,"merged":[]}

{"sheet":"دور ثانى","index":2,"n_rows":0,"n_cols":0,"rows_kept":0,"cut":false,"hidden":false,"merged":[]}

{"sheet":"كشف بالتلاميذ الناجحين","index":3,"n_rows":32,"n_cols":10,"rows_kept":32,"cut":false,"hidden":false,"merged":[[32,8,32,9],[33,8,33,9],[7,8,7,9],[33,4,33,5],[0,3,1,3],[0,2,1,2],[32,4,32,5],[5,6,5,7]]}
[null,null,0]
[]
[]
[]
[]
[null,null,null,null,null,null,"كشف الطلاب الناجحين"]
[]
[null,null,null,null,null,null,"الصف"]
[null,null,null,null,"م","رقم الجلوس","اسم الطالب","النتيجة","المجموع","النسبة المئوية"]
[null,null,null,{"$f":"C1","v":0},{"$f":"IF(G10=0,\"\",D10)","v":{"$error":"#REF!"}},{"$f":"_xlfn.SINGLE(IF(G10=0,\"\",INDEX(ناجح!#REF!,$D10,2)))","v":{"$error":"#REF!"}},{"$f":"_xlfn.SINGLE(INDEX(ناجح!#REF!,$D10,3))","v":{"$error":"#REF!"}},{"$f":"_xlfn.SINGLE(IF(G10=0,\"\",INDEX(ناجح!#REF!,$D10,39)))","v":{"$error":"#REF!"}},{"$f":"_xlfn.SINGLE(IF(G10=0,\"\",INDEX(ناجح!#REF!,$D10,31)))","v":{"$error":"#REF!"}},{"$f":"_xlfn.SINGLE(IF(G10=0,\"\",INDEX(ناجح!#REF!,$D10,40)))","v":{"$error":"#REF!"}}]
{"$rows_left_out":23}
{"sheet":"كشف مواد الدور الثاني","index":4,"n_rows":34,"n_cols":9,"rows_kept":34,"cut":false,"hidden":false,"merged":[[3,4,3,5],[0,2,1,2],[32,4,32,5],[32,7,32,8],[33,4,33,5],[33,7,33,8]]}
[null,null,0]
[]
[]
[]
[]
[]
[]
[null,null,null,null,null,null,"الصف",{"$f":"#REF!","v":{"$error":"#REF!"}}]
[null,null,null,null,"م","رقم الجلوس","اسم الطالب","مواد الدور الثانى","توقيع الطالب"]
[null,null,null,{"$f":"C1","v":0},{"$f":"IF(G10=0,\"\",D10)","v":{"$error":"#REF!"}},{"$f":"_xlfn.SINGLE(IF(G10=0,\"\",INDEX('دور ثانى'!#REF!,$D10,2)))","v":{"$error":"#REF!"}},{"$f":"_xlfn.SINGLE(INDEX('دور ثانى'!#REF!,$D10,3))","v":{"$error":"#REF!"}},{"$f":"_xlfn.SINGLE(IF(G10=0,\"\",INDEX('دور ثانى'!#REF!,$D10,43)))","v":{"$error":"#REF!"}}]
{"$rows_left_out":25}
{"sheet":"الغائبين عن الاختبار","index":5,"n_rows":34,"n_cols":25,"rows_kept":34,"cut":false,"hidden":false,"merged":[[34,2,34,3],[34,6,34,7],[35,6,35,7],[34,12,34,14],[34,17,34,18],[35,17,35,18],[1,2,1,3],[1,12,1,13],[4,2,4,4],[4,5,4,7],[4,12,4,15],[4,16,4,18],[5,2,5,4],[5,5,5,7],[5,12,5,14],[12,5,12,6],[12,14,12,15],[12,16,12,17],[9,5,9,6],[9,14,9,15],[9,16,9,17],[10,5,10,6],[10,14,10,15],[18,5,18,6],[18,14,18,15],[18,16,18,17],[19,5,19,6],[9,24,33,25],[8,14,8,15],[5,22,5,23],[5,24,5,25],[7,1,8,1],[7,2,8,2],[7,3,8,3],[7,5,8,6],[7,7,8,7],[7,11,8,11],[7,12,8,12],[7,13,8,13],[7,14,7,15],[7,16,8,17],[7,18,8,18],[7,21,8,21],[7,23,8,23],[7,24,8,25],[5,15,5,18],[15,5,15,6],[15,14,15,15],[15,16,15,17],[16,5,16,6],[16,14,16,15],[16,16,16,17],[17,5,17,6],[17,14,17,15],[17,16,17,17],[11,5,11,6],[11,14,11,15],[11,16,11,17],[13,5,13,6],[13,14,13,15],[13,16,13,17],[14,5,14,6],[14,14,14,15],[14,16,14,17],[19,14,19,15],[19,16,19,17],[20,5,20,6],[20,14,20,15],[20,16,20,17],[21,5,21,6],[21,14,21,15],[21,16,21,17],[22,5,22,6],[22,14,22,15],[22,16,22,17],[28,5,28,6],[28,14,28,15],[28,16,28,17],[29,5,29,6],[29,14,29,15],[29,16,29,17],[23,5,23,6],[23,14,23,15],[23,16,23,17],[24,5,24,6],[24,14,24,15],[24,16,24,17],[25,5,25,6],[25,14,25,15],[25,16,25,17],[35,21,35,22],[43,16,43,17],[34,21,34,22],[10,16,10,17],[4,22,4,24],[7,22,8,22],[26,5,26,6],[26,14,26,15],[26,16,26,17],[27,5,27,6],[27,14,27,15],[27,16,27,17],[33,5,33,6],[33,14,33,15],[33,16,33,17],[30,5,30,6],[30,14,30,15],[30,16,30,17],[31,5,31,6],[31,14,31,15],[31,16,31,17],[32,5,32,6],[32,14,32,15],[32,16,32,17]]}
[]
[]
[]
[]
[]
[null,null,"مادة",null,null,"الرياضيات",null,null,null,null,null,null,"مادة",null,null,"الدراسات الاجتماعية",null,null,null,null,null,null,"مادة",null,"الحوسبة وتكنولوجيا المعلومات"]
[]
[null,"م","رقم الجلوس","اسم الطالب","الدرجة","الدرجـــــــة بالحروف",null,"ملاحظــــات",null,null,null,"م","رقم الجلوس","اســــم التلميذ ولقبه","الدرجــــــــة بالأرقام",null,"الدرجـــــــة بالحروف",null,"ملاحظــــات",null,null,"م","رقم الجلوس","اســــم التلميذ ولقبه","ملاحظــــــــــات"]
[null,null,null,null,30,null,null,null,null,null,null,null,null,null,50]
[null,{"$f":"IF(ROW($B1)<=COUNTIF(شيت!$D$11:$D$60,\"غ\"),ROW($B1),\"\")","v":""},{"$f":"IF($B10=\"\",\"\",INDEX(شيت!A$11:A$60,SMALL(IF(شيت!$D$11:$D$60=\"غ\",ROW($13:$62)-13),$B10)))","v":""},{"$f":"IF($B10=\"\",\"\",INDEX(شيت!B$11:B$60,SMALL(IF(شيت!$D$11:$D$60=\"غ\",ROW($13:$62)-13),$B10)))","v":""},null,null,null,null,null,null,null,{"$f":"IF(ROW($L1)<=COUNTIF(شيت!$K$11:$K$60,\"غ\"),ROW($L1),\"\")","v":""},{"$f":"IF($L10=\"\",\"\",INDEX(شيت!A$11:A$60,SMALL(IF(شيت!$K$11:$K$60=\"غ\",ROW($13:$62)-13),$L10)))","v":""},{"$f":"IF($L10=\"\",\"\",INDEX(شيت!B$11:B$60,SMALL(IF(شيت!$K$11:$K$60=\"غ\",ROW($13:$62)-13),$L10)))","v":""},null,null,null,null,null,null,null,{"$f":"IF(ROW($V1)<=COUNTIF(شيت!$E$11:$E$60,\"غ\"),ROW($V1),\"\")","v":""},{"$f":"IF($V10=\"\",\"\",INDEX(شيت!A$11:A$60,SMALL(IF(شيت!$E$11:$E$60=\"غ\",ROW($13:$62)-13),$V10)))","v":""},{"$f":"IF($V10=\"\",\"\",INDEX(شيت!B$11:B$60,SMALL(IF(شيت!$E$11:$E$60=\"غ\",ROW($13:$62)-13),$V10)))","v":""}]
{"$rows_left_out":25}
{"sheet":"كشوف الدور الثاني","index":6,"n_rows":34,"n_cols":18,"rows_kept":34,"cut":false,"hidden":false,"merged":[[16,5,16,6],[17,5,17,6],[18,15,18,16],[19,15,19,16],[20,15,20,16],[7,1,8,1],[7,2,8,2],[7,3,8,3],[7,5,8,6],[23,5,23,6],[20,5,20,6],[9,5,9,6],[10,5,10,6],[11,5,11,6],[12,5,12,6],[13,5,13,6],[14,5,14,6],[15,5,15,6],[18,5,18,6],[19,5,19,6],[21,5,21,6],[28,5,28,6],[29,5,29,6],[30,5,30,6],[31,5,31,6],[22,5,22,6],[24,5,24,6],[25,5,25,6],[26,5,26,6],[27,5,27,6],[35,5,35,6],[32,5,32,6],[34,1,34,3],[34,5,34,6],[33,5,33,6],[1,2,1,3],[4,2,4,4],[7,7,8,7],[4,5,4,7],[5,2,5,4],[5,5,5,7],[7,11,8,11],[1,12,1,13],[4,12,4,14],[4,15,4,17],[5,12,5,14],[5,15,5,17],[7,12,8,12],[7,13,8,13],[7,15,8,16],[7,17,8,17],[34,11,34,13],[34,15,34,16],[9,15,9,16],[10,15,10,16],[11,15,11,16],[12,15,12,16],[13,15,13,16],[14,15,14,16],[15,15,15,16],[16,15,16,16],[17,15,17,16],[21,15,21,16],[22,15,22,16],[23,15,23,16],[24,15,24,16],[25,15,25,16],[35,15,35,16],[26,15,26,16],[27,15,27,16],[28,15,28,16],[29,15,29,16],[30,15,30,16],[31,15,31,16],[32,15,32,16],[33,15,33,16]]}
[]
[]
[]
[]
[null,null,"مادة",null,null,"الرياضيات",null,null,null,null,null,null,"مادة",null,null,"الدراسات الاجتماعية"]
[]
[]
[null,"م","رقم الجلوس","اسم الطالب","الدرجــــــــة بالأرقام","الدرجـــــــة بالحروف",null,"ملاحظــــات",null,null,null,"م","رقم الجلوس","اسم الطالب","الدرجــــــــة بالأرقام","الدرجـــــــة بالحروف",null,"ملاحظــــات"]
[null,null,null,null,30,null,null,null,null,null,null,null,null,null,30]
[null,{"$f":"IF(ROW($B1)<=COUNTIF(شيت!$T$11:$T$60,\"x\"),ROW($B1),\"\")","v":1},{"$f":"IF($B10=\"\",\"\",INDEX(شيت!A$11:A$60,SMALL(IF(شيت!$T$11:$T$60=\"x\",ROW($13:$62)-13),$B10)))","v":12},{"$f":"IF($B10=\"\",\"\",INDEX(شيت!B$11:B$60,SMALL(IF(شيت!$T$11:$T$60=\"x\",ROW($13:$62)-13),$B10)))","v":"عبدالرحمن قارى محمد اقبال"}]
{"$rows_left_out":25}
{"sheet":"إحصاء نتيجة الدور الأول جميع ال","index":7,"n_rows":27,"n_cols":13,"rows_kept":27,"cut":false,"hidden":false,"merged":[[7,6,7,9],[23,5,23,7]]}
[]
[]
[]
[]
[]
[]
[]
[null,null,null,null,null,null,"إحصاء نتيجة جميع المواد"]
[null,null,null,null,"القرآن الكريم","التربية الدينية","لغة عربية","خط عربي","الرياضيات","التربية الفنية","الأنشطة","اللغة الانجليزية","ملاحظات"]
[null,null,null,"عدد الطلاب",{"$f":"#REF!","v":{"$error":"#REF!"}},{"$f":"#REF!","v":{"$error":"#REF!"}},{"$f":"#REF!","v":{"$error":"#REF!"}},null,{"$f":"#REF!","v":{"$error":"#REF!"}},{"$f":"#REF!","v":{"$error":"#REF!"}},{"$f":"#REF!","v":{"$error":"#REF!"}},{"$f":"#REF!","v":{"$error":"#REF!"}}]
{"$rows_left_out":18}
{"sheet":"الأوائل العشرة","index":8,"n_rows":30,"n_cols":8,"rows_kept":30,"cut":false,"hidden":false,"merged":[[31,2,31,3],[2,2,2,3],[3,2,3,3],[4,2,4,3],[6,2,7,7],[30,2,30,3]]}
[]
[]
[]
[]
[]
[]
[null,null,"نتيجة العشرة الأوائل "]
[]
[]
[null,null,"م","رقم الجلوس","اسم الطالب","المجموع","الترتيب","المركـــز"]
{"$rows_left_out":20}