{"text_format":"1","workbook":"xlsx","n_sheets":8,"sheets":["شيت","ناجح","دور ثانى","كشف بالتلاميذ الناجحين","كشف مواد الدور الثاني","الغائبين عن الاختبار","إحصاء نتيجة الدور الأول جميع ال","الأوائل العشرة"],"not_rendered":{"charts":0,"images":1,"macros":1,"external_links":0,"defined_names":5,"comments":0,"pivot_tables":0},"unopened":[],"bounds":{"document_bytes":16777216,"sheet_cells":100000,"rows_first":2000,"rows_last":500,"rows_between":2000,"halvings":0,"cell_chars":16384,"cell_head_chars":4096},"cells_cut":0,"cells_raw":0,"read":"whole","date_system":"1900"}

{"sheet":"شيت","index":0,"n_rows":247,"n_cols":54,"rows_kept":247,"cut":false,"hidden":false,"merged":[[6,3,6,12],[8,36,9,36],[8,37,9,37],[5,19,6,27],[8,34,9,34],[8,35,9,35],[7,10,8,10],[7,12,8,12],[7,11,8,11],[7,9,8,9],[7,8,8,8],[7,17,9,17],[7,16,9,16],[7,15,9,15],[7,14,9,14],[7,13,9,13],[7,0,9,0],[7,6,8,6],[7,5,8,5],[7,4,8,4],[7,3,8,3],[7,1,9,1],[7,2,9,2],[7,7,8,7],[7,41,8,45],[7,47,8,53],[8,20,9,20],[8,19,9,19],[8,26,9,26],[8,27,9,27],[8,39,9,39],[8,38,9,38],[8,25,9,25],[8,24,9,24],[8,23,9,23],[8,22,9,22],[8,21,9,21],[8,31,9,31],[8,32,9,32],[8,33,9,33]]}
[]
[]
[]
[]
[]
[null,null,null,null,null,null,null,null,null,null,null,null,null,null,null,null,null,null,null,"عدد مواد الرسوب"]
[null,null,null,"المواد الدراسية"]
["رقم الجلوس","اسم الطالب","الصف","الرياضيات","الدراسات الاجتماعية","الحوسبة وتكنولوجيا المعلومات","الكيمياء","الفيزياء","الأحياء","التربية الإسلامية","اللغة العربية","اللغة الإنجليزية","المجموع الكلي","نتيجة الطالب","النسبة المئوية","التقدير العام للطالب","الترتيب","مواد الدور الثاني",null,{"$f":"COUNTIF(T11:T247,\"x\")","v":83},{"$f":"COUNTIF(U11:U247,\"x\")","v":68},52,82,45,110,49,55,69,null,null,null,null,null,null,null,null,null,null,null,null,null,"ترتيب الأوائل",null,null,null,null,null,"العشر الأوائل"]
[null,null,null,null,null,null,null,null,null,null,null,null,null,null,null,null,null,null,null,"الرياضيات","الدراسات الاجتماعية","الحوسبة وتكنولوجيا المعلومات","الكيمياء","الفيزياء","الأحياء","التربية الإسلامية","اللغة العربية","اللغة الإنجليزية",null,null,null,"الرياضيات","الدراسات الاجتماعية","الحوسبة وتكنولوجيا المعلومات","الكيمياء","الفيزياء","الأحياء","التربية الإسلامية","اللغة العربية","اللغة الإنجليزية"]
[null,null,null,30,30,30,30,30,30,30,30,30,{"$f":"SUM(D10:L10)","v":270},null,null,null,null,null,null,null,null,null,null,null,null,null,null,null,null,null,null,null,null,null,null,null,null,null,null,null,null,"رقم الجلوس","اسم الطالب","المجموع","الترتيب","النتيجة",null,"م","رقم الجلوس","اسم الطالب","المجموع","الترتيب","مجموع","المركز"]
[{"$f":"ROW()-10","v":1},"احمد حسن احمد سليمان الهيل","10 - 1",22,19,22,19,19,19,19,22,25,{"$f":"IF(B11=\"\",\"\",IF(AND(D11=\"غ\",E11=\"غ\",F11=\"غ\",G11=\"غ\",H11=\"غ\",I11=\"غ\",J11=\"غ\",K11=\"غ\",L11=\"غ\"),\"غ\",SUM(D11,E11,F11,G11,H11,I11,J11,K11,L11)))","v":186},{"$f":"IF(B11=\"\",\"\",AE11)","v":"ناجح"},{"$f":"IF(B11=\"\",\"\",IF(M11=\"غ\",\"غ\",M11/$M$10*100/100))","v":0.68888888888888888},{"$f":"IF(M11=\"\",\"\",IF(M11=\"غ\",\"غ\",IF(M11=0,\"دون المستوى\",IF(M11/$M$10*100>=85,\"ممتاز\",IF(M11/$M$10*100>=75,\"جيد جدا\",IF(M11/$M$10*100>=65,\"جيد\",IF(M11/$M$10*100>=50,\"مقبول\",IF(M11/$M$10*100<50,\"دون المستوى\"))))))))","v":"جيد"},null,{"$f":"CONCATENATE(AF11,AG11,AH11,AI11,AJ11,AK11,AL11,AM11,AN11)","v":""},null,{"$f":"IF($B11=\"\",\"\",IF(OR(D11<15,D11=\"\",D11=\"غ\",D11=\"صفر\"=\"\"),\"x\",\"\"))","v":""},{"$f":"IF($B11=\"\",\"\",IF(OR(E11<15,E11=\"\",E11=\"غ\",E11=\"صفر\"=\"\"),\"x\",\"\"))","v":""},"","","","","","","",{"$f":"IF(B11=\"\",\"\",COUNTBLANK(T11:AB11))","v":9},{"$f":"IF(B11=\"\",\"\",COUNTIF(T11:AB11,\"x\"))","v":0},{"$f":"IF(B11=\"\",\"\",IF(AC11=9,\"ناجح\",\"دور ثانى\"))","v":"ناجح"},{"$f":"IF(T11=\"x\",\"الرياضيات / \",\"\")","v":""},{"$f":"IF(U11=\"x\",\"الدراسات الاجتماعية / \",\"\")","v":""},{"$f":"IF(V11=\"x\",\"الحوسبة وتكنولوجيا المعلومات / \",\"\")","v":""},{"$f":"IF(W11=\"x\",\"الكيمياء / \",\"\")","v":""},{"$f":"IF(X11=\"x\",\"الفيزياء / \",\"\")","v":""},{"$f":"IF(Y11=\"x\",\"الأحياء / \",\"\")","v":""},{"$f":"IF(Z11=\"x\",\"التربية الإسلامية / \",\"\")","v":""},{"$f":"IF(AA11=\"x\",\"اللغة العربية / \",\"\")","v":""},{"$f":"IF(AB11=\"x\",\"اللغة الإنجليزية / \",\"\")","v":""},null,{"$f":"A11","v":1},{"$f":"B11","v":"احمد حسن احمد سليمان الهيل"},{"$f":"IF(M11=\"\",\"\",IF(M11=\"غ\",\"غ\",M11+1/ROW()*0.001))","v":186.00009090909091},{"$f":"IFERROR(IF(M11=\" \",\" \",IF(M11=\"غ\",\"غ\",RANK(M11,$M$11:$M$247))),\"\")","v":94},{"$f":"AE11","v":"ناجح"},null,1,{"$f":"INDEX($AP$11:$AP$247,MATCH(BA11,$AR$11:$AR$247,0))","v":6},{"$f":"INDEX($AQ$11:$AQ$247,MATCH(BA11,$AR$11:$AR$247,0))","v":"خالد مصعب خضر عبدالله تايه"},{"$f":"IF(BA11=\" \",\" \",ROUNDDOWN(BA11,1))","v":267},{"$f":"RANK(AY11,$AY$11:$AY$20)","v":1},{"$f":"IF(AR11=\" \",\" \",LARGE($AR$11:$AR$247,AV11))","v":267.00006250000001},{"$f":"IF(AZ11=1,\"الأول\",\" \")","v":"الأول"}]
[{"$f":"ROW()-10","v":2},"احمد عبداللاه احمد يحيى عبدالاله","10 - 1",24.5,24.5,26,22.5,29,16,30,29,22.5,224,"ناجح",0.82962962962962961,{"$f":"IF(M12=\"\",\"\",IF(M12=\"غ\",\"غ\",IF(M12=0,\"دون المستوى\",IF(M12/$M$10*100>=85,\"ممتاز\",IF(M12/$M$10*100>=75,\"جيد جدا\",IF(M12/$M$10*100>=65,\"جيد\",IF(M12/$M$10*100>=50,\"مقبول\",IF(M12/$M$10*100<50,\"دون المستوى\"))))))))","v":"جيد جدا"},null,{"$f":"CONCATENATE(AF12,AG12,AH12,AI12,AJ12,AK12,AL12,AM12,AN12)","v":""},null,{"$f":"IF($B12=\"\",\"\",IF(OR(D12<15,D12=\"\",D12=\"غ\",D12=\"صفر\"=\"\"),\"x\",\"\"))","v":""},{"$f":"IF($B12=\"\",\"\",IF(OR(E12<15,E12=\"\",E12=\"غ\",E12=\"صفر\"=\"\"),\"x\",\"\"))","v":""},{"$f":"IF($B12=\"\",\"\",IF(OR(F12<15,F12=\"\",F12=\"غ\",F12=\"صفر\"=\"\"),\"x\",\"\"))","v":""},{"$f":"IF($B12=\"\",\"\",IF(OR(G12<15,G12=\"\",G12=\"غ\",G12=\"صفر\"=\"\"),\"x\",\"\"))","v":""},{"$f":"IF($B12=\"\",\"\",IF(OR(H12<15,H12=\"\",H12=\"غ\",H12=\"صفر\"=\"\"),\"x\",\"\"))","v":""},{"$f":"IF($B12=\"\",\"\",IF(OR(I12<15,I12=\"\",I12=\"غ\",I12=\"صفر\"=\"\"),\"x\",\"\"))","v":""},{"$f":"IF($B12=\"\",\"\",IF(OR(J12<15,J12=\"\",J12=\"غ\",J12=\"صفر\"=\"\"),\"x\",\"\"))","v":""},{"$f":"IF($B12=\"\",\"\",IF(OR(K12<15,K12=\"\",K12=\"غ\",K12=\"صفر\"=\"\"),\"x\",\"\"))","v":""},{"$f":"IF($B12=\"\",\"\",IF(OR(L12<15,L12=\"\",L12=\"غ\",L12=\"صفر\"=\"\"),\"x\",\"\"))","v":""},{"$f":"IF(B12=\"\",\"\",COUNTBLANK(T12:AB12))","v":9},{"$f":"IF(B12=\"\",\"\",COUNTIF(T12:AB12,\"x\"))","v":0},{"$f":"IF(B12=\"\",\"\",IF(AC12=9,\"ناجح\",\"دور ثانى\"))","v":"ناجح"},{"$f":"IF(T12=\"x\",\"الرياضيات / \",\"\")","v":""},{"$f":"IF(U12=\"x\",\"الدراسات الاجتماعية / \",\"\")","v":""},{"$f":"IF(V12=\"x\",\"الحوسبة وتكنولوجيا المعلومات / \",\"\")","v":""},{"$f":"IF(W12=\"x\",\"الكيمياء / \",\"\")","v":""},{"$f":"IF(X12=\"x\",\"الفيزياء / \",\"\")","v":""},{"$f":"IF(Y12=\"x\",\"الأحياء / \",\"\")","v":""},{"$f":"IF(Z12=\"x\",\"التربية الإسلامية / \",\"\")","v":""},{"$f":"IF(AA12=\"x\",\"اللغة العربية / \",\"\")","v":""},{"$f":"IF(AB12=\"x\",\"اللغة الإنجليزية / \",\"\")","v":""},null,2,"احمد عبداللاه احمد يحيى عبدالاله",224.00008333333332,{"$f":"IFERROR(IF(M12=\" \",\" \",IF(M12=\"غ\",\"غ\",RANK(M12,$M$11:$M$247))),\"\")","v":48},{"$f":"AE12","v":"ناجح"},null,2,{"$f":"INDEX($AP$11:$AP$247,MATCH(BA12,$AR$11:$AR$247,0))","v":29},{"$f":"INDEX($AQ$11:$AQ$247,MATCH(BA12,$AR$11:$AR$247,0))","v":"محمود عادل عبدالمحسن محمد"},260,2,{"$f":"IF(AR12=\" \",\" \",LARGE($AR$11:$AR$247,AV12))","v":260.00002564102562},{"$f":"IF(AZ12=AZ11,BB11&\" مكرر \",IF(AZ12=2,\" الثاني \",\" \"))","v":" الثاني "}]
[3,"احمد محمود احمد عبدالسميع عثمان","10 - 1",28,30,29.5,29,28,28,29,26,25.5,253,"ناجح",0.937037037037037,"ممتاز",null,"",null,"","","","","","","","","",9,0,"ناجح","","","","","","","","","",null,3,"احمد محمود احمد عبدالسميع عثمان",253.00007692307693,11,"ناجح",null,3,19,"عمر هشام على بحيرى ابوالخير",259.5,3,259.50003448275862,{"$f":"IF(AZ13=AZ12,BB12&\" مكرر  \",IF(AZ13=3,\" الثالث  \",\" \"))","v":" الثالث  "}]
[4,"جمال عبدالغفار كمال على","10 - 1",24.5,27,27,22.5,25,23,27.5,29,22.5,228,"ناجح",0.84444444444444444,"جيد جدا",null,"",null,"","","","","","","","","",9,0,"ناجح","","","","","","","","","",null,4,"جمال عبدالغفار كمال على",228.00007142857143,42,"ناجح",null,4,36,"أحمد اقبال ابواصبع",258.5,4,258.50002173913043,{"$f":"IF(AZ14=AZ13,BB13&\"   \"&\" مكرر\",IF(AZ14=4,\" الرابع  \",\" \"))","v":" الرابع  "}]
[5,"حسن محمد العبود الصالح","10 - 1",25.5,30,27,27,30,27,30,28,18.5,243,"ناجح",0.9,"ممتاز",null,"",null,"","","","","","","","","",9,0,"ناجح","","","","","","","","","",null,5,"حسن محمد العبود الصالح",243.00006666666667,23,"ناجح",null,5,229,"محمد راشد عبدالمحسن راشد الهميمى",258,5,258.00000418410042,{"$f":"IF(AZ15=AZ14,BB14&\"   \"&\" مكرر\",IF(AZ15=5,\" الخامس  \",\" \"))","v":" الخامس  "}]
[6,"خالد مصعب خضر عبدالله تايه","10 - 1",29.5,30,29,30,30,30,30,29,29.5,267,"ناجح",0.98888888888888882,"ممتاز",null,"",null,"","","","","","","","","",9,0,"ناجح","","","","","","","","","",null,6,"خالد مصعب خضر عبدالله تايه",267.00006250000001,1,"ناجح",null,6,26,"محمد عمر عبدالرحيم على",257.5,6,257.5000277777778,{"$f":"IF(AZ16=AZ15,BB15&\"مكرر\",IF(AZ16=6,\" السادس  \",\" \"))","v":" السادس  "}]
[7,"سيف سعيد احمد عبدالمجيد عبدالرحيم","10 - 1",27.5,28,24.5,28,28,24,28,27,25.5,240.5,"ناجح",0.89074074074074072,"ممتاز",null,"",null,"","","","","","","","","",9,0,"ناجح","","","","","","","","","",null,7,"سيف سعيد احمد عبدالمجيد عبدالرحيم",240.5000588235294,27,"ناجح",null,7,27,"محمد عمر فتحى عبدالتواب عبدالمقصود",257.5,6,257.50002702702704,{"$f":"IF(AZ17=AZ16,BB16&\"مكرر\",IF(AZ17=7,\" السابع  \",\" \"))","v":" السادس  مكرر"}]
[8,"شعيب خالد شعيب جاب الله","10 - 1",22,28,29,21,30,28,29,26,28.5,241.5,"ناجح",0.89444444444444438,"ممتاز",null,"",null,"","","","","","","","","",9,0,"ناجح","","","","","","","","","",null,8,"شعيب خالد شعيب جاب الله",241.50005555555555,25,"ناجح",null,8,23,"محمد عبدالله السيد بيومي حسن",256,8,256.00003030303031,{"$f":"IF(AZ18=AZ17,BB17&\"مكرر\",IF(AZ18=8,\"الثامن\",\" \"))","v":"الثامن"}]
[9,"عادل سعيد فتحي مصطفى عوض  الله","10 - 1",27,30,27,23.5,28,19,30,30,24,238.5,"ناجح",0.8833333333333333,"ممتاز",null,"",null,"","","","","","","","","",9,0,"ناجح","","","","","","","","","",null,9,"عادل سعيد فتحي مصطفى عوض  الله",238.50005263157894,29,"ناجح",null,9,20,"فادي عدنان احمد عبدالجليل",255,9,255.00003333333333,{"$f":"IF(AZ19=AZ18,BB18&\"  مكرر\",IF(AZ19=9,\"التاسع\",\" \"))","v":"التاسع"}]
[10,"عامر محمد عمر عجيز","10 - 1",23,19.5,29,19.5,30,26,30,27,24,228,"ناجح",0.84444444444444444,"جيد جدا",null,"",null,"","","","","","","","","",9,0,"ناجح","","","","","","","","","",null,10,"عامر محمد عمر عجيز",228.00004999999999,42,"ناجح",null,10,126,"عمر محمد محمود ابوزاهر",254.5,10,254.50000735294117,{"$f":"IF(AZ20=AZ19,BB19&\"  مكرر\",IF(AZ20=10,\"العاشر\",\" \"))","v":"العاشر"}]
[11,"عبدالرحمن خالد محمد سليمان الشيخ","10 - 1",26.5,27,20,28,30,29,30,29,29.5,249,"ناجح",0.92222222222222228,"ممتاز",null,"",null,"","","","","","","","","",9,0,"ناجح","","","","","","","","","",null,11,"عبدالرحمن خالد محمد سليمان الشيخ",249.00004761904762,18,"ناجح"]
[12,"عبدالرحمن قارى محمد اقبال","10 - 1",27,25,20.5,29,30,22,28,30,26.5,238,"ناجح",0.88148148148148153,"ممتاز",null,"",null,"","","","","","","","","",9,0,"ناجح","","","","","","","","","",null,12,"عبدالرحمن قارى محمد اقبال",238.00004545454544,30,"ناجح"]
[13,"عبدالله فتحي سيد محمد جمعه","10 - 1",3,30,30,26.5,30,28,30,30,24.5,232,"دور ثانى",0.85925925925925928,"ممتاز",null,"الرياضيات / ",null,"x","","","","","","","","",8,1,"دور ثانى","الرياضيات / ","","","","","","","","",null,13,"عبدالله فتحي سيد محمد جمعه",232.00004347826086,35,"دور ثانى"]
[14,"عدنان محمد رضا كرار سليمان","10 - 1",30,27,20.5,24,24,21,28.5,30,23.5,228.5,"ناجح",0.84629629629629632,"جيد جدا",null,"",null,"","","","","","","","","",9,0,"ناجح","","","","","","","","","",null,14,"عدنان محمد رضا كرار سليمان",228.50004166666668,41,"ناجح"]
[15,"على هصام حامد على الحبابى","10 - 1",26,21,26,25,25,25,24,20,19,211,"ناجح",0.78148148148148133,"جيد جدا",null,"",null,"","","","","","","","","",9,0,"ناجح","","","","","","","","","",null,15,"على هصام حامد على الحبابى",211.00004000000001,61,"ناجح"]
[16,"عمر عبدالباسط ابراهيم محمد","10 - 1",26.5,23.5,28.5,25,30,14.5,26.5,27,29.5,231,"دور ثانى",0.85555555555555562,"ممتاز",null,"الأحياء / ",null,"","","","","","x","","","",8,1,"دور ثانى","","","","","","الأحياء / ","","","",null,16,"عمر عبدالباسط ابراهيم محمد",231.00003846153845,38,"دور ثانى"]
[17,"عمر فؤاد اسماعيل ثابت","10 - 1",24.5,24,27,26,27,22.5,26,30,25.5,232.5,"ناجح",0.86111111111111116,"ممتاز",null,"",null,"","","","","","","","","",9,0,"ناجح","","","","","","","","","",null,17,"عمر فؤاد اسماعيل ثابت",232.50003703703703,34,"ناجح"]
[18,"عمر مصطفى محمد عوه","10 - 1",26,29,22.5,30,27,22.5,30,28,27.5,242.5,"ناجح",0.89814814814814814,"ممتاز",null,"",null,"","","","","","","","","",9,0,"ناجح","","","","","","","","","",null,18,"عمر مصطفى محمد عوه",242.5000357142857,24,"ناجح"]
[19,"عمر هشام على بحيرى ابوالخير","10 - 1",30,30,27,28,30,28,30,29,27.5,259.5,"ناجح",0.96111111111111114,"ممتاز",null,"",null,"","","","","","","","","",9,0,"ناجح","","","","","","","","","",null,19,"عمر هشام على بحيرى ابوالخير",259.50003448275862,3,"ناجح"]
[20,"فادي عدنان احمد عبدالجليل","10 - 1",29,30,28.5,27,28,29,30,25,28.5,255,"ناجح",0.94444444444444442,"ممتاز",null,"",null,"","","","","","","","","",9,0,"ناجح","","","","","","","","","",null,20,"فادي عدنان احمد عبدالجليل",255.00003333333333,9,"ناجح"]
[21,"مازن محمود السيد عبدالله عبدالوهاب","10 - 1",28,29,29.5,25,24,26,30,25,19,235.5,"ناجح",0.87222222222222223,"ممتاز",null,"",null,"","","","","","","","","",9,0,"ناجح","","","","","","","","","",null,21,"مازن محمود السيد عبدالله عبدالوهاب",235.50003225806452,31,"ناجح"]
[22,"محمد احمد محمود شناق","10 - 1",27.5,27,26,27,28,26,29,26,29.5,246,"ناجح",0.91111111111111109,"ممتاز",null,"",null,"","","","","","","","","",9,0,"ناجح","","","","","","","","","",null,22,"محمد احمد محمود شناق",246.00003125000001,22,"ناجح"]
[23,"محمد عبدالله السيد بيومي حسن","10 - 1",30,26,26.5,30,30,29,30,27,27.5,256,"ناجح",0.94814814814814818,"ممتاز",null,"",null,"","","","","","","","","",9,0,"ناجح","","","","","","","","","",null,23,"محمد عبدالله السيد بيومي حسن",256.00003030303031,8,"ناجح"]
[24,"محمد عقيل عدنان سيد احمد","10 - 1",23.5,30,26.5,26,30,26,25.5,27,26.5,241,"ناجح",0.89259259259259272,"ممتاز",null,"",null,"","","","","","","","","",9,0,"ناجح","","","","","","","","","",null,24,"محمد عقيل عدنان سيد احمد",241.0000294117647,26,"ناجح"]
[25,"محمد علي عطيت الله ابراهيم عبداللاه","10 - 1",24,30,23.5,24,30,25,29,27,19.5,232,"ناجح",0.85925925925925928,"ممتاز",null,"",null,"","","","","","","","","",9,0,"ناجح","","","","","","","","","",null,25,"محمد علي عطيت الله ابراهيم عبداللاه",232.00002857142857,35,"ناجح"]
[26,"محمد عمر عبدالرحيم على","10 - 1",30,30,29.5,29,30,24.5,28,30,26.5,257.5,"ناجح",0.95370370370370372,"ممتاز",null,"",null,"","","","","","","","","",9,0,"ناجح","","","","","","","","","",null,26,"محمد عمر عبدالرحيم على",257.5000277777778,6,"ناجح"]
[27,"محمد عمر فتحى عبدالتواب عبدالمقصود","10 - 1",30,30,28,28,28,27,29,30,27.5,257.5,"ناجح",0.95370370370370372,"ممتاز",null,"",null,"","","","","","","","","",9,0,"ناجح","","","","","","","","","",null,27,"محمد عمر فتحى عبدالتواب عبدالمقصود",257.50002702702704,6,"ناجح"]
[28,"محمود حبيب الله","10 - 1",28,30,27,22.5,28,28,30,30,29.5,253,"ناجح",0.937037037037037,"ممتاز",null,"",null,"","","","","","","","","",9,0,"ناجح","","","","","","","","","",null,28,"محمود حبيب الله",253.00002631578948,11,"ناجح"]
[29,"محمود عادل عبدالمحسن محمد","10 - 1",28.5,30,29.5,30,30,27,29.5,27,28.5,260,"ناجح",0.96296296296296291,"ممتاز",null,"",null,"","","","","","","","","",9,0,"ناجح","","","","","","","","","",null,29,"محمود عادل عبدالمحسن محمد",260.00002564102562,2,"ناجح"]
[30,"معتز احمد كامل على خوالده","10 - 1",30,30,28,"غ",28,26,29,29,25,225,"دور ثانى",0.83333333333333348,"جيد جدا",null,"الكيمياء / ",null,"","","","x","","","","","",8,1,"دور ثانى","","","","الكيمياء / ","","","","","",null,30,"معتز احمد كامل على خوالده",225.00002499999999,45,"دور ثانى"]
[31,"مهنا احمد محمد سيف النعيمى","10 - 1","غ",12,"غ",8,8,8,"غ",17,18,71,"دور ثانى",0.26296296296296295,"دون المستوى",null,"الرياضيات / الدراسات الاجتماعية / الحوسبة وتكنولوجيا المعلومات / الكيمياء / الفيزياء / الأحياء / التربية الإسلامية / ",null,"x","x","x","x","x","x","x","","",2,7,"دور ثانى","الرياضيات / ","الدراسات الاجتماعية / ","الحوسبة وتكنولوجيا المعلومات / ","الكيمياء / ","الفيزياء / ","الأحياء / ","التربية الإسلامية / ","","",null,31,"مهنا احمد محمد سيف النعيمى",71.000024390243908,224,"دور ثانى"]
[32,"مؤمن شريف محمد التاج","10 - 1",29.5,30,29.5,"غ",28,29,30,30,24.5,230.5,"دور ثانى",0.85370370370370385,"ممتاز",null,"الكيمياء / ",null,"","","","x","","","","","",8,1,"دور ثانى","","","","الكيمياء / ","","","","","",null,32,"مؤمن شريف محمد التاج",230.50002380952381,39,"دور ثانى"]
[33,"ياسين احمد صلاح عبداللطيف","10 - 1","غ","غ","غ","غ","غ","غ","غ","غ","غ","غ","دور ثانى","غ","غ",null,"الرياضيات / الدراسات الاجتماعية / الحوسبة وتكنولوجيا المعلومات / الكيمياء / الفيزياء / الأحياء / التربية الإسلامية / اللغة العربية / اللغة الإنجليزية / ",null,"x","x","x","x","x","x","x","x","x",0,9,"دور ثانى","الرياضيات / ","الدراسات الاجتماعية / ","الحوسبة وتكنولوجيا المعلومات / ","الكيمياء / ","الفيزياء / ","الأحياء / ","التربية الإسلامية / ","اللغة العربية / ","اللغة الإنجليزية / ",null,{"$f":"A43","v":33},{"$f":"B43","v":"ياسين احمد صلاح عبداللطيف"},{"$f":"IF(M43=\"\",\"\",IF(M43=\"غ\",\"غ\",M43+1/ROW()*0.001))","v":"غ"},"غ","دور ثانى"]
[34,"يوسف محمد سليمان موسى عامر","10 - 1",26.5,30,30,27,28,22,29,30,27,249.5,"ناجح",0.92407407407407405,"ممتاز",null,"",null,"","","","","","","","","",9,0,"ناجح","","","","","","","","","",null,34,"يوسف محمد سليمان موسى عامر",249.50002272727272,17,"ناجح"]
[35,"احمد اسامه جميل ابوالعلا","10 - 2",29,24.5,26.5,25,30,26,26,24.5,23,234.5,"ناجح",0.86851851851851847,"ممتاز",null,"",null,"","","","","","","","","",9,0,"ناجح","","","","","","","","","",null,35,"احمد اسامه جميل ابوالعلا",234.50002222222221,32,"ناجح"]
[36,"أحمد اقبال ابواصبع","10 - 2",29,30,28.5,28,30,29,28,28.5,27.5,258.5,"ناجح",0.95740740740740737,"ممتاز",null,"",null,"","","","","","","","","",9,0,"ناجح","","","","","","","","","",null,36,"أحمد اقبال ابواصبع",258.50002173913043,4,"ناجح"]
[37,"احمد شريف ابراهيم الدسوقى عوض","10 - 2",25,21,28.5,17,29,23,26.5,26.5,28,224.5,"ناجح",0.83148148148148149,"جيد جدا",null,"",null,"","","","","","","","","",9,0,"ناجح","","","","","","","","","",null,37,"احمد شريف ابراهيم الدسوقى عوض",224.50002127659573,47,"ناجح"]
[38,"امين بن المنذر بن عثمان","10 - 2",19,19,20,18,18,18,19,20,24,175,"ناجح",0.64814814814814814,"مقبول",null,"",null,"","","","","","","","","",9,0,"ناجح","","","","","","","","","",null,38,"امين بن المنذر بن عثمان",175.00002083333334,105,"ناجح"]
[39,"براء اشرف سعيد زكي السيد","10 - 2",29,22,19.5,22,26,19.5,23,22,27,210,"ناجح",0.7777777777777779,"جيد جدا",null,"",null,"","","","","","","","","",9,0,"ناجح","","","","","","","","","",null,39,"براء اشرف سعيد زكي السيد",210.00002040816327,63,"ناجح"]
[40,"بريك سالم دغش الجربوعى المرى","10 - 2",18,24,17,14.5,23,21,18,17,22,174.5,"دور ثانى",0.64629629629629615,"مقبول",null,"الكيمياء / ",null,"","","","x","","","","","",8,1,"دور ثانى","","","","الكيمياء / ","","","","","",null,40,"بريك سالم دغش الجربوعى المرى",174.50002000000001,107,"دور ثانى"]
[41,"جوين عماد عبدالحليم داود","10 - 2",21.5,16,22,21.5,28,18.5,21,19,25,192.5,"ناجح",0.71296296296296291,"جيد",null,"",null,"","","","","","","","","",9,0,"ناجح","","","","","","","","","",null,41,"جوين عماد عبدالحليم داود",192.50001960784314,90,"ناجح"]
[42,"حمد ناجى مسعد احمد الطيرى","10 - 2",28.5,21,27.5,27.5,30,20,23,23,19,219.5,"ناجح",0.812962962962963,"جيد جدا",null,"",null,"","","","","","","","","",9,0,"ناجح","","","","","","","","","",null,42,"حمد ناجى مسعد احمد الطيرى",219.50001923076923,52,"ناجح"]
[43,"خالد طارق عبدالرحمن فوزي رامون","10 - 2","غ","غ","غ","غ","غ","غ","غ","غ","غ","غ","دور ثانى","غ","غ",null,"الرياضيات / الدراسات الاجتماعية / الحوسبة وتكنولوجيا المعلومات / الكيمياء / الفيزياء / الأحياء / التربية الإسلامية / اللغة العربية / اللغة الإنجليزية / ",null,"x","x","x","x","x","x","x","x","x",0,9,"دور ثانى","الرياضيات / ","الدراسات الاجتماعية / ","الحوسبة وتكنولوجيا المعلومات / ","الكيمياء / ","الفيزياء / ","الأحياء / ","التربية الإسلامية / ","اللغة العربية / ","اللغة الإنجليزية / ",null,43,"خالد طارق عبدالرحمن فوزي رامون","غ","غ","دور ثانى"]
[44,"خالد ناصر محمد ناصر الدهيمى","10 - 2",14,27,19.5,19.5,23,25,25,24.5,26,203.5,"دور ثانى",0.75370370370370365,"جيد جدا",null,"الرياضيات / ",null,"x","","","","","","","","",8,1,"دور ثانى","الرياضيات / ","","","","","","","","",null,44,"خالد ناصر محمد ناصر الدهيمى",203.50001851851852,75,"دور ثانى"]
[45,"راشد حمد على البكرى اليافعى","10 - 2",23,24,20,19.5,23,17.5,22.5,23.5,21,194,"ناجح",0.71851851851851867,"جيد",null,"",null,"","","","","","","","","",9,0,"ناجح","","","","","","","","","",null,45,"راشد حمد على البكرى اليافعى",194.00001818181818,88,"ناجح"]
[46,"رامي سعد فراج فرج علي","10 - 2",18,24,27.5,23,25,23.5,26,28,26,221,"ناجح",0.81851851851851842,"جيد جدا",null,"",null,"","","","","","","","","",9,0,"ناجح","","","","","","","","","",null,46,"رامي سعد فراج فرج علي",221.00001785714286,50,"ناجح"]
[47,"زكي واءلئ شحده عطيه ابوعيده","10 - 2",24.5,28,27,20,26,20,19.5,20,26,211,"ناجح",0.78148148148148133,"جيد جدا",null,"",null,"","","","","","","","","",9,0,"ناجح","","","","","","","","","",null,47,"زكي واءلئ شحده عطيه ابوعيده",211.00001754385966,61,"ناجح"]
[48,"زيد محمود احمد خشان","10 - 2",23.5,29,21,20.5,29,14,29,25.5,24,215.5,"دور ثانى",0.79814814814814805,"جيد جدا",null,"الأحياء / ",null,"","","","","","x","","","",8,1,"دور ثانى","","","","","","الأحياء / ","","","",null,48,"زيد محمود احمد خشان",215.50001724137931,56,"دور ثانى"]
[49,"سالم محمد سالم البطى الكعبى","10 - 2",8,27,21,16,22,19,19.5,20,14,166.5,"دور ثانى",0.6166666666666667,"مقبول",null,"الرياضيات / اللغة الإنجليزية / ",null,"x","","","","","","","","x",7,2,"دور ثانى","الرياضيات / ","","","","","","","","اللغة الإنجليزية / ",null,49,"سالم محمد سالم البطى الكعبى",166.50001694915255,116,"دور ثانى"]
[50,"سلمان محمد اسلام ناصر احمد","10 - 2",17,16,25.5,15.5,24,25,22,20,18,183,"ناجح",0.67777777777777781,"جيد",null,"",null,"","","","","","","","","",9,0,"ناجح","","","","","","","","","",null,50,"سلمان محمد اسلام ناصر احمد",183.00001666666665,99,"ناجح"]
[51,"سيف فهد موسى حسن على","10 - 2",14.5,24,24,17.5,17,22,21.5,15.5,18,174,"دور ثانى",0.64444444444444438,"مقبول",null,"الرياضيات / ",null,"x","","","","","","","","",8,1,"دور ثانى","الرياضيات / ","","","","","","","","",null,51,{"$f":"B61","v":"سيف فهد موسى حسن على"},{"$f":"IF(M61=\"\",\"\",IF(M61=\"غ\",\"غ\",M61+1/ROW()*0.001))","v":174.00001639344262},108,"دور ثانى"]
[52,"عبدالرحمن اشرف فتحى سالم نصار","10 - 2","غ","غ","غ","غ","غ","غ","غ","غ","غ","غ","دور ثانى","غ","غ",null,"الرياضيات / الدراسات الاجتماعية / الحوسبة وتكنولوجيا المعلومات / الكيمياء / الفيزياء / الأحياء / التربية الإسلامية / اللغة العربية / اللغة الإنجليزية / ",null,"x","x","x","x","x","x","x","x","x",0,9,"دور ثانى","الرياضيات / ","الدراسات الاجتماعية / ","الحوسبة وتكنولوجيا المعلومات / ","الكيمياء / ","الفيزياء / ","الأحياء / ","التربية الإسلامية / ","اللغة العربية / ","اللغة الإنجليزية / ",null,52,"عبدالرحمن اشرف فتحى سالم نصار","غ","غ","دور ثانى"]
[53,"عبدالرحمن جمال على صالح سيد","10 - 2",23.5,28,18,13.5,27,22,24.5,21,25,202.5,"دور ثانى",0.75,"جيد جدا",null,"الكيمياء / ",null,"","","","x","","","","","",8,1,"دور ثانى","","","","الكيمياء / ","","","","","",null,53,"عبدالرحمن جمال على صالح سيد",202.50001587301588,77,"دور ثانى"]
[54,"عبدالرحمن محمد محسن البكري","10 - 2",21.5,26.5,22,18,24,19,26.5,18,21,196.5,"ناجح",0.72777777777777775,"جيد",null,"",null,"","","","","","","","","",9,0,"ناجح","","","","","","","","","",null,54,"عبدالرحمن محمد محسن البكري",196.500015625,86,"ناجح"]
[55,"عبدالرحمن هيثم اديب ابودلو","10 - 2",28,26,27.5,22.5,28,24,26,24,19,225,"ناجح",0.83333333333333348,"جيد جدا",null,"",null,"","","","","","","","","",9,0,"ناجح","","","","","","","","","",null,55,"عبدالرحمن هيثم اديب ابودلو",225.00001538461538,45,"ناجح"]
[56,"عبدالرحيم محمد رشيد الديرشوى","10 - 2",13.5,26,20,22,25,27.5,24.5,23.5,18,200,"دور ثانى",0.74074074074074081,"جيد",null,"الرياضيات / ",null,"x","","","","","","","","",8,1,"دور ثانى","الرياضيات / ","","","","","","","","",null,56,"عبدالرحيم محمد رشيد الديرشوى",200.00001515151516,82,"دور ثانى"]
[57,"عبدالعزيز عوض احمد محمد اليافعى","10 - 2",17,23,16,11,25,14.5,25.5,21,19,172,"دور ثانى",0.63703703703703707,"مقبول",null,"الكيمياء / الأحياء / ",null,"","","","x","","x","","","",7,2,"دور ثانى","","","","الكيمياء / ","","الأحياء / ","","","",null,57,"عبدالعزيز عوض احمد محمد اليافعى",172.00001492537314,110,"دور ثانى"]
[58,"على عبدالحافظ على منصر منيف","10 - 2",27,25,25.5,20,28,19,29,24,17,214.5,"ناجح",0.7944444444444444,"جيد جدا",null,"",null,"","","","","","","","","",9,0,"ناجح","","","","","","","","","",null,58,"على عبدالحافظ على منصر منيف",214.50001470588236,58,"ناجح"]
[59,"على نائل محمد عبدالله الخالدى","10 - 2",20,20.5,"غ",6,10.5,17,16.5,13,24,127.5,"دور ثانى",0.47222222222222221,"دون المستوى",null,"الحوسبة وتكنولوجيا المعلومات / الكيمياء / الفيزياء / اللغة العربية / ",null,"","","x","x","x","","","x","",5,4,"دور ثانى","","","الحوسبة وتكنولوجيا المعلومات / ","الكيمياء / ","الفيزياء / ","","","اللغة العربية / ","",null,59,"على نائل محمد عبدالله الخالدى",127.50001449275362,180,"دور ثانى"]
[60,"فيصل محمد راشد جخدب الهميمى","10 - 2",25.5,28,29.5,29,27,21.5,24,23.5,24,232,"ناجح",0.85925925925925928,"ممتاز",null,"",null,"","","","","","","","","",9,0,"ناجح","","","","","","","","","",null,60,"فيصل محمد راشد جخدب الهميمى",232.00001428571429,35,"ناجح"]
[61,"قيس محمد داود ابراهيم ابوديه","10 - 2",25.5,29,26.5,29,30,28,30,27,27,252,"ناجح",0.93333333333333324,"ممتاز",null,"",null,"","","","","","","","","",9,0,"ناجح","","","","","","","","","",null,61,"قيس محمد داود ابراهيم ابوديه",252.00001408450703,13,"ناجح"]
[62,"لؤي ايهاب محمد احمد محمد","10 - 2",24,26.5,18.5,27,27,25,24,22,27,221,"ناجح",0.81851851851851842,"جيد جدا",null,"",null,"","","","","","","","","",9,0,"ناجح","","","","","","","","","",null,62,"لؤي ايهاب محمد احمد محمد",221.0000138888889,50,"ناجح"]
[63,"محمد على راشد محمد انديله","10 - 2",26,22,27,20,24,20,23,19,23,204,"ناجح",0.75555555555555554,"جيد جدا",null,"",null,"","","","","","","","","",9,0,"ناجح","","","","","","","","","",null,63,"محمد على راشد محمد انديله",204.00001369863014,72,"ناجح"]
[64,"محمد محمود فاروق العبد","10 - 2",17.5,25,26,14.5,20,17,25,22.5,26,193.5,"دور ثانى",0.71666666666666667,"جيد",null,"الكيمياء / ",null,"","","","x","","","","","",8,1,"دور ثانى","","","","الكيمياء / ","","","","","",null,64,"محمد محمود فاروق العبد",193.50001351351352,89,"دور ثانى"]
[65,"محمدخير حسين رغفان","10 - 2",25,28,24.5,21,27,24,27,20,27,{"$f":"IF(B75=\"\",\"\",IF(AND(D75=\"غ\",E75=\"غ\",F75=\"غ\",G75=\"غ\",H75=\"غ\",I75=\"غ\",J75=\"غ\",K75=\"غ\",L75=\"غ\"),\"غ\",SUM(D75,E75,F75,G75,H75,I75,J75,K75,L75)))","v":223.5},{"$f":"IF(B75=\"\",\"\",AE75)","v":"ناجح"},{"$f":"IF(B75=\"\",\"\",IF(M75=\"غ\",\"غ\",M75/$M$10*100/100))","v":0.82777777777777772},"جيد جدا",null,"",null,"","","","","","","","","",9,0,"ناجح","","","","","","","","","",null,65,"محمدخير حسين رغفان",223.50001333333333,49,"ناجح"]
[{"$f":"ROW()-10","v":66},"وليد الامين عثمان","10 - 2",22.5,20.5,27.5,18,27,24,25,21,23,208.5,"ناجح",0.77222222222222225,{"$f":"IF(M76=\"\",\"\",IF(M76=\"غ\",\"غ\",IF(M76=0,\"دون المستوى\",IF(M76/$M$10*100>=85,\"ممتاز\",IF(M76/$M$10*100>=75,\"جيد جدا\",IF(M76/$M$10*100>=65,\"جيد\",IF(M76/$M$10*100>=50,\"مقبول\",IF(M76/$M$10*100<50,\"دون المستوى\"))))))))","v":"جيد جدا"},null,{"$f":"CONCATENATE(AF76,AG76,AH76,AI76,AJ76,AK76,AL76,AM76,AN76)","v":""},null,{"$f":"IF($B76=\"\",\"\",IF(OR(D76<15,D76=\"\",D76=\"غ\",D76=\"صفر\"=\"\"),\"x\",\"\"))","v":""},{"$f":"IF($B76=\"\",\"\",IF(OR(E76<15,E76=\"\",E76=\"غ\",E76=\"صفر\"=\"\"),\"x\",\"\"))","v":""},{"$f":"IF($B76=\"\",\"\",IF(OR(F76<15,F76=\"\",F76=\"غ\",F76=\"صفر\"=\"\"),\"x\",\"\"))","v":""},{"$f":"IF($B76=\"\",\"\",IF(OR(G76<15,G76=\"\",G76=\"غ\",G76=\"صفر\"=\"\"),\"x\",\"\"))","v":""},{"$f":"IF($B76=\"\",\"\",IF(OR(H76<15,H76=\"\",H76=\"غ\",H76=\"صفر\"=\"\"),\"x\",\"\"))","v":""},{"$f":"IF($B76=\"\",\"\",IF(OR(I76<15,I76=\"\",I76=\"غ\",I76=\"صفر\"=\"\"),\"x\",\"\"))","v":""},{"$f":"IF($B76=\"\",\"\",IF(OR(J76<15,J76=\"\",J76=\"غ\",J76=\"صفر\"=\"\"),\"x\",\"\"))","v":""},{"$f":"IF($B76=\"\",\"\",IF(OR(K76<15,K76=\"\",K76=\"غ\",K76=\"صفر\"=\"\"),\"x\",\"\"))","v":""},{"$f":"IF($B76=\"\",\"\",IF(OR(L76<15,L76=\"\",L76=\"غ\",L76=\"صفر\"=\"\"),\"x\",\"\"))","v":""},{"$f":"IF(B76=\"\",\"\",COUNTBLANK(T76:AB76))","v":9},{"$f":"IF(B76=\"\",\"\",COUNTIF(T76:AB76,\"x\"))","v":0},{"$f":"IF(B76=\"\",\"\",IF(AC76=9,\"ناجح\",\"دور ثانى\"))","v":"ناجح"},{"$f":"IF(T76=\"x\",\"الرياضيات / \",\"\")","v":""},{"$f":"IF(U76=\"x\",\"الدراسات الاجتماعية / \",\"\")","v":""},{"$f":"IF(V76=\"x\",\"الحوسبة وتكنولوجيا المعلومات / \",\"\")","v":""},{"$f":"IF(W76=\"x\",\"الكيمياء / \",\"\")","v":""},{"$f":"IF(X76=\"x\",\"الفيزياء / \",\"\")","v":""},{"$f":"IF(Y76=\"x\",\"الأحياء / \",\"\")","v":""},{"$f":"IF(Z76=\"x\",\"التربية الإسلامية / \",\"\")","v":""},{"$f":"IF(AA76=\"x\",\"اللغة العربية / \",\"\")","v":""},{"$f":"IF(AB76=\"x\",\"اللغة الإنجليزية / \",\"\")","v":""},null,66,"وليد الامين عثمان",208.50001315789473,{"$f":"IFERROR(IF(M76=\" \",\" \",IF(M76=\"غ\",\"غ\",RANK(M76,$M$11:$M$247))),\"\")","v":66},{"$f":"AE76","v":"ناجح"}]
[67,"يزيد سامح حسنى محيسن","10 - 2",30,30,27.5,30,30,29,26,26,22,250.5,"ناجح",0.92777777777777781,"ممتاز",null,"",null,"","","","","","","","","",9,0,"ناجح","","","","","","","","","",null,67,"يزيد سامح حسنى محيسن",250.50001298701298,14,"ناجح"]
[68,"يوسف محمد عطيه عطيه حسن","10 - 2",29,27,28,30,29,30,23,27,26,249,"ناجح",0.92222222222222228,"ممتاز",null,"",null,"","","","","","","","","",9,0,"ناجح","","","","","","","","","",null,68,"يوسف محمد عطيه عطيه حسن",249.00001282051281,18,"ناجح"]
[69,"احمد حافظ محمد ابوالكلام كبيرالدين","10 - 3",9.5,18.5,20.5,12,16,11,20,15,17,139.5,"دور ثانى",0.51666666666666672,"مقبول",null,"الرياضيات / الكيمياء / الأحياء / ",null,"x","","","x","","x","","","",6,3,"دور ثانى","الرياضيات / ","","","الكيمياء / ","","الأحياء / ","","","",null,69,"احمد حافظ محمد ابوالكلام كبيرالدين",139.50001265822786,159,"دور ثانى"]
[70,"احمد محمد احمد قنبر بلال","10 - 3",16,24,22.5,11,16,14,17.5,8,12.5,141.5,"دور ثانى",0.52407407407407403,"مقبول",null,"الكيمياء / الأحياء / اللغة العربية / اللغة الإنجليزية / ",null,"","","","x","","x","","x","x",5,4,"دور ثانى","","","","الكيمياء / ","","الأحياء / ","","اللغة العربية / ","اللغة الإنجليزية / ",null,70,"احمد محمد احمد قنبر بلال",141.5000125,157,"دور ثانى"]
[71,"امان رشيد خان جول جنان","10 - 3",12.5,15.5,21.5,11,10.5,14,13,13,15,126,"دور ثانى",0.46666666666666662,"دون المستوى",null,"الرياضيات / الكيمياء / الفيزياء / الأحياء / التربية الإسلامية / اللغة العربية / ",null,"x","","","x","x","x","x","x","",3,6,"دور ثانى","الرياضيات / ","","","الكيمياء / ","الفيزياء / ","الأحياء / ","التربية الإسلامية / ","اللغة العربية / ","",null,71,"امان رشيد خان جول جنان",126.00001234567901,182,"دور ثانى"]
[72,"ايسر جهاد عبدالفتاح كراز","10 - 3",5,18.5,24.5,15,10.5,14,16,15,8,126.5,"دور ثانى",0.4685185185185185,"دون المستوى",null,"الرياضيات / الفيزياء / الأحياء / اللغة الإنجليزية / ",null,"x","","","","x","x","","","x",5,4,"دور ثانى","الرياضيات / ","","","","الفيزياء / ","الأحياء / ","","","اللغة الإنجليزية / ",null,72,"ايسر جهاد عبدالفتاح كراز",126.50001219512195,181,"دور ثانى"]
[73,"بخيت مبخوت سالم سعيد خوار","10 - 3",22.5,16,25.5,17.5,21,13,14,17,14.5,161,"دور ثانى",0.59629629629629632,"مقبول",null,"الأحياء / التربية الإسلامية / اللغة الإنجليزية / ",null,"","","","","","x","x","","x",6,3,"دور ثانى","","","","","","الأحياء / ","التربية الإسلامية / ","","اللغة الإنجليزية / ",null,73,"بخيت مبخوت سالم سعيد خوار",161.00001204819276,127,"دور ثانى"]
[74,"تميم محمد ابراهيم محمد فلامرزى","10 - 3",10.5,8,19.5,14,15,7.5,11,13,12,110.5,"دور ثانى",0.40925925925925921,"دون المستوى",null,"الرياضيات / الدراسات الاجتماعية / الكيمياء / الأحياء / التربية الإسلامية / اللغة العربية / اللغة الإنجليزية / ",null,"x","x","","x","","x","x","x","x",2,7,"دور ثانى","الرياضيات / ","الدراسات الاجتماعية / ","","الكيمياء / ","","الأحياء / ","التربية الإسلامية / ","اللغة العربية / ","اللغة الإنجليزية / ",null,74,"تميم محمد ابراهيم محمد فلامرزى",110.50001190476191,204,"دور ثانى"]
[75,"جابر سعد سالم النابت المرى","10 - 3",11,19,18.5,13,15.5,6.5,14,15,9.5,122,"دور ثانى",0.45185185185185184,"دون المستوى",null,"الرياضيات / الكيمياء / الأحياء / التربية الإسلامية / اللغة الإنجليزية / ",null,"x","","","x","","x","x","","x",4,5,"دور ثانى","الرياضيات / ","","","الكيمياء / ","","الأحياء / ","التربية الإسلامية / ","","اللغة الإنجليزية / ",null,75,"جابر سعد سالم النابت المرى",122.00001176470589,187,"دور ثانى"]
[76,"جاسم عبدالله خالد عبدالله الكثيرى","10 - 3",19,17.5,18,9.5,15,13,15.5,16,6,129.5,"دور ثانى",0.47962962962962963,"دون المستوى",null,"الكيمياء / الأحياء / اللغة الإنجليزية / ",null,"","","","x","","x","","","x",6,3,"دور ثانى","","","","الكيمياء / ","","الأحياء / ","","","اللغة الإنجليزية / ",null,76,"جاسم عبدالله خالد عبدالله الكثيرى",129.50001162790699,174,"دور ثانى"]
[77,"حمد راشد حمد ال شابل المرى","10 - 3",20,16,16,12,19,11,20,18.5,8.5,141,"دور ثانى",0.52222222222222225,"مقبول",null,"الكيمياء / الأحياء / اللغة الإنجليزية / ",null,"","","","x","","x","","","x",6,3,"دور ثانى","","","","الكيمياء / ","","الأحياء / ","","","اللغة الإنجليزية / ",null,77,"حمد راشد حمد ال شابل المرى",141.00001149425287,158,"دور ثانى"]
[78,"خالد حسين بلوج زنى","10 - 3",7.5,5.5,20.5,6,11,8,14.5,14,14,101,"دور ثانى",0.37407407407407406,"دون المستوى",null,"الرياضيات / الدراسات الاجتماعية / الكيمياء / الفيزياء / الأحياء / التربية الإسلامية / اللغة العربية / اللغة الإنجليزية / ",null,"x","x","","x","x","x","x","x","x",1,8,"دور ثانى","الرياضيات / ","الدراسات الاجتماعية / ","","الكيمياء / ","الفيزياء / ","الأحياء / ","التربية الإسلامية / ","اللغة العربية / ","اللغة الإنجليزية / ",null,78,"خالد حسين بلوج زنى",101.00001136363636,213,"دور ثانى"]
[79,"خلف فرحان عقيل الرويلى العنزى","10 - 3",13,13.5,21.5,7,14.5,11,12,9,10,111.5,"دور ثانى",0.41296296296296298,"دون المستوى",null,"الرياضيات / الدراسات الاجتماعية / الكيمياء / الفيزياء / الأحياء / التربية الإسلامية / اللغة العربية / اللغة الإنجليزية / ",null,"x","x","","x","x","x","x","x","x",1,8,"دور ثانى","الرياضيات / ","الدراسات الاجتماعية / ","","الكيمياء / ","الفيزياء / ","الأحياء / ","التربية الإسلامية / ","اللغة العربية / ","اللغة الإنجليزية / ",null,79,"خلف فرحان عقيل الرويلى العنزى",111.50001123595506,200,"دور ثانى"]
[80,"راشد خالد على محمد النديله","10 - 3",24,12,21,17.5,23,18,19,20,16.5,171,"دور ثانى",0.6333333333333333,"مقبول",null,"الدراسات الاجتماعية / ",null,"","x","","","","","","","",8,1,"دور ثانى","","الدراسات الاجتماعية / ","","","","","","","",null,80,"راشد خالد على محمد النديله",171.00001111111112,111,"دور ثانى"]
[81,"سالم سعد سالم النابت المرى","10 - 3",4.5,15,19,13,18.5,11.5,11,12,6.5,111,"دور ثانى",0.41111111111111109,"دون المستوى",null,"الرياضيات / الكيمياء / الأحياء / التربية الإسلامية / اللغة العربية / اللغة الإنجليزية / ",null,"x","","","x","","x","x","x","x",3,6,"دور ثانى","الرياضيات / ","","","الكيمياء / ","","الأحياء / ","التربية الإسلامية / ","اللغة العربية / ","اللغة الإنجليزية / ",null,81,"سالم سعد سالم النابت المرى",111.00001098901099,202,"دور ثانى"]
[82,"سالم على محمد سالم خوار","10 - 3",10,15,20.5,9,17,8,13.5,14,"غ",107,"دور ثانى",0.39629629629629631,"دون المستوى",null,"الرياضيات / الكيمياء / الأحياء / التربية الإسلامية / اللغة العربية / اللغة الإنجليزية / ",null,"x","","","x","","x","x","x","x",3,6,"دور ثانى","الرياضيات / ","","","الكيمياء / ","","الأحياء / ","التربية الإسلامية / ","اللغة العربية / ","اللغة الإنجليزية / ",null,82,"سالم على محمد سالم خوار",107.00001086956522,208,"دور ثانى"]
[83,"سعيد حسين ناصر ال شافعه المرى","10 - 3",16.5,13.5,21.5,9,16,12,18.5,16,16,139,"دور ثانى",0.51481481481481484,"مقبول",null,"الدراسات الاجتماعية / الكيمياء / الأحياء / ",null,"","x","","x","","x","","","",6,3,"دور ثانى","","الدراسات الاجتماعية / ","","الكيمياء / ","","الأحياء / ","","","",null,83,{"$f":"B93","v":"سعيد حسين ناصر ال شافعه المرى"},139.00001075268818,162,"دور ثانى"]
[84,"شاهين علي","10 - 3",20,10,22,8,13,10,12,11,24.5,130.5,"دور ثانى",0.48333333333333334,"دون المستوى",null,"الدراسات الاجتماعية / الكيمياء / الفيزياء / الأحياء / التربية الإسلامية / اللغة العربية / ",null,"","x","","x","x","x","x","x","",3,6,"دور ثانى","","الدراسات الاجتماعية / ","","الكيمياء / ","الفيزياء / ","الأحياء / ","التربية الإسلامية / ","اللغة العربية / ","",null,84,"شاهين علي",130.50001063829788,171,"دور ثانى"]
[85,"عبدالرحمن فرج محمد المشعلى القحطانى","10 - 3",15.5,12.5,21,12,26,13,26.5,18,17.5,162,"دور ثانى",0.6,"مقبول",null,"الدراسات الاجتماعية / الكيمياء / الأحياء / ",null,"","x","","x","","x","","","",6,3,"دور ثانى","","الدراسات الاجتماعية / ","","الكيمياء / ","","الأحياء / ","","","",null,85,"عبدالرحمن فرج محمد المشعلى القحطانى",162.00001052631578,125,"دور ثانى"]
[86,"عبدالرشيد حسين عبدي","10 - 3",12,16.5,22,7,16,7.5,12,15,8,116,"دور ثانى",0.42962962962962964,"دون المستوى",null,"الرياضيات / الكيمياء / الأحياء / التربية الإسلامية / اللغة الإنجليزية / ",null,"x","","","x","","x","x","","x",4,5,"دور ثانى","الرياضيات / ","","","الكيمياء / ","","الأحياء / ","التربية الإسلامية / ","","اللغة الإنجليزية / ",null,86,"عبدالرشيد حسين عبدي",116.00001041666667,194,"دور ثانى"]
[87,"عبدالله سعيد بخيت سعيد خوار","10 - 3",15,11.5,14,13.5,20,13.5,18.5,22,15.5,143.5,"دور ثانى",0.53148148148148144,"مقبول",null,"الدراسات الاجتماعية / الحوسبة وتكنولوجيا المعلومات / الكيمياء / الأحياء / ",null,"","x","x","x","","x","","","",5,4,"دور ثانى","","الدراسات الاجتماعية / ","الحوسبة وتكنولوجيا المعلومات / ","الكيمياء / ","","الأحياء / ","","","",null,87,"عبدالله سعيد بخيت سعيد خوار",143.50001030927834,155,"دور ثانى"]
[88,"عبدالله سعيد عبدالله آل نابت المرى","10 - 3",22.5,15.5,15,15.5,22.5,11,14,14,16.5,146.5,"دور ثانى",0.54259259259259263,"مقبول",null,"الأحياء / التربية الإسلامية / اللغة العربية / ",null,"","","","","","x","x","x","",6,3,"دور ثانى","","","","","","الأحياء / ","التربية الإسلامية / ","اللغة العربية / ","",null,88,"عبدالله سعيد عبدالله آل نابت المرى",146.50001020408163,152,"دور ثانى"]
[89,"عبدالله عادل خصيف","10 - 3","غ","غ","غ","غ","غ","غ","غ","غ","غ","غ","دور ثانى","غ","غ",null,"الرياضيات / الدراسات الاجتماعية / الحوسبة وتكنولوجيا المعلومات / الكيمياء / الفيزياء / الأحياء / التربية الإسلامية / اللغة العربية / اللغة الإنجليزية / ",null,"x","x","x","x","x","x","x","x","x",0,9,"دور ثانى","الرياضيات / ","الدراسات الاجتماعية / ","الحوسبة وتكنولوجيا المعلومات / ","الكيمياء / ","الفيزياء / ","الأحياء / ","التربية الإسلامية / ","اللغة العربية / ","اللغة الإنجليزية / ",null,89,"عبدالله عادل خصيف","غ","غ","دور ثانى"]
[90,"عبدالله مبارك سالم بطى الكعبى","10 - 3",20.5,21,18,16.5,29,13,16,17.5,19,170.5,"دور ثانى",0.63148148148148153,"مقبول",null,"الأحياء / ",null,"","","","","","x","","","",8,1,"دور ثانى","","","","","","الأحياء / ","","","",null,90,"عبدالله مبارك سالم بطى الكعبى",170.50001,112,"دور ثانى"]
[91,"على عجيم على عجيم الحبابى","10 - 3",15,26.5,21,19,19,11.5,12,15,19,158,"دور ثانى",0.58518518518518514,"مقبول",null,"الأحياء / التربية الإسلامية / ",null,"","","","","","x","x","","",7,2,"دور ثانى","","","","","","الأحياء / ","التربية الإسلامية / ","","",null,91,"على عجيم على عجيم الحبابى",158.00000990099011,132,"دور ثانى"]
[92,"على فهد على احمد محمد","10 - 3",15,10.5,15,9,18,9,17,19,16.5,129,"دور ثانى",0.4777777777777778,"دون المستوى",null,"الدراسات الاجتماعية / الكيمياء / الأحياء / ",null,"","x","","x","","x","","","",6,3,"دور ثانى","","الدراسات الاجتماعية / ","","الكيمياء / ","","الأحياء / ","","","",null,92,"على فهد على احمد محمد",129.00000980392156,176,"دور ثانى"]
[93,"عمر عبيدالله روح الامين مريضا","10 - 3",11,8.5,19.5,10,9,10.5,18.5,13,25.5,125.5,"دور ثانى",0.46481481481481479,"دون المستوى",null,"الرياضيات / الدراسات الاجتماعية / الكيمياء / الفيزياء / الأحياء / اللغة العربية / ",null,"x","x","","x","x","x","","x","",3,6,"دور ثانى","الرياضيات / ","الدراسات الاجتماعية / ","","الكيمياء / ","الفيزياء / ","الأحياء / ","","اللغة العربية / ","",null,93,"عمر عبيدالله روح الامين مريضا",125.50000970873786,183,"دور ثانى"]
[94,"ماجد صلاح خميس يوسف ابراهيم","10 - 3","غ","غ","غ","غ","غ",6,11,"غ",5,22,"دور ثانى",8.1481481481481488E-2,"دون المستوى",null,"الرياضيات / الدراسات الاجتماعية / الحوسبة وتكنولوجيا المعلومات / الكيمياء / الفيزياء / الأحياء / التربية الإسلامية / اللغة العربية / اللغة الإنجليزية / ",null,"x","x","x","x","x","x","x","x","x",0,9,"دور ثانى","الرياضيات / ","الدراسات الاجتماعية / ","الحوسبة وتكنولوجيا المعلومات / ","الكيمياء / ","الفيزياء / ","الأحياء / ","التربية الإسلامية / ","اللغة العربية / ","اللغة الإنجليزية / ",null,94,"ماجد صلاح خميس يوسف ابراهيم",22.000009615384617,227,"دور ثانى"]
[95,"محمد عبدالله عبدالله ابراهيم الخليفى","10 - 3",19.5,14.5,23,15.5,13,5,13,12,15.5,131,"دور ثانى",0.48518518518518516,"دون المستوى",null,"الدراسات الاجتماعية / الفيزياء / الأحياء / التربية الإسلامية / اللغة العربية / ",null,"","x","","","x","x","x","x","",4,5,"دور ثانى","","الدراسات الاجتماعية / ","","","الفيزياء / ","الأحياء / ","التربية الإسلامية / ","اللغة العربية / ","",null,95,"محمد عبدالله عبدالله ابراهيم الخليفى",131.00000952380952,170,"دور ثانى"]
[96,"محمد عبدالله محمد جاسم السويدى","10 - 3",22.5,13,17,19,11,0,14.5,17,16.5,130.5,"دور ثانى",0.48333333333333334,"دون المستوى",null,"الدراسات الاجتماعية / الفيزياء / الأحياء / التربية الإسلامية / ",null,"","x","","","x","x","x","","",5,4,"دور ثانى","","الدراسات الاجتماعية / ","","","الفيزياء / ","الأحياء / ","التربية الإسلامية / ","","",null,96,"محمد عبدالله محمد جاسم السويدى",130.50000943396228,171,"دور ثانى"]
[97,"محمدزين عبدالحميد المبارك على","10 - 3",12,14.5,13,16,15,8,12,17,14.5,122,"دور ثانى",0.45185185185185184,"دون المستوى",null,"الرياضيات / الدراسات الاجتماعية / الحوسبة وتكنولوجيا المعلومات / الأحياء / التربية الإسلامية / اللغة الإنجليزية / ",null,"x","x","x","","","x","x","","x",3,6,"دور ثانى","الرياضيات / ","الدراسات الاجتماعية / ","الحوسبة وتكنولوجيا المعلومات / ","","","الأحياء / ","التربية الإسلامية / ","","اللغة الإنجليزية / ",null,{"$f":"A107","v":97},"محمدزين عبدالحميد المبارك على",122.0000093457944,187,"دور ثانى"]
[98,"محمود اسعد الحاج الخلف","10 - 3",10.5,17.5,16,7,19,12,17.5,17.5,18,135,"دور ثانى",0.5,"مقبول",null,"الرياضيات / الكيمياء / الأحياء / ",null,"x","","","x","","x","","","",6,3,"دور ثانى","الرياضيات / ","","","الكيمياء / ","","الأحياء / ","","","",null,98,"محمود اسعد الحاج الخلف",135.00000925925926,166,"دور ثانى"]
[99,"مسفر سعد محمد ذفال الحبابى","10 - 3","غ","غ","غ","غ","غ",12,13,"غ",13,38,"دور ثانى",0.14074074074074075,"دون المستوى",null,"الرياضيات / الدراسات الاجتماعية / الحوسبة وتكنولوجيا المعلومات / الكيمياء / الفيزياء / الأحياء / التربية الإسلامية / اللغة العربية / اللغة الإنجليزية / ",null,"x","x","x","x","x","x","x","x","x",0,9,"دور ثانى","الرياضيات / ","الدراسات الاجتماعية / ","الحوسبة وتكنولوجيا المعلومات / ","الكيمياء / ","الفيزياء / ","الأحياء / ","التربية الإسلامية / ","اللغة العربية / ","اللغة الإنجليزية / ",null,99,"مسفر سعد محمد ذفال الحبابى",38.000009174311927,226,"دور ثانى"]
[100,"ناصر جهان بخش مرادك درزاده","10 - 3",7.5,7,20,15,11,13.5,15.5,17.5,14,121,"دور ثانى",0.44814814814814807,"دون المستوى",null,"الرياضيات / الدراسات الاجتماعية / الفيزياء / الأحياء / اللغة الإنجليزية / ",null,"x","x","","","x","x","","","x",4,5,"دور ثانى","الرياضيات / ","الدراسات الاجتماعية / ","","","الفيزياء / ","الأحياء / ","","","اللغة الإنجليزية / ",null,100,"ناصر جهان بخش مرادك درزاده",121.00000909090909,190,"دور ثانى"]
[101,"ناصر محمد خالد احمد الغانم","10 - 3",8,10,20,11,20,9.5,17,14,12,121.5,"دور ثانى",0.45,"دون المستوى",null,"الرياضيات / الدراسات الاجتماعية / الكيمياء / الأحياء / اللغة العربية / اللغة الإنجليزية / ",null,"x","x","","x","","x","","x","x",3,6,"دور ثانى","الرياضيات / ","الدراسات الاجتماعية / ","","الكيمياء / ","","الأحياء / ","","اللغة العربية / ","اللغة الإنجليزية / ",null,101,"ناصر محمد خالد احمد الغانم",121.50000900900901,189,"دور ثانى"]
[102,"يوسف صالح على عبدالعزيز على","10 - 3",23,10,18.5,16.5,23,15.5,10,16,23.5,156,"دور ثانى",0.57777777777777772,"مقبول",null,"الدراسات الاجتماعية / التربية الإسلامية / ",null,"","x","","","","","x","","",7,2,"دور ثانى","","الدراسات الاجتماعية / ","","","","","التربية الإسلامية / ","","",null,102,"يوسف صالح على عبدالعزيز على",156.00000892857142,137,"دور ثانى"]
[103,"احمد رائد سليمان المومني","10 - 4",11.5,21,27,11.5,20,10.5,22,22,18.5,164,"دور ثانى",0.6074074074074074,"مقبول",null,"الرياضيات / الكيمياء / الأحياء / ",null,"x","","","x","","x","","","",6,3,"دور ثانى","الرياضيات / ","","","الكيمياء / ","","الأحياء / ","","","",null,103,"احمد رائد سليمان المومني",164.00000884955753,120,"دور ثانى"]
[104,"أحمد نافذ حماده حموده","10 - 4",12,22,18,20.5,17,12,23,17.5,18,160,"دور ثانى",0.59259259259259256,"مقبول",null,"الرياضيات / الأحياء / ",null,"x","","","","","x","","","",7,2,"دور ثانى","الرياضيات / ","","","","","الأحياء / ","","","",null,104,"أحمد نافذ حماده حموده",160.00000877192983,128,"دور ثانى"]
[105,"أحمد يوسف خالد يوسف شراب","10 - 4",16.5,20,16,19.5,18,15,22,19.5,17.5,164,"ناجح",0.6074074074074074,"مقبول",null,"",null,"","","","","","","","","",9,0,"ناجح","","","","","","","","","",null,105,"أحمد يوسف خالد يوسف شراب",164.00000869565218,120,"ناجح"]
[106,"تميم سالم راشد الصعاق المرى","10 - 4",14,11,17,13.5,20,6,17,14.5,6.5,119.5,"دور ثانى",0.44259259259259259,"دون المستوى",null,"الرياضيات / الدراسات الاجتماعية / الكيمياء / الأحياء / اللغة العربية / اللغة الإنجليزية / ",null,"x","x","","x","","x","","x","x",3,6,"دور ثانى","الرياضيات / ","الدراسات الاجتماعية / ","","الكيمياء / ","","الأحياء / ","","اللغة العربية / ","اللغة الإنجليزية / ",null,106,"تميم سالم راشد الصعاق المرى",119.50000862068966,192,"دور ثانى"]
[107,"جابر سعيد جابر سالم اليربوعى","10 - 4",13.5,12.5,19,17,7,8,15,15,"غ",107,"دور ثانى",0.39629629629629631,"دون المستوى",null,"الرياضيات / الدراسات الاجتماعية / الفيزياء / الأحياء / اللغة الإنجليزية / ",null,"x","x","","","x","x","","","x",4,5,"دور ثانى","الرياضيات / ","الدراسات الاجتماعية / ","","","الفيزياء / ","الأحياء / ","","","اللغة الإنجليزية / ",null,107,"جابر سعيد جابر سالم اليربوعى",107.00000854700855,208,"دور ثانى"]
[108,"جاسم محمود محمد عبداللهي","10 - 4",20.5,26,16,20,20,14,24,23.5,18,182,"دور ثانى",0.67407407407407405,"جيد",null,"الأحياء / ",null,"","","","","","x","","","",8,1,"دور ثانى","","","","","","الأحياء / ","","","",null,108,"جاسم محمود محمد عبداللهي",182.00000847457628,100,"دور ثانى"]
[109,"جاسم ناصر جاسم محمد المفتاح","10 - 4",23.5,19.5,17.5,17,26,19.5,17.5,21,29.5,191,"ناجح",0.70740740740740737,"جيد",null,"",null,"","","","","","","","","",9,0,"ناجح","","","","","","","","","",null,109,"جاسم ناصر جاسم محمد المفتاح",191.00000840336133,91,"ناجح"]
[110,"حمد محمد بخيت تويم المرى","10 - 4",19,15.5,11,12,20,7,20.5,18,16.5,139.5,"دور ثانى",0.51666666666666672,"مقبول",null,"الحوسبة وتكنولوجيا المعلومات / الكيمياء / الأحياء / ",null,"","","x","x","","x","","","",6,3,"دور ثانى","","","الحوسبة وتكنولوجيا المعلومات / ","الكيمياء / ","","الأحياء / ","","","",null,110,"حمد محمد بخيت تويم المرى",139.50000833333334,159,"دور ثانى"]
[111,"خالد سعيد محمد البريكان المرى","10 - 4",14,24,18.5,22,22,21,24,23,15.5,184,"دور ثانى",0.68148148148148158,"جيد",null,"الرياضيات / ",null,"x","","","","","","","","",8,1,"دور ثانى","الرياضيات / ","","","","","","","","",null,111,"خالد سعيد محمد البريكان المرى",184.00000826446282,97,"دور ثانى"]
[112,"خميس محمد سيف خميس الريامي","10 - 4",18,19.5,21.5,17,15,11.5,24.5,15,12.5,154.5,"دور ثانى",0.57222222222222219,"مقبول",null,"الأحياء / اللغة الإنجليزية / ",null,"","","","","","x","","","x",7,2,"دور ثانى","","","","","","الأحياء / ","","","اللغة الإنجليزية / ",null,112,"خميس محمد سيف خميس الريامي",154.50000819672132,139,"دور ثانى"]
[113,"راشد حمد راشد سالم خادم","10 - 4",14.5,9.5,19,7.5,13,8.5,13,8,"غ",93,"دور ثانى",0.34444444444444444,"دون المستوى",null,"الرياضيات / الدراسات الاجتماعية / الكيمياء / الفيزياء / الأحياء / التربية الإسلامية / اللغة العربية / اللغة الإنجليزية / ",null,"x","x","","x","x","x","x","x","x",1,8,"دور ثانى","الرياضيات / ","الدراسات الاجتماعية / ","","الكيمياء / ","الفيزياء / ","الأحياء / ","التربية الإسلامية / ","اللغة العربية / ","اللغة الإنجليزية / ",null,113,"راشد حمد راشد سالم خادم",93.000008130081298,219,"دور ثانى"]
[114,"سالم حمد سالم اليربوعى المرى","10 - 4","غ","غ","غ","غ","غ","غ","غ","غ","غ","غ","دور ثانى","غ","غ",null,"الرياضيات / الدراسات الاجتماعية / الحوسبة وتكنولوجيا المعلومات / الكيمياء / الفيزياء / الأحياء / التربية الإسلامية / اللغة العربية / اللغة الإنجليزية / ",null,"x","x","x","x","x","x","x","x","x",0,9,"دور ثانى","الرياضيات / ","الدراسات الاجتماعية / ","الحوسبة وتكنولوجيا المعلومات / ","الكيمياء / ","الفيزياء / ","الأحياء / ","التربية الإسلامية / ","اللغة العربية / ","اللغة الإنجليزية / ",null,114,"سالم حمد سالم اليربوعى المرى","غ","غ","دور ثانى"]
[115,"سليمان حسن علي سليمان موسى","10 - 4",17.5,16,19.5,16,18.5,13.5,26,19,15.5,161.5,"دور ثانى",0.5981481481481481,"مقبول",null,"الأحياء / ",null,"","","","","","x","","","",8,1,"دور ثانى","","","","","","الأحياء / ","","","",null,115,{"$f":"B125","v":"سليمان حسن علي سليمان موسى"},{"$f":"IF(M125=\"\",\"\",IF(M125=\"غ\",\"غ\",M125+1/ROW()*0.001))","v":161.50000800000001},126,"دور ثانى"]
[116,"شعيب عبدي قرني قلديد","10 - 4",10,11.5,17,13,19,11.5,20,17.5,9.5,129,"دور ثانى",0.4777777777777778,"دون المستوى",null,"الرياضيات / الدراسات الاجتماعية / الكيمياء / الأحياء / اللغة الإنجليزية / ",null,"x","x","","x","","x","","","x",4,5,"دور ثانى","الرياضيات / ","الدراسات الاجتماعية / ","","الكيمياء / ","","الأحياء / ","","","اللغة الإنجليزية / ",null,116,"شعيب عبدي قرني قلديد",129.00000793650793,176,"دور ثانى"]
[117,"عابدين حافظ عابدين موسى","10 - 4",10,18.5,20.5,15,19,11.5,18,17.5,18.5,148.5,"دور ثانى",0.55000000000000004,"مقبول",null,"الرياضيات / الأحياء / ",null,"x","","","","","x","","","",7,2,"دور ثانى","الرياضيات / ","","","","","الأحياء / ","","","",null,117,"عابدين حافظ عابدين موسى",148.50000787401575,149,"دور ثانى"]
[118,"عبدالرحمن صبرى عثمان محسن اليهرى","10 - 4",17.5,24,21,15.5,22,12.5,21,17.5,12,163,"دور ثانى",0.60370370370370374,"مقبول",null,"الأحياء / اللغة الإنجليزية / ",null,"","","","","","x","","","x",7,2,"دور ثانى","","","","","","الأحياء / ","","","اللغة الإنجليزية / ",null,118,"عبدالرحمن صبرى عثمان محسن اليهرى",163.0000078125,123,"دور ثانى"]
[119,"عبدالله سالم محمد سالم خوار","10 - 4",9,17,20.5,24,13.5,8,14,9,"غ",115,"دور ثانى",0.42592592592592593,"دون المستوى",null,"الرياضيات / الفيزياء / الأحياء / التربية الإسلامية / اللغة العربية / اللغة الإنجليزية / ",null,"x","","","","x","x","x","x","x",3,6,"دور ثانى","الرياضيات / ","","","","الفيزياء / ","الأحياء / ","التربية الإسلامية / ","اللغة العربية / ","اللغة الإنجليزية / ",null,119,"عبدالله سالم محمد سالم خوار",115.00000775193799,196,"دور ثانى"]
[120,"عبدالله ضيف الله برمان الدوسري","10 - 4",25,26.5,23,26,23,24.5,27,21,23.5,219.5,"ناجح",0.812962962962963,"جيد جدا",null,"",null,"","","","","","","","","",9,0,"ناجح","","","","","","","","","",null,120,"عبدالله ضيف الله برمان الدوسري",219.50000769230769,52,"ناجح"]
[121,"عدي فريد احمد حسين","10 - 4",22,27,26,22.5,18.5,19,20.5,25,19.5,200,"ناجح",0.74074074074074081,"جيد",null,"",null,"","","","","","","","","",9,0,"ناجح","","","","","","","","","",null,121,"عدي فريد احمد حسين",200.00000763358778,82,"ناجح"]
[122,"عزيز خالد سالم ابو شنار","10 - 4",18,20.5,20.5,26.5,20,20,24.5,27,24,201,"ناجح",0.74444444444444446,"جيد",null,"",null,"","","","","","","","","",9,0,"ناجح","","","","","","","","","",null,122,"عزيز خالد سالم ابو شنار",201.00000757575756,80,"ناجح"]
[123,"على محمد عويض الصقور المرى","10 - 4",12,13,15.5,16,10.5,11,17,18,17.5,130.5,"دور ثانى",0.48333333333333334,"دون المستوى",null,"الرياضيات / الدراسات الاجتماعية / الفيزياء / الأحياء / ",null,"x","x","","","x","x","","","",5,4,"دور ثانى","الرياضيات / ","الدراسات الاجتماعية / ","","","الفيزياء / ","الأحياء / ","","","",null,123,"على محمد عويض الصقور المرى",130.50000751879699,171,"دور ثانى"]
[124,"علي عاطف سالم ابراهيم سالم","10 - 4",11.5,19,20,16,7,13,24,21,24,155.5,"دور ثانى",0.57592592592592595,"مقبول",null,"الرياضيات / الفيزياء / الأحياء / ",null,"x","","","","x","x","","","",6,3,"دور ثانى","الرياضيات / ","","","","الفيزياء / ","الأحياء / ","","","",null,124,"علي عاطف سالم ابراهيم سالم",155.50000746268657,138,"دور ثانى"]
[125,"علي محمد عبدالله احمد شمس","10 - 4",20.5,12,17.5,24,18,16,21,21.5,17.5,168,"دور ثانى",0.62222222222222223,"مقبول",null,"الدراسات الاجتماعية / ",null,"","x","","","","","","","",8,1,"دور ثانى","","الدراسات الاجتماعية / ","","","","","","","",null,125,"علي محمد عبدالله احمد شمس",168.0000074074074,114,"دور ثانى"]
[126,"عمر محمد محمود ابوزاهر","10 - 4",30,29,26,30,30,29,29,29,22.5,254.5,"ناجح",0.94259259259259254,"ممتاز",null,"",null,"","","","","","","","","",9,0,"ناجح","","","","","","","","","",null,126,"عمر محمد محمود ابوزاهر",254.50000735294117,10,"ناجح"]
[127,"فهد سويد سلطان محمد الخوار","10 - 4",10,19,18,10.5,12,7.5,20,15,17.5,129.5,"دور ثانى",0.47962962962962963,"دون المستوى",null,"الرياضيات / الكيمياء / الفيزياء / الأحياء / ",null,"x","","","x","x","x","","","",5,4,"دور ثانى","الرياضيات / ","","","الكيمياء / ","الفيزياء / ","الأحياء / ","","","",null,127,"فهد سويد سلطان محمد الخوار",129.50000729927007,174,"دور ثانى"]
[128,"محمد حافظ محمد ابوالكلام كبيرالدين","10 - 4",8,24,22,12,16,16,20,20.5,21.5,160,"دور ثانى",0.59259259259259256,"مقبول",null,"الرياضيات / الكيمياء / ",null,"x","","","x","","","","","",7,2,"دور ثانى","الرياضيات / ","","","الكيمياء / ","","","","","",null,128,"محمد حافظ محمد ابوالكلام كبيرالدين",160.00000724637681,128,"دور ثانى"]
[129,"محمد حسن حسن ناجى الجدره","10 - 4",17,20.5,19,12,14,14,22.5,19.5,16,{"$f":"IF(B139=\"\",\"\",IF(AND(D139=\"غ\",E139=\"غ\",F139=\"غ\",G139=\"غ\",H139=\"غ\",I139=\"غ\",J139=\"غ\",K139=\"غ\",L139=\"غ\"),\"غ\",SUM(D139,E139,F139,G139,H139,I139,J139,K139,L139)))","v":154.5},{"$f":"IF(B139=\"\",\"\",AE139)","v":"دور ثانى"},{"$f":"IF(B139=\"\",\"\",IF(M139=\"غ\",\"غ\",M139/$M$10*100/100))","v":0.57222222222222219},"مقبول",null,"الكيمياء / الفيزياء / الأحياء / ",null,"","","","x","x","x","","","",6,3,"دور ثانى","","","","الكيمياء / ","الفيزياء / ","الأحياء / ","","","",null,129,"محمد حسن حسن ناجى الجدره",154.5000071942446,139,"دور ثانى"]
[{"$f":"ROW()-10","v":130},"محمد حمد محمد صالح الصرامى","10 - 4",12,10,19.5,14,24,10,24,20,21,154.5,"دور ثانى",0.57222222222222219,{"$f":"IF(M140=\"\",\"\",IF(M140=\"غ\",\"غ\",IF(M140=0,\"دون المستوى\",IF(M140/$M$10*100>=85,\"ممتاز\",IF(M140/$M$10*100>=75,\"جيد جدا\",IF(M140/$M$10*100>=65,\"جيد\",IF(M140/$M$10*100>=50,\"مقبول\",IF(M140/$M$10*100<50,\"دون المستوى\"))))))))","v":"مقبول"},null,{"$f":"CONCATENATE(AF140,AG140,AH140,AI140,AJ140,AK140,AL140,AM140,AN140)","v":"الرياضيات / الدراسات الاجتماعية / الكيمياء / الأحياء / "},null,{"$f":"IF($B140=\"\",\"\",IF(OR(D140<15,D140=\"\",D140=\"غ\",D140=\"صفر\"=\"\"),\"x\",\"\"))","v":"x"},{"$f":"IF($B140=\"\",\"\",IF(OR(E140<15,E140=\"\",E140=\"غ\",E140=\"صفر\"=\"\"),\"x\",\"\"))","v":"x"},{"$f":"IF($B140=\"\",\"\",IF(OR(F140<15,F140=\"\",F140=\"غ\",F140=\"صفر\"=\"\"),\"x\",\"\"))","v":""},{"$f":"IF($B140=\"\",\"\",IF(OR(G140<15,G140=\"\",G140=\"غ\",G140=\"صفر\"=\"\"),\"x\",\"\"))","v":"x"},{"$f":"IF($B140=\"\",\"\",IF(OR(H140<15,H140=\"\",H140=\"غ\",H140=\"صفر\"=\"\"),\"x\",\"\"))","v":""},{"$f":"IF($B140=\"\",\"\",IF(OR(I140<15,I140=\"\",I140=\"غ\",I140=\"صفر\"=\"\"),\"x\",\"\"))","v":"x"},{"$f":"IF($B140=\"\",\"\",IF(OR(J140<15,J140=\"\",J140=\"غ\",J140=\"صفر\"=\"\"),\"x\",\"\"))","v":""},{"$f":"IF($B140=\"\",\"\",IF(OR(K140<15,K140=\"\",K140=\"غ\",K140=\"صفر\"=\"\"),\"x\",\"\"))","v":""},{"$f":"IF($B140=\"\",\"\",IF(OR(L140<15,L140=\"\",L140=\"غ\",L140=\"صفر\"=\"\"),\"x\",\"\"))","v":""},{"$f":"IF(B140=\"\",\"\",COUNTBLANK(T140:AB140))","v":5},{"$f":"IF(B140=\"\",\"\",COUNTIF(T140:AB140,\"x\"))","v":4},{"$f":"IF(B140=\"\",\"\",IF(AC140=9,\"ناجح\",\"دور ثانى\"))","v":"دور ثانى"},{"$f":"IF(T140=\"x\",\"الرياضيات / \",\"\")","v":"الرياضيات / "},{"$f":"IF(U140=\"x\",\"الدراسات الاجتماعية / \",\"\")","v":"الدراسات الاجتماعية / "},{"$f":"IF(V140=\"x\",\"الحوسبة وتكنولوجيا المعلومات / \",\"\")","v":""},{"$f":"IF(W140=\"x\",\"الكيمياء / \",\"\")","v":"الكيمياء / "},{"$f":"IF(X140=\"x\",\"الفيزياء / \",\"\")","v":""},{"$f":"IF(Y140=\"x\",\"الأحياء / \",\"\")","v":"الأحياء / "},{"$f":"IF(Z140=\"x\",\"التربية الإسلامية / \",\"\")","v":""},{"$f":"IF(AA140=\"x\",\"اللغة العربية / \",\"\")","v":""},{"$f":"IF(AB140=\"x\",\"اللغة الإنجليزية / \",\"\")","v":""},null,130,"محمد حمد محمد صالح الصرامى",154.50000714285713,{"$f":"IFERROR(IF(M140=\" \",\" \",IF(M140=\"غ\",\"غ\",RANK(M140,$M$11:$M$247))),\"\")","v":139},{"$f":"AE140","v":"دور ثانى"}]
[131,"محمد عبدالعزيز عبدالكريم يحى يعقوب","10 - 4",22.5,19.5,23,25.5,24,24,24,20,26.5,209,"ناجح",0.77407407407407403,"جيد جدا",null,"",null,"","","","","","","","","",9,0,"ناجح","","","","","","","","","",null,131,"محمد عبدالعزيز عبدالكريم يحى يعقوب",209.00000709219859,65,"ناجح"]
[132,"محمد عبدالله بخيت محمد المهيري","10 - 4",26.5,28,16,24.5,17,26,24.5,22,25.5,210,"ناجح",0.7777777777777779,"جيد جدا",null,"",null,"","","","","","","","","",9,0,"ناجح","","","","","","","","","",null,132,"محمد عبدالله بخيت محمد المهيري",210.00000704225351,63,"ناجح"]
[133,"محمد هشام حامد على ابوخطيطه","10 - 4",29.5,25,26.5,29.5,30,29,26,27.5,27,250,"ناجح",0.92592592592592593,"ممتاز",null,"",null,"","","","","","","","","",9,0,"ناجح","","","","","","","","","",null,133,"محمد هشام حامد على ابوخطيطه",250.00000699300699,15,"ناجح"]
[134,"محمد يوسف محمد ابراهيم محمد","10 - 4",5,16.5,15,10.5,11.5,10,17,16,11.5,113,"دور ثانى",0.41851851851851846,"دون المستوى",null,"الرياضيات / الكيمياء / الفيزياء / الأحياء / اللغة الإنجليزية / ",null,"x","","","x","x","x","","","x",4,5,"دور ثانى","الرياضيات / ","","","الكيمياء / ","الفيزياء / ","الأحياء / ","","","اللغة الإنجليزية / ",null,134,"محمد يوسف محمد ابراهيم محمد",113.00000694444445,198,"دور ثانى"]
[135,"محمد يونس محمد زحمت كش","10 - 4",11.5,17.5,15,17.5,21,13,21.5,15,14.5,146.5,"دور ثانى",0.54259259259259263,"مقبول",null,"الرياضيات / الأحياء / اللغة الإنجليزية / ",null,"x","","","","","x","","","x",6,3,"دور ثانى","الرياضيات / ","","","","","الأحياء / ","","","اللغة الإنجليزية / ",null,135,"محمد يونس محمد زحمت كش",146.50000689655172,152,"دور ثانى"]
[136,"بدر ناصر جابر سهل المرى","10 - 5",20.5,11,16,13,18,17,12,16,16,139.5,"دور ثانى",0.51666666666666672,"مقبول",null,"الدراسات الاجتماعية / الكيمياء / التربية الإسلامية / ",null,"","x","","x","","","x","","",6,3,"دور ثانى","","الدراسات الاجتماعية / ","","الكيمياء / ","","","التربية الإسلامية / ","","",null,136,"بدر ناصر جابر سهل المرى",139.50000684931507,159,"دور ثانى"]
[137,"حزام زيد راشد المري","10 - 5",12,16,10.5,16,19,19.5,14,14,15,136,"دور ثانى",0.50370370370370365,"مقبول",null,"الرياضيات / الحوسبة وتكنولوجيا المعلومات / التربية الإسلامية / اللغة العربية / ",null,"x","","x","","","","x","x","",5,4,"دور ثانى","الرياضيات / ","","الحوسبة وتكنولوجيا المعلومات / ","","","","التربية الإسلامية / ","اللغة العربية / ","",null,137,"حزام زيد راشد المري",136.00000680272109,165,"دور ثانى"]
[138,"حسن محمود ابراهيم علي البنا","10 - 5",29,28,28.5,29,28,27,29,26.5,22,247,"ناجح",0.91481481481481486,"ممتاز",null,"",null,"","","","","","","","","",9,0,"ناجح","","","","","","","","","",null,138,"حسن محمود ابراهيم علي البنا",247.00000675675676,20,"ناجح"]
[139,"حمد سعيد سويلم سعد الخوار","10 - 5",15,9,6.5,8,15,2,13.5,12.5,15.5,97,"دور ثانى",0.35925925925925933,"دون المستوى",null,"الدراسات الاجتماعية / الحوسبة وتكنولوجيا المعلومات / الكيمياء / الأحياء / التربية الإسلامية / اللغة العربية / ",null,"","x","x","x","","x","x","x","",3,6,"دور ثانى","","الدراسات الاجتماعية / ","الحوسبة وتكنولوجيا المعلومات / ","الكيمياء / ","","الأحياء / ","التربية الإسلامية / ","اللغة العربية / ","",null,139,"حمد سعيد سويلم سعد الخوار",97.000006711409398,218,"دور ثانى"]
[140,"حمد مبارك مفتاح فرج العبدالله","10 - 5",9,8,14.5,13,11,9.5,16,12,8,101,"دور ثانى",0.37407407407407406,"دون المستوى",null,"الرياضيات / الدراسات الاجتماعية / الحوسبة وتكنولوجيا المعلومات / الكيمياء / الفيزياء / الأحياء / اللغة العربية / اللغة الإنجليزية / ",null,"x","x","x","x","x","x","","x","x",1,8,"دور ثانى","الرياضيات / ","الدراسات الاجتماعية / ","الحوسبة وتكنولوجيا المعلومات / ","الكيمياء / ","الفيزياء / ","الأحياء / ","","اللغة العربية / ","اللغة الإنجليزية / ",null,140,"حمد مبارك مفتاح فرج العبدالله",101.00000666666666,213,"دور ثانى"]
[141,"خالد عزيز حسن عبدربه حسن","10 - 5",20,17,15,9,21,20.5,23,21.5,18,165,"دور ثانى",0.61111111111111116,"مقبول",null,"الكيمياء / ",null,"","","","x","","","","","",8,1,"دور ثانى","","","","الكيمياء / ","","","","","",null,141,"خالد عزيز حسن عبدربه حسن",165.00000662251657,117,"دور ثانى"]
[142,"دغش بريك دغش الجربوعى المرى","10 - 5",12.5,19,21,22,17,18.5,16,18.5,15,159.5,"دور ثانى",0.59074074074074079,"مقبول",null,"الرياضيات / ",null,"x","","","","","","","","",8,1,"دور ثانى","الرياضيات / ","","","","","","","","",null,142,"دغش بريك دغش الجربوعى المرى",159.50000657894736,130,"دور ثانى"]
[143,"راشد حمد ناصر المري","10 - 5",8,18,17,15.5,22,13.5,19.5,17,20,150.5,"دور ثانى",0.55740740740740746,"مقبول",null,"الرياضيات / الأحياء / ",null,"x","","","","","x","","","",7,2,"دور ثانى","الرياضيات / ","","","","","الأحياء / ","","","",null,143,"راشد حمد ناصر المري",150.5000065359477,146,"دور ثانى"]
[144,"راشد شريف خان عيسى خان","10 - 5",19,16,8.5,16,19,16,17,16,23,150.5,"دور ثانى",0.55740740740740746,"مقبول",null,"الحوسبة وتكنولوجيا المعلومات / ",null,"","","x","","","","","","",8,1,"دور ثانى","","","الحوسبة وتكنولوجيا المعلومات / ","","","","","","",null,144,"راشد شريف خان عيسى خان",150.5000064935065,146,"دور ثانى"]
[145,"زياد مصطفى كامل محمد ابوالبها","10 - 5",29.5,25.5,22,20,28,23,20,23.5,25.5,217,"ناجح",0.8037037037037037,"جيد جدا",null,"",null,"","","","","","","","","",9,0,"ناجح","","","","","","","","","",null,145,"زياد مصطفى كامل محمد ابوالبها",217.0000064516129,54,"ناجح"]
[146,"سالم محمد راشد طفله الفهيده","10 - 5",8.5,11,18.5,8,13,5,16,10,10,100,"دور ثانى",0.37037037037037041,"دون المستوى",null,"الرياضيات / الدراسات الاجتماعية / الكيمياء / الفيزياء / الأحياء / اللغة العربية / اللغة الإنجليزية / ",null,"x","x","","x","x","x","","x","x",2,7,"دور ثانى","الرياضيات / ","الدراسات الاجتماعية / ","","الكيمياء / ","الفيزياء / ","الأحياء / ","","اللغة العربية / ","اللغة الإنجليزية / ",null,146,"سالم محمد راشد طفله الفهيده",100.0000064102564,215,"دور ثانى"]
[147,"سعد حمد سعد البويصم المرى","10 - 5",16,15,13.5,15,20,13.5,19,20.5,16,148.5,"دور ثانى",0.55000000000000004,"مقبول",null,"الحوسبة وتكنولوجيا المعلومات / الأحياء / ",null,"","","x","","","x","","","",7,2,"دور ثانى","","","الحوسبة وتكنولوجيا المعلومات / ","","","الأحياء / ","","","",null,147,{"$f":"B157","v":"سعد حمد سعد البويصم المرى"},148.50000636942676,149,"دور ثانى"]
[148,"سعيد محمد سالم عمار خوار","10 - 5",23,21,22,21.5,26,26.5,25,21.5,20.5,207,"ناجح",0.76666666666666672,"جيد جدا",null,"",null,"","","","","","","","","",9,0,"ناجح","","","","","","","","","",null,148,"سعيد محمد سالم عمار خوار",207.00000632911392,69,"ناجح"]
[149,"صلاح عارف احمد عبده جمن","10 - 5",15,18,15,13.5,21,20,19,20,23,164.5,"دور ثانى",0.60925925925925928,"مقبول",null,"الكيمياء / ",null,"","","","x","","","","","",8,1,"دور ثانى","","","","الكيمياء / ","","","","","",null,149,"صلاح عارف احمد عبده جمن",164.50000628930817,119,"دور ثانى"]
[150,"عبدالعزيز نايف عبدالله نايف","10 - 5",17,22,26.5,21,26,20,26.5,26,13,198,"دور ثانى",0.73333333333333328,"جيد",null,"اللغة الإنجليزية / ",null,"","","","","","","","","x",8,1,"دور ثانى","","","","","","","","","اللغة الإنجليزية / ",null,150,"عبدالعزيز نايف عبدالله نايف",198.00000625000001,84,"دور ثانى"]
[151,"عبدالله عبدالرحمن","10 - 5",15.5,15,14.5,16.5,22,12,15,20,20,150.5,"دور ثانى",0.55740740740740746,"مقبول",null,"الحوسبة وتكنولوجيا المعلومات / الأحياء / ",null,"","","x","","","x","","","",7,2,"دور ثانى","","","الحوسبة وتكنولوجيا المعلومات / ","","","الأحياء / ","","","",null,151,"عبدالله عبدالرحمن",150.50000621118014,146,"دور ثانى"]
[152,"عبدالله فهد عبدالله عبدالعزيز الرميحى","10 - 5",22,24,20,20,24,21.5,25.5,23,23,203,"ناجح",0.75185185185185188,"جيد جدا",null,"",null,"","","","","","","","","",9,0,"ناجح","","","","","","","","","",null,152,"عبدالله فهد عبدالله عبدالعزيز الرميحى",203.00000617283951,76,"ناجح"]
[153,"عبدالله فؤاد حازم شريف","10 - 5",26.5,21.5,20.5,24,24,26,24,21.5,20.5,208.5,"ناجح",0.77222222222222225,"جيد جدا",null,"",null,"","","","","","","","","",9,0,"ناجح","","","","","","","","","",null,153,"عبدالله فؤاد حازم شريف",208.50000613496931,66,"ناجح"]
[154,"عبدالمحسن عادل عبدالمحسن محمد الدهنيم","10 - 5",14,19,14.5,15,18.5,18,17,17,18,151,"دور ثانى",0.55925925925925923,"مقبول",null,"الرياضيات / الحوسبة وتكنولوجيا المعلومات / ",null,"x","","x","","","","","","",7,2,"دور ثانى","الرياضيات / ","","الحوسبة وتكنولوجيا المعلومات / ","","","","","","",null,154,"عبدالمحسن عادل عبدالمحسن محمد الدهنيم",151.00000609756097,144,"دور ثانى"]
[155,"على حسن مبخوت سعيد الراشدى","10 - 5",16,10.5,8.5,14,17.5,12,9.5,16,11,115,"دور ثانى",0.42592592592592593,"دون المستوى",null,"الدراسات الاجتماعية / الحوسبة وتكنولوجيا المعلومات / الكيمياء / الأحياء / التربية الإسلامية / اللغة الإنجليزية / ",null,"","x","x","x","","x","x","","x",3,6,"دور ثانى","","الدراسات الاجتماعية / ","الحوسبة وتكنولوجيا المعلومات / ","الكيمياء / ","","الأحياء / ","التربية الإسلامية / ","","اللغة الإنجليزية / ",null,155,"على حسن مبخوت سعيد الراشدى",115.00000606060605,196,"دور ثانى"]
[156,"على سالم ظافر ال حثيث الاحبابى","10 - 5",23,23,21.5,17.5,28,12.5,15.5,19,17.5,177.5,"دور ثانى",0.65740740740740744,"جيد",null,"الأحياء / ",null,"","","","","","x","","","",8,1,"دور ثانى","","","","","","الأحياء / ","","","",null,156,"على سالم ظافر ال حثيث الاحبابى",177.50000602409639,104,"دور ثانى"]
[157,"عمر شادي نعيم زهران","10 - 5","غ","غ","غ","غ","غ","غ","غ","غ","غ","غ","دور ثانى","غ","غ",null,"الرياضيات / الدراسات الاجتماعية / الحوسبة وتكنولوجيا المعلومات / الكيمياء / الفيزياء / الأحياء / التربية الإسلامية / اللغة العربية / اللغة الإنجليزية / ",null,"x","x","x","x","x","x","x","x","x",0,9,"دور ثانى","الرياضيات / ","الدراسات الاجتماعية / ","الحوسبة وتكنولوجيا المعلومات / ","الكيمياء / ","الفيزياء / ","الأحياء / ","التربية الإسلامية / ","اللغة العربية / ","اللغة الإنجليزية / ",null,157,"عمر شادي نعيم زهران","غ","غ","دور ثانى"]
[158,"غانم حمد صالح سعيد القريصى","10 - 5",10,7,11.5,9,9,11,11,9,9,86.5,"دور ثانى",0.32037037037037036,"دون المستوى",null,"الرياضيات / الدراسات الاجتماعية / الحوسبة وتكنولوجيا المعلومات / الكيمياء / الفيزياء / الأحياء / التربية الإسلامية / اللغة العربية / اللغة الإنجليزية / ",null,"x","x","x","x","x","x","x","x","x",0,9,"دور ثانى","الرياضيات / ","الدراسات الاجتماعية / ","الحوسبة وتكنولوجيا المعلومات / ","الكيمياء / ","الفيزياء / ","الأحياء / ","التربية الإسلامية / ","اللغة العربية / ","اللغة الإنجليزية / ",null,158,"غانم حمد صالح سعيد القريصى",86.500005952380945,221,"دور ثانى"]
[159,"فهد سعد سعيد بخيت الخوار","10 - 5",13.5,12.5,21.5,10,17,10,10,13,8.5,116,"دور ثانى",0.42962962962962964,"دون المستوى",null,"الرياضيات / الدراسات الاجتماعية / الكيمياء / الأحياء / التربية الإسلامية / اللغة العربية / اللغة الإنجليزية / ",null,"x","x","","x","","x","x","x","x",2,7,"دور ثانى","الرياضيات / ","الدراسات الاجتماعية / ","","الكيمياء / ","","الأحياء / ","التربية الإسلامية / ","اللغة العربية / ","اللغة الإنجليزية / ",null,159,"فهد سعد سعيد بخيت الخوار",116.00000591715977,194,"دور ثانى"]
[160,"قصي محمد داود ابراهيم ابوديه","10 - 5",11.5,26.5,18,20,20,17.5,22.5,21,13,170,"دور ثانى",0.62962962962962965,"مقبول",null,"الرياضيات / اللغة الإنجليزية / ",null,"x","","","","","","","","x",7,2,"دور ثانى","الرياضيات / ","","","","","","","","اللغة الإنجليزية / ",null,160,"قصي محمد داود ابراهيم ابوديه",170.00000588235295,113,"دور ثانى"]
[161,"محمد امين بن عادل قنوني","10 - 5",15.5,22,14.5,9.5,26,12,18.5,24,15,157,"دور ثانى",0.58148148148148149,"مقبول",null,"الحوسبة وتكنولوجيا المعلومات / الكيمياء / الأحياء / ",null,"","","x","x","","x","","","",6,3,"دور ثانى","","","الحوسبة وتكنولوجيا المعلومات / ","الكيمياء / ","","الأحياء / ","","","",null,{"$f":"A171","v":161},"محمد امين بن عادل قنوني",157.00000584795322,134,"دور ثانى"]
[162,"محمد جابر محمد الصعاق المرى","10 - 5",16.5,18.5,15,21.5,17,17,22,22,18,167.5,"ناجح",0.62037037037037035,"مقبول",null,"",null,"","","","","","","","","",9,0,"ناجح","","","","","","","","","",null,162,"محمد جابر محمد الصعاق المرى",167.50000581395349,115,"ناجح"]
[163,"محمد سعيد جابر سالم اليربوعى","10 - 5","غ","غ","غ","غ","غ","غ","غ","غ","غ","غ","دور ثانى","غ","غ",null,"الرياضيات / الدراسات الاجتماعية / الحوسبة وتكنولوجيا المعلومات / الكيمياء / الفيزياء / الأحياء / التربية الإسلامية / اللغة العربية / اللغة الإنجليزية / ",null,"x","x","x","x","x","x","x","x","x",0,9,"دور ثانى","الرياضيات / ","الدراسات الاجتماعية / ","الحوسبة وتكنولوجيا المعلومات / ","الكيمياء / ","الفيزياء / ","الأحياء / ","التربية الإسلامية / ","اللغة العربية / ","اللغة الإنجليزية / ",null,163,"محمد سعيد جابر سالم اليربوعى","غ","غ","دور ثانى"]
[164,"محمد طارق الحاج","10 - 5",20.5,23,18.5,17,21.5,19,20,13,20,172.5,"دور ثانى",0.63888888888888884,"مقبول",null,"اللغة العربية / ",null,"","","","","","","","x","",8,1,"دور ثانى","","","","","","","","اللغة العربية / ","",null,164,"محمد طارق الحاج",172.50000574712644,109,"دور ثانى"]
[165,"محمد عبدالله شيخ محمد","10 - 5",17,21,13,24,28,23,24.5,22,22,194.5,"دور ثانى",0.72037037037037033,"جيد",null,"الحوسبة وتكنولوجيا المعلومات / ",null,"","","x","","","","","","",8,1,"دور ثانى","","","الحوسبة وتكنولوجيا المعلومات / ","","","","","","",null,165,"محمد عبدالله شيخ محمد",194.50000571428572,87,"دور ثانى"]
[166,"محمد محسن محمد دخيل اليربوعى","10 - 5",8.5,13,11,5.5,11,8,6,13,9,85,"دور ثانى",0.31481481481481483,"دون المستوى",null,"الرياضيات / الدراسات الاجتماعية / الحوسبة وتكنولوجيا المعلومات / الكيمياء / الفيزياء / الأحياء / التربية الإسلامية / اللغة العربية / اللغة الإنجليزية / ",null,"x","x","x","x","x","x","x","x","x",0,9,"دور ثانى","الرياضيات / ","الدراسات الاجتماعية / ","الحوسبة وتكنولوجيا المعلومات / ","الكيمياء / ","الفيزياء / ","الأحياء / ","التربية الإسلامية / ","اللغة العربية / ","اللغة الإنجليزية / ",null,166,"محمد محسن محمد دخيل اليربوعى",85.00000568181818,222,"دور ثانى"]
[167,"مصطفى اسامه محمد زهدي سيد","10 - 5",24.5,25.5,26.5,23.5,26,19,22.5,18.5,26,212,"ناجح",0.78518518518518521,"جيد جدا",null,"",null,"","","","","","","","","",9,0,"ناجح","","","","","","","","","",null,167,"مصطفى اسامه محمد زهدي سيد",212.00000564971751,59,"ناجح"]
[168,"مهند عمر سمير كلباني","10 - 5",23,21.5,21,16.5,27,22,19.5,24,27,201.5,"ناجح",0.74629629629629635,"جيد",null,"",null,"","","","","","","","","",9,0,"ناجح","","","","","","","","","",null,168,"مهند عمر سمير كلباني",201.50000561797754,79,"ناجح"]
[169,"نصر على نصر على النصر","10 - 5",7,16,16,9,15,12.5,12,14,10,111.5,"دور ثانى",0.41296296296296298,"دون المستوى",null,"الرياضيات / الكيمياء / الأحياء / التربية الإسلامية / اللغة العربية / اللغة الإنجليزية / ",null,"x","","","x","","x","x","x","x",3,6,"دور ثانى","الرياضيات / ","","","الكيمياء / ","","الأحياء / ","التربية الإسلامية / ","اللغة العربية / ","اللغة الإنجليزية / ",null,169,"نصر على نصر على النصر",111.50000558659218,200,"دور ثانى"]
[170,"حمد اصغر خان نواب خان","10 - 6",7,6,"غ",4,10,6.5,8,7,19,67.5,"دور ثانى",0.25,"دون المستوى",null,"الرياضيات / الدراسات الاجتماعية / الحوسبة وتكنولوجيا المعلومات / الكيمياء / الفيزياء / الأحياء / التربية الإسلامية / اللغة العربية / ",null,"x","x","x","x","x","x","x","x","",1,8,"دور ثانى","الرياضيات / ","الدراسات الاجتماعية / ","الحوسبة وتكنولوجيا المعلومات / ","الكيمياء / ","الفيزياء / ","الأحياء / ","التربية الإسلامية / ","اللغة العربية / ","",null,170,"حمد اصغر خان نواب خان",67.50000555555556,225,"دور ثانى"]
[171,"خالد سلطان حسن عباس الجمالى","10 - 6",21.5,15.5,26,12,20,14,17,13,18,157,"دور ثانى",0.58148148148148149,"مقبول",null,"الكيمياء / الأحياء / اللغة العربية / ",null,"","","","x","","x","","x","",6,3,"دور ثانى","","","","الكيمياء / ","","الأحياء / ","","اللغة العربية / ","",null,171,"خالد سلطان حسن عباس الجمالى",157.00000552486188,134,"دور ثانى"]
[172,"شفيع فهد على شفيع الفهيده","10 - 6",28,29,28,23,30,23,26.5,26,21,234.5,"ناجح",0.86851851851851847,"ممتاز",null,"",null,"","","","","","","","","",9,0,"ناجح","","","","","","","","","",null,172,"شفيع فهد على شفيع الفهيده",234.5000054945055,32,"ناجح"]
[173,"عبدالرجمن يارمحمد معين خان","10 - 6",19.5,10,1,17,24,14,18.5,15,13.5,132.5,"دور ثانى",0.49074074074074076,"دون المستوى",null,"الدراسات الاجتماعية / الحوسبة وتكنولوجيا المعلومات / الأحياء / اللغة الإنجليزية / ",null,"","x","x","","","x","","","x",5,4,"دور ثانى","","الدراسات الاجتماعية / ","الحوسبة وتكنولوجيا المعلومات / ","","","الأحياء / ","","","اللغة الإنجليزية / ",null,173,"عبدالرجمن يارمحمد معين خان",132.50000546448086,169,"دور ثانى"]
[174,"عبدالرحمن جاسم محمد قاسم العمادى","10 - 6",19.5,15.5,9,10,17,14.5,15,13,19.5,133,"دور ثانى",0.49259259259259258,"دون المستوى",null,"الحوسبة وتكنولوجيا المعلومات / الكيمياء / الأحياء / اللغة العربية / ",null,"","","x","x","","x","","x","",5,4,"دور ثانى","","","الحوسبة وتكنولوجيا المعلومات / ","الكيمياء / ","","الأحياء / ","","اللغة العربية / ","",null,174,"عبدالرحمن جاسم محمد قاسم العمادى",133.00000543478262,168,"دور ثانى"]
[175,"عبدالرحمن حسين عبدي","10 - 6",18,7,3,8,15,9.5,17.5,12,21,111,"دور ثانى",0.41111111111111109,"دون المستوى",null,"الدراسات الاجتماعية / الحوسبة وتكنولوجيا المعلومات / الكيمياء / الأحياء / اللغة العربية / ",null,"","x","x","x","","x","","x","",4,5,"دور ثانى","","الدراسات الاجتماعية / ","الحوسبة وتكنولوجيا المعلومات / ","الكيمياء / ","","الأحياء / ","","اللغة العربية / ","",null,175,"عبدالرحمن حسين عبدي",111.0000054054054,202,"دور ثانى"]
[176,"عبدالرحمن محماس غزاى المقاطى العتيبى","10 - 6",11.5,10,"غ",9,12,8.5,18,20,9,98,"دور ثانى",0.36296296296296299,"دون المستوى",null,"الرياضيات / الدراسات الاجتماعية / الحوسبة وتكنولوجيا المعلومات / الكيمياء / الفيزياء / الأحياء / اللغة الإنجليزية / ",null,"x","x","x","x","x","x","","","x",2,7,"دور ثانى","الرياضيات / ","الدراسات الاجتماعية / ","الحوسبة وتكنولوجيا المعلومات / ","الكيمياء / ","الفيزياء / ","الأحياء / ","","","اللغة الإنجليزية / ",null,176,"عبدالرحمن محماس غزاى المقاطى العتيبى",98.000005376344092,217,"دور ثانى"]
[177,"عبدالرحمن مرتضى عبدالعال ساتى الحسن","10 - 6",28,18,26,24,29,20,19,15.5,24.5,204,"ناجح",0.75555555555555554,"جيد جدا",null,"",null,"","","","","","","","","",9,0,"ناجح","","","","","","","","","",null,177,"عبدالرحمن مرتضى عبدالعال ساتى الحسن",204.00000534759357,72,"ناجح"]
[178,"عبدالعزيز جهان بخش مرادك درزاده","10 - 6",14,7,8,10,16,12.5,16.5,11,15,110,"دور ثانى",0.40740740740740738,"دون المستوى",null,"الرياضيات / الدراسات الاجتماعية / الحوسبة وتكنولوجيا المعلومات / الكيمياء / الأحياء / اللغة العربية / ",null,"x","x","x","x","","x","","x","",3,6,"دور ثانى","الرياضيات / ","الدراسات الاجتماعية / ","الحوسبة وتكنولوجيا المعلومات / ","الكيمياء / ","","الأحياء / ","","اللغة العربية / ","",null,178,"عبدالعزيز جهان بخش مرادك درزاده",110.00000531914894,205,"دور ثانى"]
[179,"عبدالعزيز سلطان حسن سالم الكثيرى","10 - 6",20.5,16.5,16,21,19,13,22,17,17.5,162.5,"دور ثانى",0.60185185185185186,"مقبول",null,"الأحياء / ",null,"","","","","","x","","","",8,1,"دور ثانى","","","","","","الأحياء / ","","","",null,179,{"$f":"B189","v":"عبدالعزيز سلطان حسن سالم الكثيرى"},{"$f":"IF(M189=\"\",\"\",IF(M189=\"غ\",\"غ\",M189+1/ROW()*0.001))","v":162.50000529100529},124,"دور ثانى"]
[180,"عبدالغني عثمان عمر ورسمة","10 - 6",18,18.5,1.5,16,17,14,18,12,13.5,128.5,"دور ثانى",0.47592592592592597,"دون المستوى",null,"الحوسبة وتكنولوجيا المعلومات / الأحياء / اللغة العربية / اللغة الإنجليزية / ",null,"","","x","","","x","","x","x",5,4,"دور ثانى","","","الحوسبة وتكنولوجيا المعلومات / ","","","الأحياء / ","","اللغة العربية / ","اللغة الإنجليزية / ",null,180,"عبدالغني عثمان عمر ورسمة",128.5000052631579,179,"دور ثانى"]
[181,"عبدالقادر انس العمر","10 - 6",30,30,26,29,28,30,28,28,17.5,246.5,"ناجح",0.91296296296296309,"ممتاز",null,"",null,"","","","","","","","","",9,0,"ناجح","","","","","","","","","",null,181,"عبدالقادر انس العمر",246.50000523560209,21,"ناجح"]
[182,"عبدالله جاسم على محمد القايد","10 - 6",25.5,17,12.5,15,18,10,22.5,15,18.5,154,"دور ثانى",0.57037037037037042,"مقبول",null,"الحوسبة وتكنولوجيا المعلومات / الأحياء / ",null,"","","x","","","x","","","",7,2,"دور ثانى","","","الحوسبة وتكنولوجيا المعلومات / ","","","الأحياء / ","","","",null,182,"عبدالله جاسم على محمد القايد",154.00000520833333,143,"دور ثانى"]
[183,"عبدالله حمد سالم العيسائى اليافعى","10 - 6",24.5,21,21.5,24,29,21,24,18,23,206,"ناجح",0.76296296296296295,"جيد جدا",null,"",null,"","","","","","","","","",9,0,"ناجح","","","","","","","","","",null,183,"عبدالله حمد سالم العيسائى اليافعى",206.00000518134715,70,"ناجح"]
[184,"عبدالله على عبدالمحسن راشد الهميمى","10 - 6",27.5,20.5,29,28,27,22,21,20,21.5,216.5,"ناجح",0.80185185185185182,"جيد جدا",null,"",null,"","","","","","","","","",9,0,"ناجح","","","","","","","","","",null,184,"عبدالله على عبدالمحسن راشد الهميمى",216.50000515463918,55,"ناجح"]
[185,"عبدالله محماس غزاى المقاطى العتيبى","10 - 6",12.5,11,9.5,21,19,9.5,12,19,7.5,121,"دور ثانى",0.44814814814814807,"دون المستوى",null,"الرياضيات / الدراسات الاجتماعية / الحوسبة وتكنولوجيا المعلومات / الأحياء / التربية الإسلامية / اللغة الإنجليزية / ",null,"x","x","x","","","x","x","","x",3,6,"دور ثانى","الرياضيات / ","الدراسات الاجتماعية / ","الحوسبة وتكنولوجيا المعلومات / ","","","الأحياء / ","التربية الإسلامية / ","","اللغة الإنجليزية / ",null,185,"عبدالله محماس غزاى المقاطى العتيبى",121.00000512820513,190,"دور ثانى"]
[186,"عبدالله ناصر عبده السعدى اليافعى","10 - 6",25,18,12,19,24,16,23,17,25,179,"دور ثانى",0.66296296296296309,"جيد",null,"الحوسبة وتكنولوجيا المعلومات / ",null,"","","x","","","","","","",8,1,"دور ثانى","","","الحوسبة وتكنولوجيا المعلومات / ","","","","","","",null,186,"عبدالله ناصر عبده السعدى اليافعى",179.0000051020408,103,"دور ثانى"]
[187,"على احمد عبدالله احمد العبدالله","10 - 6",23.5,22,20.5,22,20.5,16.5,20,17,18.5,180.5,"ناجح",0.66851851851851851,"جيد",null,"",null,"","","","","","","","","",9,0,"ناجح","","","","","","","","","",null,187,"على احمد عبدالله احمد العبدالله",180.50000507614214,102,"ناجح"]
[188,"على فهد على شفيع الفهيده","10 - 6",17,28,7,14,23,18.5,19,19,18,163.5,"دور ثانى",0.60555555555555551,"مقبول",null,"الحوسبة وتكنولوجيا المعلومات / الكيمياء / ",null,"","","x","x","","","","","",7,2,"دور ثانى","","","الحوسبة وتكنولوجيا المعلومات / ","الكيمياء / ","","","","","",null,188,"على فهد على شفيع الفهيده",163.50000505050505,122,"دور ثانى"]
[189,"فارس وليد محي الدين","10 - 6",15.5,14.5,21.5,15,18,10.5,16,18,25.5,154.5,"دور ثانى",0.57222222222222219,"مقبول",null,"الدراسات الاجتماعية / الأحياء / ",null,"","x","","","","x","","","",7,2,"دور ثانى","","الدراسات الاجتماعية / ","","","","الأحياء / ","","","",null,189,"فارس وليد محي الدين",154.50000502512563,139,"دور ثانى"]
[190,"قطبى ياسر القطبي ادريس","10 - 6","غ","غ","غ","غ","غ","غ","غ","غ","غ","غ","دور ثانى","غ","غ",null,"الرياضيات / الدراسات الاجتماعية / الحوسبة وتكنولوجيا المعلومات / الكيمياء / الفيزياء / الأحياء / التربية الإسلامية / اللغة العربية / اللغة الإنجليزية / ",null,"x","x","x","x","x","x","x","x","x",0,9,"دور ثانى","الرياضيات / ","الدراسات الاجتماعية / ","الحوسبة وتكنولوجيا المعلومات / ","الكيمياء / ","الفيزياء / ","الأحياء / ","التربية الإسلامية / ","اللغة العربية / ","اللغة الإنجليزية / ",null,190,"قطبى ياسر القطبي ادريس","غ","غ","دور ثانى"]
[191,"محمد الفاضل يوسف محمد","10 - 6",21,21,17,25,18,20,25,20,23.5,190.5,"ناجح",0.7055555555555556,"جيد",null,"",null,"","","","","","","","","",9,0,"ناجح","","","","","","","","","",null,191,"محمد الفاضل يوسف محمد",190.50000497512437,92,"ناجح"]
[192,"محمد جابر حسين على الجرحب","10 - 6",18.5,21,24,12,16,17,18,17,14.5,158,"دور ثانى",0.58518518518518514,"مقبول",null,"الكيمياء / اللغة الإنجليزية / ",null,"","","","x","","","","","x",7,2,"دور ثانى","","","","الكيمياء / ","","","","","اللغة الإنجليزية / ",null,192,"محمد جابر حسين على الجرحب",158.00000495049505,132,"دور ثانى"]
[193,"محمد حمد حسين بن عباس الخزاعى","10 - 6",30,26,20,25,22,16,22,20,26.5,{"$f":"IF(B203=\"\",\"\",IF(AND(D203=\"غ\",E203=\"غ\",F203=\"غ\",G203=\"غ\",H203=\"غ\",I203=\"غ\",J203=\"غ\",K203=\"غ\",L203=\"غ\"),\"غ\",SUM(D203,E203,F203,G203,H203,I203,J203,K203,L203)))","v":207.5},{"$f":"IF(B203=\"\",\"\",AE203)","v":"ناجح"},{"$f":"IF(B203=\"\",\"\",IF(M203=\"غ\",\"غ\",M203/$M$10*100/100))","v":0.76851851851851849},"جيد جدا",null,"",null,"","","","","","","","","",9,0,"ناجح","","","","","","","","","",null,193,"محمد حمد حسين بن عباس الخزاعى",207.50000492610837,68,"ناجح"]
[{"$f":"ROW()-10","v":194},"محمد على سالم حمد جبران","10 - 6",5.5,13,7,3,16,12,17,13.5,12.5,99.5,"دور ثانى",0.36851851851851852,{"$f":"IF(M204=\"\",\"\",IF(M204=\"غ\",\"غ\",IF(M204=0,\"دون المستوى\",IF(M204/$M$10*100>=85,\"ممتاز\",IF(M204/$M$10*100>=75,\"جيد جدا\",IF(M204/$M$10*100>=65,\"جيد\",IF(M204/$M$10*100>=50,\"مقبول\",IF(M204/$M$10*100<50,\"دون المستوى\"))))))))","v":"دون المستوى"},null,{"$f":"CONCATENATE(AF204,AG204,AH204,AI204,AJ204,AK204,AL204,AM204,AN204)","v":"الرياضيات / الدراسات الاجتماعية / الحوسبة وتكنولوجيا المعلومات / الكيمياء / الأحياء / اللغة العربية / اللغة الإنجليزية / "},null,{"$f":"IF($B204=\"\",\"\",IF(OR(D204<15,D204=\"\",D204=\"غ\",D204=\"صفر\"=\"\"),\"x\",\"\"))","v":"x"},{"$f":"IF($B204=\"\",\"\",IF(OR(E204<15,E204=\"\",E204=\"غ\",E204=\"صفر\"=\"\"),\"x\",\"\"))","v":"x"},{"$f":"IF($B204=\"\",\"\",IF(OR(F204<15,F204=\"\",F204=\"غ\",F204=\"صفر\"=\"\"),\"x\",\"\"))","v":"x"},{"$f":"IF($B204=\"\",\"\",IF(OR(G204<15,G204=\"\",G204=\"غ\",G204=\"صفر\"=\"\"),\"x\",\"\"))","v":"x"},{"$f":"IF($B204=\"\",\"\",IF(OR(H204<15,H204=\"\",H204=\"غ\",H204=\"صفر\"=\"\"),\"x\",\"\"))","v":""},{"$f":"IF($B204=\"\",\"\",IF(OR(I204<15,I204=\"\",I204=\"غ\",I204=\"صفر\"=\"\"),\"x\",\"\"))","v":"x"},{"$f":"IF($B204=\"\",\"\",IF(OR(J204<15,J204=\"\",J204=\"غ\",J204=\"صفر\"=\"\"),\"x\",\"\"))","v":""},{"$f":"IF($B204=\"\",\"\",IF(OR(K204<15,K204=\"\",K204=\"غ\",K204=\"صفر\"=\"\"),\"x\",\"\"))","v":"x"},{"$f":"IF($B204=\"\",\"\",IF(OR(L204<15,L204=\"\",L204=\"غ\",L204=\"صفر\"=\"\"),\"x\",\"\"))","v":"x"},{"$f":"IF(B204=\"\",\"\",COUNTBLANK(T204:AB204))","v":2},{"$f":"IF(B204=\"\",\"\",COUNTIF(T204:AB204,\"x\"))","v":7},{"$f":"IF(B204=\"\",\"\",IF(AC204=9,\"ناجح\",\"دور ثانى\"))","v":"دور ثانى"},{"$f":"IF(T204=\"x\",\"الرياضيات / \",\"\")","v":"الرياضيات / "},{"$f":"IF(U204=\"x\",\"الدراسات الاجتماعية / \",\"\")","v":"الدراسات الاجتماعية / "},{"$f":"IF(V204=\"x\",\"الحوسبة وتكنولوجيا المعلومات / \",\"\")","v":"الحوسبة وتكنولوجيا المعلومات / "},{"$f":"IF(W204=\"x\",\"الكيمياء / \",\"\")","v":"الكيمياء / "},{"$f":"IF(X204=\"x\",\"الفيزياء / \",\"\")","v":""},{"$f":"IF(Y204=\"x\",\"الأحياء / \",\"\")","v":"الأحياء / "},{"$f":"IF(Z204=\"x\",\"التربية الإسلامية / \",\"\")","v":""},{"$f":"IF(AA204=\"x\",\"اللغة العربية / \",\"\")","v":"اللغة العربية / "},{"$f":"IF(AB204=\"x\",\"اللغة الإنجليزية / \",\"\")","v":"اللغة الإنجليزية / "},null,194,"محمد على سالم حمد جبران",99.500004901960779,{"$f":"IFERROR(IF(M204=\" \",\" \",IF(M204=\"غ\",\"غ\",RANK(M204,$M$11:$M$247))),\"\")","v":216},{"$f":"AE204","v":"دور ثانى"}]
[195,"محمد محمود صلاح الدين محمود محمد","10 - 6",29,19,28.5,20.5,22,21,23,19,18.5,200.5,"ناجح",0.74259259259259247,"جيد",null,"",null,"","","","","","","","","",9,0,"ناجح","","","","","","","","","",null,195,"محمد محمود صلاح الدين محمود محمد",200.50000487804877,81,"ناجح"]
[196,"محمد وليد سيد حسن عبدالمجيد","10 - 6",30,27,29,27,26,28.5,28,27,27.5,250,"ناجح",0.92592592592592593,"ممتاز",null,"",null,"","","","","","","","","",9,0,"ناجح","","","","","","","","","",null,196,"محمد وليد سيد حسن عبدالمجيد",250.00000485436894,15,"ناجح"]
[197,"محمدنذير محمداياد الحريري","10 - 6",28,17.5,29,23.5,29,25,26,21.5,26,225.5,"ناجح",0.83518518518518514,"جيد جدا",null,"",null,"","","","","","","","","",9,0,"ناجح","","","","","","","","","",null,197,"محمدنذير محمداياد الحريري",225.50000483091787,44,"ناجح"]
[198,"مشعل عبدالرحمن عبدالله عبدالعزيز الاسحاق","10 - 6",22,17.5,26,18,13,13.5,18.5,15,21.5,165,"دور ثانى",0.61111111111111116,"مقبول",null,"الفيزياء / الأحياء / ",null,"","","","","x","x","","","",7,2,"دور ثانى","","","","","الفيزياء / ","الأحياء / ","","","",null,198,"مشعل عبدالرحمن عبدالله عبدالعزيز الاسحاق",165.00000480769231,117,"دور ثانى"]
[199,"مصطفى محمد مصطفى العبيد احمد","10 - 6",20.5,29,15,26.5,23,23.5,25.5,20,14.5,197.5,"دور ثانى",0.73148148148148151,"جيد",null,"اللغة الإنجليزية / ",null,"","","","","","","","","x",8,1,"دور ثانى","","","","","","","","","اللغة الإنجليزية / ",null,199,"مصطفى محمد مصطفى العبيد احمد",197.500004784689,85,"دور ثانى"]
[200,"نايف حسن احمد الحيى النعيمى","10 - 6",7.5,10,1.5,8.5,8,7,18.5,16,7,84,"دور ثانى",0.31111111111111112,"دون المستوى",null,"الرياضيات / الدراسات الاجتماعية / الحوسبة وتكنولوجيا المعلومات / الكيمياء / الفيزياء / الأحياء / اللغة الإنجليزية / ",null,"x","x","x","x","x","x","","","x",2,7,"دور ثانى","الرياضيات / ","الدراسات الاجتماعية / ","الحوسبة وتكنولوجيا المعلومات / ","الكيمياء / ","الفيزياء / ","الأحياء / ","","","اللغة الإنجليزية / ",null,200,"نايف حسن احمد الحيى النعيمى",84.000004761904762,223,"دور ثانى"]
[201,"نواف على هادى الجربوعى المرى","10 - 6",19,7.5,1,15,15,15,20,10,7,109.5,"دور ثانى",0.40555555555555556,"دون المستوى",null,"الدراسات الاجتماعية / الحوسبة وتكنولوجيا المعلومات / اللغة العربية / اللغة الإنجليزية / ",null,"","x","x","","","","","x","x",5,4,"دور ثانى","","الدراسات الاجتماعية / ","الحوسبة وتكنولوجيا المعلومات / ","","","","","اللغة العربية / ","اللغة الإنجليزية / ",null,201,"نواف على هادى الجربوعى المرى",109.50000473933649,206,"دور ثانى"]
[202,"يوسف خالد ناصر عبدالكريم مثنى","10 - 6",12,9,5.5,11.5,18,13.5,15,9,9,102.5,"دور ثانى",0.37962962962962959,"دون المستوى",null,"الرياضيات / الدراسات الاجتماعية / الحوسبة وتكنولوجيا المعلومات / الكيمياء / الأحياء / اللغة العربية / اللغة الإنجليزية / ",null,"x","x","x","x","","x","","x","x",2,7,"دور ثانى","الرياضيات / ","الدراسات الاجتماعية / ","الحوسبة وتكنولوجيا المعلومات / ","الكيمياء / ","","الأحياء / ","","اللغة العربية / ","اللغة الإنجليزية / ",null,202,"يوسف خالد ناصر عبدالكريم مثنى",102.50000471698114,212,"دور ثانى"]
[203,"يوسف عادل احمد محمد مدني","10 - 6",29,19.5,17.5,26.5,21,20,23,20,26,202.5,"ناجح",0.75,"جيد جدا",null,"",null,"","","","","","","","","",9,0,"ناجح","","","","","","","","","",null,203,"يوسف عادل احمد محمد مدني",202.50000469483567,77,"ناجح"]
[204,"السيدهاشم جعفر علي شبر الوداعي","10 - 7",19.5,21,26.5,16.5,26,25,26,18,26,204.5,"ناجح",0.75740740740740753,"جيد جدا",null,"",null,"","","","","","","","","",9,0,"ناجح","","","","","","","","","",null,204,"السيدهاشم جعفر علي شبر الوداعي",204.50000467289721,71,"ناجح"]
[205,"بلال ابراهيم","10 - 7","غ","غ","غ","غ","غ","غ","غ","غ","غ","غ","دور ثانى","غ","غ",null,"الرياضيات / الدراسات الاجتماعية / الحوسبة وتكنولوجيا المعلومات / الكيمياء / الفيزياء / الأحياء / التربية الإسلامية / اللغة العربية / اللغة الإنجليزية / ",null,"x","x","x","x","x","x","x","x","x",0,9,"دور ثانى","الرياضيات / ","الدراسات الاجتماعية / ","الحوسبة وتكنولوجيا المعلومات / ","الكيمياء / ","الفيزياء / ","الأحياء / ","التربية الإسلامية / ","اللغة العربية / ","اللغة الإنجليزية / ",null,205,"بلال ابراهيم","غ","غ","دور ثانى"]
[206,"تركى مبارك تركى سعد التركى","10 - 7",10.5,25,10,10,23,17,16,16,10,137.5,"دور ثانى",0.5092592592592593,"مقبول",null,"الرياضيات / الحوسبة وتكنولوجيا المعلومات / الكيمياء / اللغة الإنجليزية / ",null,"x","","x","x","","","","","x",5,4,"دور ثانى","الرياضيات / ","","الحوسبة وتكنولوجيا المعلومات / ","الكيمياء / ","","","","","اللغة الإنجليزية / ",null,206,"تركى مبارك تركى سعد التركى",137.50000462962964,163,"دور ثانى"]
[207,"تميم على يوسف محمد الحمادى","10 - 7",14,13.5,21.5,11.5,18,16,12.5,8,7.5,122.5,"دور ثانى",0.45370370370370372,"دون المستوى",null,"الرياضيات / الدراسات الاجتماعية / الكيمياء / التربية الإسلامية / اللغة العربية / اللغة الإنجليزية / ",null,"x","x","","x","","","x","x","x",3,6,"دور ثانى","الرياضيات / ","الدراسات الاجتماعية / ","","الكيمياء / ","","","التربية الإسلامية / ","اللغة العربية / ","اللغة الإنجليزية / ",null,207,"تميم على يوسف محمد الحمادى",122.50000460829493,184,"دور ثانى"]
[208,"جاسم حسين جاسم على بوكربل","10 - 7",22.5,14,15,20,22,27,24,21.5,18.5,184.5,"دور ثانى",0.68333333333333324,"جيد",null,"الدراسات الاجتماعية / ",null,"","x","","","","","","","",8,1,"دور ثانى","","الدراسات الاجتماعية / ","","","","","","","",null,208,"جاسم حسين جاسم على بوكربل",184.50000458715596,96,"دور ثانى"]
[209,"جاسم محمد فرج البريص المري","10 - 7",13,14,11.5,8,16,11,18.5,16,"غ",108,"دور ثانى",0.4,"دون المستوى",null,"الرياضيات / الدراسات الاجتماعية / الحوسبة وتكنولوجيا المعلومات / الكيمياء / الأحياء / اللغة الإنجليزية / ",null,"x","x","x","x","","x","","","x",3,6,"دور ثانى","الرياضيات / ","الدراسات الاجتماعية / ","الحوسبة وتكنولوجيا المعلومات / ","الكيمياء / ","","الأحياء / ","","","اللغة الإنجليزية / ",null,209,"جاسم محمد فرج البريص المري",108.00000456621005,207,"دور ثانى"]
[210,"جوعان حمد محمد على بن نوره","10 - 7",29.5,25,29,27,26,24,23,22,25,230.5,"ناجح",0.85370370370370385,"ممتاز",null,"",null,"","","","","","","","","",9,0,"ناجح","","","","","","","","","",null,210,"جوعان حمد محمد على بن نوره",230.50000454545454,39,"ناجح"]
[211,"خالد ناصر محمد اللواء المرى","10 - 7",10.5,11,21.5,19.5,17,11.5,14,13,19,137,"دور ثانى",0.50740740740740742,"مقبول",null,"الرياضيات / الدراسات الاجتماعية / الأحياء / التربية الإسلامية / اللغة العربية / ",null,"x","x","","","","x","x","x","",4,5,"دور ثانى","الرياضيات / ","الدراسات الاجتماعية / ","","","","الأحياء / ","التربية الإسلامية / ","اللغة العربية / ","",null,211,{"$f":"B221","v":"خالد ناصر محمد اللواء المرى"},137.00000452488689,164,"دور ثانى"]
[212,"سالم عبدالله سالم سعيد خوار","10 - 7",15,19,16.5,16,16,6.5,14.5,12.5,13,129,"دور ثانى",0.4777777777777778,"دون المستوى",null,"الأحياء / التربية الإسلامية / اللغة العربية / اللغة الإنجليزية / ",null,"","","","","","x","x","x","x",5,4,"دور ثانى","","","","","","الأحياء / ","التربية الإسلامية / ","اللغة العربية / ","اللغة الإنجليزية / ",null,212,"سالم عبدالله سالم سعيد خوار",129.00000450450452,176,"دور ثانى"]
[213,"سعد مبارك تركى سعد التركى","10 - 7",13,23,7.5,9,23,11.5,21,15.5,11.5,135,"دور ثانى",0.5,"مقبول",null,"الرياضيات / الحوسبة وتكنولوجيا المعلومات / الكيمياء / الأحياء / اللغة الإنجليزية / ",null,"x","","x","x","","x","","","x",4,5,"دور ثانى","الرياضيات / ","","الحوسبة وتكنولوجيا المعلومات / ","الكيمياء / ","","الأحياء / ","","","اللغة الإنجليزية / ",null,213,"سعد مبارك تركى سعد التركى",135.00000448430492,166,"دور ثانى"]
[214,"سعود خالد محمود بومحمود الشيخ","10 - 7",16.5,11.5,21,16.5,14,20,15,18,15.5,148,"دور ثانى",0.54814814814814816,"مقبول",null,"الدراسات الاجتماعية / الفيزياء / ",null,"","x","","","x","","","","",7,2,"دور ثانى","","الدراسات الاجتماعية / ","","","الفيزياء / ","","","","",null,214,"سعود خالد محمود بومحمود الشيخ",148.00000446428572,151,"دور ثانى"]
[215,"سلطان سعيد سالم غلفيص النابت","10 - 7",5,11.5,18.5,9.5,11,8.5,13.5,15.5,10,103,"دور ثانى",0.38148148148148148,"دون المستوى",null,"الرياضيات / الدراسات الاجتماعية / الكيمياء / الفيزياء / الأحياء / التربية الإسلامية / اللغة الإنجليزية / ",null,"x","x","","x","x","x","x","","x",2,7,"دور ثانى","الرياضيات / ","الدراسات الاجتماعية / ","","الكيمياء / ","الفيزياء / ","الأحياء / ","التربية الإسلامية / ","","اللغة الإنجليزية / ",null,215,"سلطان سعيد سالم غلفيص النابت",103.00000444444444,211,"دور ثانى"]
[216,"عبدالرحمن عبدالحميد محمد صالح العمودى","10 - 7",14,25,8.5,14.5,20,12,20.5,8,"غ",122.5,"دور ثانى",0.45370370370370372,"دون المستوى",null,"الرياضيات / الحوسبة وتكنولوجيا المعلومات / الكيمياء / الأحياء / اللغة العربية / اللغة الإنجليزية / ",null,"x","","x","x","","x","","x","x",3,6,"دور ثانى","الرياضيات / ","","الحوسبة وتكنولوجيا المعلومات / ","الكيمياء / ","","الأحياء / ","","اللغة العربية / ","اللغة الإنجليزية / ",null,216,"عبدالرحمن عبدالحميد محمد صالح العمودى",122.50000442477877,184,"دور ثانى"]
[217,"عبدالله راشد محسن حزام انديله","10 - 7",22.5,18.5,22.5,21.5,25,12,21,15.5,"غ",158.5,"دور ثانى",0.58703703703703702,"مقبول",null,"الأحياء / اللغة الإنجليزية / ",null,"","","","","","x","","","x",7,2,"دور ثانى","","","","","","الأحياء / ","","","اللغة الإنجليزية / ",null,217,"عبدالله راشد محسن حزام انديله",158.50000440528635,131,"دور ثانى"]
[218,"على سالم محمد ابوعرقوه المرى","10 - 7",16.5,22.5,27,25,26,27,24,22,25,215,"ناجح",0.79629629629629628,"جيد جدا",null,"",null,"","","","","","","","","",9,0,"ناجح","","","","","","","","","",null,218,"على سالم محمد ابوعرقوه المرى",215.0000043859649,57,"ناجح"]
[219,"على ناصر على ال مشروم المرى","10 - 7",27,26,25.5,26.5,22,18.5,22.5,13,23,204,"دور ثانى",0.75555555555555554,"جيد جدا",null,"اللغة العربية / ",null,"","","","","","","","x","",8,1,"دور ثانى","","","","","","","","اللغة العربية / ","",null,219,"على ناصر على ال مشروم المرى",204.00000436681222,72,"دور ثانى"]
[220,"عمر عصام الدين محي حسن","10 - 7","غ","غ","غ","غ","غ","غ","غ","غ","غ","غ","دور ثانى","غ","غ",null,"الرياضيات / الدراسات الاجتماعية / الحوسبة وتكنولوجيا المعلومات / الكيمياء / الفيزياء / الأحياء / التربية الإسلامية / اللغة العربية / اللغة الإنجليزية / ",null,"x","x","x","x","x","x","x","x","x",0,9,"دور ثانى","الرياضيات / ","الدراسات الاجتماعية / ","الحوسبة وتكنولوجيا المعلومات / ","الكيمياء / ","الفيزياء / ","الأحياء / ","التربية الإسلامية / ","اللغة العربية / ","اللغة الإنجليزية / ",null,220,"عمر عصام الدين محي حسن","غ","غ","دور ثانى"]
[221,"عيسى محمد عبد الله عامرى","10 - 7",14.5,23.5,20.5,21,19,18,20,20.5,18,175,"دور ثانى",0.64814814814814814,"مقبول",null,"الرياضيات / ",null,"x","","","","","","","","",8,1,"دور ثانى","الرياضيات / ","","","","","","","","",null,221,"عيسى محمد عبد الله عامرى",175.00000432900433,105,"دور ثانى"]
[222,"فارس سالم حسن سالم الكثيرى","10 - 7",18,25.5,19,19.5,17,14,22,24,27.5,186.5,"دور ثانى",0.69074074074074077,"جيد",null,"الأحياء / ",null,"","","","","","x","","","",8,1,"دور ثانى","","","","","","الأحياء / ","","","",null,222,"فارس سالم حسن سالم الكثيرى",186.50000431034482,93,"دور ثانى"]
[223,"فهد ابوبكر محمد مبخوت الصيعرى","10 - 7",10,7.5,2.5,13,15.5,4,13.5,13,14,93,"دور ثانى",0.34444444444444444,"دون المستوى",null,"الرياضيات / الدراسات الاجتماعية / الحوسبة وتكنولوجيا المعلومات / الكيمياء / الأحياء / التربية الإسلامية / اللغة العربية / اللغة الإنجليزية / ",null,"x","x","x","x","","x","x","x","x",1,8,"دور ثانى","الرياضيات / ","الدراسات الاجتماعية / ","الحوسبة وتكنولوجيا المعلومات / ","الكيمياء / ","","الأحياء / ","التربية الإسلامية / ","اللغة العربية / ","اللغة الإنجليزية / ",null,223,"فهد ابوبكر محمد مبخوت الصيعرى",93.000004291845499,219,"دور ثانى"]
[224,"مبارك سالم مبارك النابت المرى","10 - 7",12.5,15,10,18.5,16,12.5,17,7,14,122.5,"دور ثانى",0.45370370370370372,"دون المستوى",null,"الرياضيات / الحوسبة وتكنولوجيا المعلومات / الأحياء / اللغة العربية / اللغة الإنجليزية / ",null,"x","","x","","","x","","x","x",4,5,"دور ثانى","الرياضيات / ","","الحوسبة وتكنولوجيا المعلومات / ","","","الأحياء / ","","اللغة العربية / ","اللغة الإنجليزية / ",null,224,"مبارك سالم مبارك النابت المرى",122.50000427350427,184,"دور ثانى"]
[225,"مجتبى كامل عبدالله محمد","10 - 7",25,15,20,18,18,18,22,21,25,182,"ناجح",0.67407407407407405,"جيد",null,"",null,"","","","","","","","","",9,0,"ناجح","","","","","","","","","",null,{"$f":"A235","v":225},"مجتبى كامل عبدالله محمد",182.00000425531914,100,"ناجح"]
[226,"محمد احمد جمعه احمد السبيعى","10 - 7",16,12,20.5,10.5,22,15.5,14.5,17,17.5,145.5,"دور ثانى",0.53888888888888886,"مقبول",null,"الدراسات الاجتماعية / الكيمياء / التربية الإسلامية / ",null,"","x","","x","","","x","","",6,3,"دور ثانى","","الدراسات الاجتماعية / ","","الكيمياء / ","","","التربية الإسلامية / ","","",null,226,"محمد احمد جمعه احمد السبيعى",145.50000423728812,154,"دور ثانى"]
[227,"محمد بدرالدين ميرغنى ادم على","10 - 7",10.5,10.5,17.5,18,12,14.5,21,24,15,143,"دور ثانى",0.52962962962962967,"مقبول",null,"الرياضيات / الدراسات الاجتماعية / الفيزياء / الأحياء / ",null,"x","x","","","x","x","","","",5,4,"دور ثانى","الرياضيات / ","الدراسات الاجتماعية / ","","","الفيزياء / ","الأحياء / ","","","",null,227,"محمد بدرالدين ميرغنى ادم على",143.00000421940928,156,"دور ثانى"]
[228,"محمد راشد سالم صالح لحيمر","10 - 7",14,22,19.5,16,14,16,16.5,17,16,151,"دور ثانى",0.55925925925925923,"مقبول",null,"الرياضيات / الفيزياء / ",null,"x","","","","x","","","","",7,2,"دور ثانى","الرياضيات / ","","","","الفيزياء / ","","","","",null,228,"محمد راشد سالم صالح لحيمر",151.00000420168067,144,"دور ثانى"]
[229,"محمد راشد عبدالمحسن راشد الهميمى","10 - 7",30,29,30,28,28,30,29,28,26,258,"ناجح",0.9555555555555556,"ممتاز",null,"",null,"","","","","","","","","",9,0,"ناجح","","","","","","","","","",null,229,"محمد راشد عبدالمحسن راشد الهميمى",258.00000418410042,5,"ناجح"]
[230,"محمد رائد عبدالرحيم","10 - 7",13,19.5,25,19,13,11.5,18,18,19.5,156.5,"دور ثانى",0.57962962962962961,"مقبول",null,"الرياضيات / الفيزياء / الأحياء / ",null,"x","","","","x","x","","","",6,3,"دور ثانى","الرياضيات / ","","","","الفيزياء / ","الأحياء / ","","","",null,230,"محمد رائد عبدالرحيم",156.50000416666666,136,"دور ثانى"]
[231,"محمد سعيد سعد خالد مقبل","10 - 7",21,28,26,23,26,24,24,20,20,212,"ناجح",0.78518518518518521,"جيد جدا",null,"",null,"","","","","","","","","",9,0,"ناجح","","","","","","","","","",null,231,"محمد سعيد سعد خالد مقبل",212.00000414937759,59,"ناجح"]
[232,"محمد عادل عبدالله محمد الخورى","10 - 7",8,6.5,10,15,13,9.5,18.5,12,11,103.5,"دور ثانى",0.38333333333333336,"دون المستوى",null,"الرياضيات / الدراسات الاجتماعية / الحوسبة وتكنولوجيا المعلومات / الفيزياء / الأحياء / اللغة العربية / اللغة الإنجليزية / ",null,"x","x","x","","x","x","","x","x",2,7,"دور ثانى","الرياضيات / ","الدراسات الاجتماعية / ","الحوسبة وتكنولوجيا المعلومات / ","","الفيزياء / ","الأحياء / ","","اللغة العربية / ","اللغة الإنجليزية / ",null,232,"محمد عادل عبدالله محمد الخورى",103.50000413223141,210,"دور ثانى"]
[233,"محمد عبدالله محمد امين ابراهيم","10 - 7",22.5,11,25,16,26.5,15,22.5,22.5,23,184,"دور ثانى",0.68148148148148158,"جيد",null,"الدراسات الاجتماعية / ",null,"","x","","","","","","","",8,1,"دور ثانى","","الدراسات الاجتماعية / ","","","","","","","",null,233,"محمد عبدالله محمد امين ابراهيم",184.00000411522635,97,"دور ثانى"]
[234,"محمد واصف عارف حيدر","10 - 7",29,25,27.5,29,30,26,25,26,23,240.5,"ناجح",0.89074074074074072,"ممتاز",null,"",null,"","","","","","","","","",9,0,"ناجح","","","","","","","","","",null,234,"محمد واصف عارف حيدر",240.50000409836065,27,"ناجح"]
[235,"مشعل خالد احمد سليمان الهيل","10 - 7",19.5,16,21,22.5,27,14,24,18,23,185,"دور ثانى",0.68518518518518523,"جيد",null,"الأحياء / ",null,"","","","","","x","","","",8,1,"دور ثانى","","","","","","الأحياء / ","","","",null,235,"مشعل خالد احمد سليمان الهيل",185.00000408163265,95,"دور ثانى"]
[236,"ناصر راشد على العلى المعاضيد","10 - 7",12.5,14.5,15,15,17,7,13,13,11,118,"دور ثانى",0.437037037037037,"دون المستوى",null,"الرياضيات / الدراسات الاجتماعية / الأحياء / التربية الإسلامية / اللغة العربية / اللغة الإنجليزية / ",null,"x","x","","","","x","x","x","x",3,6,"دور ثانى","الرياضيات / ","الدراسات الاجتماعية / ","","","","الأحياء / ","التربية الإسلامية / ","اللغة العربية / ","اللغة الإنجليزية / ",null,236,"ناصر راشد على العلى المعاضيد",118.00000406504066,193,"دور ثانى"]
[237,"نايف على هادف انديله الحسناء","10 - 7",8.5,12.5,13,10.5,17,10.5,14,16,10,112,"دور ثانى",0.4148148148148148,"دون المستوى",null,"الرياضيات / الدراسات الاجتماعية / الحوسبة وتكنولوجيا المعلومات / الكيمياء / الأحياء / التربية الإسلامية / اللغة الإنجليزية / ",null,"x","x","x","x","","x","x","","x",2,7,"دور ثانى","الرياضيات / ","الدراسات الاجتماعية / ","الحوسبة وتكنولوجيا المعلومات / ","الكيمياء / ","","الأحياء / ","التربية الإسلامية / ","","اللغة الإنجليزية / ",null,237,"نايف على هادف انديله الحسناء",112.00000404858299,199,"دور ثانى"]

{"sheet":"ناجح","index":1,"n_rows":96,"n_cols":16,"rows_kept":96,"cut":false,"hidden":false,"merged":[[7,13,9,13],[7,14,9,14],[7,15,9,15],[7,6,8,6],[7,7,8,7],[7,8,8,8],[7,9,8,9],[7,10,8,10],[7,11,8,11],[7,5,8,5],[2,4,3,12],[7,0,9,0],[7,1,9,1],[7,2,9,2],[7,3,8,3],[7,4,8,4],[7,12,8,12]]}
[]
[]
[null,null,null,null,"الناجحون"]
[]
[]
[]
[]
["رقم الجلوس","اسم الطالب","الصف","الرياضيات","الدراسات الاجتماعية","الحوسبة وتكنولوجيا المعلومات","الكيمياء","الفيزياء","الأحياء","التربية الإسلامية","اللغة العربية","اللغة الإنجليزية","المجموع الكلي","نتيجة الطالب","النسبة المئوية","التقدير العام للطالب"]
[]
[null,null,null,30,30,30,30,30,30,30,30,30,{"$f":"SUM(D10:L10)","v":270}]
[1,"احمد حسن احمد سليمان الهيل","10 - 1",22,19,22,19,19,19,19,22,25,186,"ناجح",0.68888888888888888,"جيد"]
[2,"احمد عبداللاه احمد يحيى عبدالاله","10 - 1",24.5,24.5,26,22.5,29,16,30,29,22.5,224,"ناجح",0.82962962962962961,"جيد جدا"]
[3,"احمد محمود احمد عبدالسميع عثمان","10 - 1",28,30,29.5,29,28,28,29,26,25.5,253,"ناجح",0.937037037037037,"ممتاز"]
[4,"جمال عبدالغفار كمال على","10 - 1",24.5,27,27,22.5,25,23,27.5,29,22.5,228,"ناجح",0.84444444444444444,"جيد جدا"]
[5,"حسن محمد العبود الصالح","10 - 1",25.5,30,27,27,30,27,30,28,18.5,243,"ناجح",0.9,"ممتاز"]
[6,"خالد مصعب خضر عبدالله تايه","10 - 1",29.5,30,29,30,30,30,30,29,29.5,267,"ناجح",0.98888888888888882,"ممتاز"]
[7,"سيف سعيد احمد عبدالمجيد عبدالرحيم","10 - 1",27.5,28,24.5,28,28,24,28,27,25.5,240.5,"ناجح",0.89074074074074072,"ممتاز"]
[8,"شعيب خالد شعيب جاب الله","10 - 1",22,28,29,21,30,28,29,26,28.5,241.5,"ناجح",0.89444444444444438,"ممتاز"]
[9,"عادل سعيد فتحي مصطفى عوض  الله","10 - 1",27,30,27,23.5,28,19,30,30,24,238.5,"ناجح",0.8833333333333333,"ممتاز"]
[10,"عامر محمد عمر عجيز","10 - 1",23,19.5,29,19.5,30,26,30,27,24,228,"ناجح",0.84444444444444444,"جيد جدا"]
[11,"عبدالرحمن خالد محمد سليمان الشيخ","10 - 1",26.5,27,20,28,30,29,30,29,29.5,249,"ناجح",0.92222222222222228,"ممتاز"]
[12,"عبدالرحمن قارى محمد اقبال","10 - 1",27,25,20.5,29,30,22,28,30,26.5,238,"ناجح",0.88148148148148153,"ممتاز"]
[13,"عدنان محمد رضا كرار سليمان","10 - 1",30,27,20.5,24,24,21,28.5,30,23.5,228.5,"ناجح",0.84629629629629632,"جيد جدا"]
[14,"على هصام حامد على الحبابى","10 - 1",26,21,26,25,25,25,24,20,19,211,"ناجح",0.78148148148148133,"جيد جدا"]
[15,"عمر فؤاد اسماعيل ثابت","10 - 1",24.5,24,27,26,27,22.5,26,30,25.5,232.5,"ناجح",0.86111111111111116,"ممتاز"]
[16,"عمر مصطفى محمد عوه","10 - 1",26,29,22.5,30,27,22.5,30,28,27.5,242.5,"ناجح",0.89814814814814814,"ممتاز"]
[17,"عمر هشام على بحيرى ابوالخير","10 - 1",30,30,27,28,30,28,30,29,27.5,259.5,"ناجح",0.96111111111111114,"ممتاز"]
[18,"فادي عدنان احمد عبدالجليل","10 - 1",29,30,28.5,27,28,29,30,25,28.5,255,"ناجح",0.94444444444444442,"ممتاز"]
[19,"مازن محمود السيد عبدالله عبدالوهاب","10 - 1",28,29,29.5,25,24,26,30,25,19,235.5,"ناجح",0.87222222222222223,"ممتاز"]
[20,"محمد احمد محمود شناق","10 - 1",27.5,27,26,27,28,26,29,26,29.5,246,"ناجح",0.91111111111111109,"ممتاز"]
[21,"محمد عبدالله السيد بيومي حسن","10 - 1",30,26,26.5,30,30,29,30,27,27.5,256,"ناجح",0.94814814814814818,"ممتاز"]
[22,"محمد عقيل عدنان سيد احمد","10 - 1",23.5,30,26.5,26,30,26,25.5,27,26.5,241,"ناجح",0.89259259259259272,"ممتاز"]
[23,"محمد علي عطيت الله ابراهيم عبداللاه","10 - 1",24,30,23.5,24,30,25,29,27,19.5,232,"ناجح",0.85925925925925928,"ممتاز"]
[24,"محمد عمر عبدالرحيم على","10 - 1",30,30,29.5,29,30,24.5,28,30,26.5,257.5,"ناجح",0.95370370370370372,"ممتاز"]
[25,"محمد عمر فتحى عبدالتواب عبدالمقصود","10 - 1",30,30,28,28,28,27,29,30,27.5,257.5,"ناجح",0.95370370370370372,"ممتاز"]
[26,"محمود حبيب الله","10 - 1",28,30,27,22.5,28,28,30,30,29.5,253,"ناجح",0.937037037037037,"ممتاز"]
[27,"محمود عادل عبدالمحسن محمد","10 - 1",28.5,30,29.5,30,30,27,29.5,27,28.5,260,"ناجح",0.96296296296296291,"ممتاز"]
[28,"يوسف محمد سليمان موسى عامر","10 - 1",26.5,30,30,27,28,22,29,30,27,249.5,"ناجح",0.92407407407407405,"ممتاز"]
[29,"احمد اسامه جميل ابوالعلا","10 - 2",29,24.5,26.5,25,30,26,26,24.5,23,234.5,"ناجح",0.86851851851851847,"ممتاز"]
[30,"أحمد اقبال ابواصبع","10 - 2",29,30,28.5,28,30,29,28,28.5,27.5,258.5,"ناجح",0.95740740740740737,"ممتاز"]
[31,"احمد شريف ابراهيم الدسوقى عوض","10 - 2",25,21,28.5,17,29,23,26.5,26.5,28,224.5,"ناجح",0.83148148148148149,"جيد جدا"]
[32,"امين بن المنذر بن عثمان","10 - 2",19,19,20,18,18,18,19,20,24,175,"ناجح",0.64814814814814814,"مقبول"]
[33,"براء اشرف سعيد زكي السيد","10 - 2",29,22,19.5,22,26,19.5,23,22,27,210,"ناجح",0.7777777777777779,"جيد جدا"]
[34,"جوين عماد عبدالحليم داود","10 - 2",21.5,16,22,21.5,28,18.5,21,19,25,192.5,"ناجح",0.71296296296296291,"جيد"]
[35,"حمد ناجى مسعد احمد الطيرى","10 - 2",28.5,21,27.5,27.5,30,20,23,23,19,219.5,"ناجح",0.812962962962963,"جيد جدا"]
[36,"راشد حمد على البكرى اليافعى","10 - 2",23,24,20,19.5,23,17.5,22.5,23.5,21,194,"ناجح",0.71851851851851867,"جيد"]
[37,"رامي سعد فراج فرج علي","10 - 2",18,24,27.5,23,25,23.5,26,28,26,221,"ناجح",0.81851851851851842,"جيد جدا"]
[38,"زكي واءلئ شحده عطيه ابوعيده","10 - 2",24.5,28,27,20,26,20,19.5,20,26,211,"ناجح",0.78148148148148133,"جيد جدا"]
[39,"سلمان محمد اسلام ناصر احمد","10 - 2",17,16,25.5,15.5,24,25,22,20,18,183,"ناجح",0.67777777777777781,"جيد"]
[40,"عبدالرحمن محمد محسن البكري","10 - 2",21.5,26.5,22,18,24,19,26.5,18,21,196.5,"ناجح",0.72777777777777775,"جيد"]
[41,"عبدالرحمن هيثم اديب ابودلو","10 - 2",28,26,27.5,22.5,28,24,26,24,19,225,"ناجح",0.83333333333333348,"جيد جدا"]
[42,"على عبدالحافظ على منصر منيف","10 - 2",27,25,25.5,20,28,19,29,24,17,214.5,"ناجح",0.7944444444444444,"جيد جدا"]
[43,"فيصل محمد راشد جخدب الهميمى","10 - 2",25.5,28,29.5,29,27,21.5,24,23.5,24,232,"ناجح",0.85925925925925928,"ممتاز"]
[44,"قيس محمد داود ابراهيم ابوديه","10 - 2",25.5,29,26.5,29,30,28,30,27,27,252,"ناجح",0.93333333333333324,"ممتاز"]
[45,"لؤي ايهاب محمد احمد محمد","10 - 2",24,26.5,18.5,27,27,25,24,22,27,221,"ناجح",0.81851851851851842,"جيد جدا"]
[46,"محمد على راشد محمد انديله","10 - 2",26,22,27,20,24,20,23,19,23,204,"ناجح",0.75555555555555554,"جيد جدا"]
[47,"محمدخير حسين رغفان","10 - 2",25,28,24.5,21,27,24,27,20,27,223.5,"ناجح",0.82777777777777772,"جيد جدا"]
[48,"وليد الامين عثمان","10 - 2",22.5,20.5,27.5,18,27,24,25,21,23,208.5,"ناجح",0.77222222222222225,"جيد جدا"]
[49,"يزيد سامح حسنى محيسن","10 - 2",30,30,27.5,30,30,29,26,26,22,250.5,"ناجح",0.92777777777777781,"ممتاز"]
[50,"يوسف محمد عطيه عطيه حسن","10 - 2",29,27,28,30,29,30,23,27,26,249,"ناجح",0.92222222222222228,"ممتاز"]
[51,"أحمد يوسف خالد يوسف شراب","10 - 4",16.5,20,16,19.5,18,15,22,19.5,17.5,164,"ناجح",0.6074074074074074,"مقبول"]
[52,"جاسم ناصر جاسم محمد المفتاح","10 - 4",23.5,19.5,17.5,17,26,19.5,17.5,21,29.5,191,"ناجح",0.70740740740740737,"جيد"]
[53,"عبدالله ضيف الله برمان الدوسري","10 - 4",25,26.5,23,26,23,24.5,27,21,23.5,219.5,"ناجح",0.812962962962963,"جيد جدا"]
[54,"عدي فريد احمد حسين","10 - 4",22,27,26,22.5,18.5,19,20.5,25,19.5,200,"ناجح",0.74074074074074081,"جيد"]
[55,"عزيز خالد سالم ابو شنار","10 - 4",18,20.5,20.5,26.5,20,20,24.5,27,24,201,"ناجح",0.74444444444444446,"جيد"]
[56,"عمر محمد محمود ابوزاهر","10 - 4",30,29,26,30,30,29,29,29,22.5,254.5,"ناجح",0.94259259259259254,"ممتاز"]
[57,"محمد عبدالعزيز عبدالكريم يحى يعقوب","10 - 4",22.5,19.5,23,25.5,24,24,24,20,26.5,209,"ناجح",0.77407407407407403,"جيد جدا"]
[58,"محمد عبدالله بخيت محمد المهيري","10 - 4",26.5,28,16,24.5,17,26,24.5,22,25.5,210,"ناجح",0.7777777777777779,"جيد جدا"]
[59,"محمد هشام حامد على ابوخطيطه","10 - 4",29.5,25,26.5,29.5,30,29,26,27.5,27,250,"ناجح",0.92592592592592593,"ممتاز"]
[60,"حسن محمود ابراهيم علي البنا","10 - 5",29,28,28.5,29,28,27,29,26.5,22,247,"ناجح",0.91481481481481486,"ممتاز"]
[61,"زياد مصطفى كامل محمد ابوالبها","10 - 5",29.5,25.5,22,20,28,23,20,23.5,25.5,217,"ناجح",0.8037037037037037,"جيد جدا"]
[62,"سعيد محمد سالم عمار خوار","10 - 5",23,21,22,21.5,26,26.5,25,21.5,20.5,207,"ناجح",0.76666666666666672,"جيد جدا"]
[63,"عبدالله فهد عبدالله عبدالعزيز الرميحى","10 - 5",22,24,20,20,24,21.5,25.5,23,23,203,"ناجح",0.75185185185185188,"جيد جدا"]
[64,"عبدالله فؤاد حازم شريف","10 - 5",26.5,21.5,20.5,24,24,26,24,21.5,20.5,208.5,"ناجح",0.77222222222222225,"جيد جدا"]
[65,"محمد جابر محمد الصعاق المرى","10 - 5",16.5,18.5,15,21.5,17,17,22,22,18,167.5,"ناجح",0.62037037037037035,"مقبول"]
[66,"مصطفى اسامه محمد زهدي سيد","10 - 5",24.5,25.5,26.5,23.5,26,19,22.5,18.5,26,212,"ناجح",0.78518518518518521,"جيد جدا"]
[67,"مهند عمر سمير كلباني","10 - 5",23,21.5,21,16.5,27,22,19.5,24,27,201.5,"ناجح",0.74629629629629635,"جيد"]
[68,"شفيع فهد على شفيع الفهيده","10 - 6",28,29,28,23,30,23,26.5,26,21,234.5,"ناجح",0.86851851851851847,"ممتاز"]
[69,"عبدالرحمن مرتضى عبدالعال ساتى الحسن","10 - 6",28,18,26,24,29,20,19,15.5,24.5,204,"ناجح",0.75555555555555554,"جيد جدا"]
[70,"عبدالقادر انس العمر","10 - 6",30,30,26,29,28,30,28,28,17.5,246.5,"ناجح",0.91296296296296309,"ممتاز"]
[71,"عبدالله حمد سالم العيسائى اليافعى","10 - 6",24.5,21,21.5,24,29,21,24,18,23,206,"ناجح",0.76296296296296295,"جيد جدا"]
[72,"عبدالله على عبدالمحسن راشد الهميمى","10 - 6",27.5,20.5,29,28,27,22,21,20,21.5,216.5,"ناجح",0.80185185185185182,"جيد جدا"]
[73,"على احمد عبدالله احمد العبدالله","10 - 6",23.5,22,20.5,22,20.5,16.5,20,17,18.5,180.5,"ناجح",0.66851851851851851,"جيد"]
[74,"محمد الفاضل يوسف محمد","10 - 6",21,21,17,25,18,20,25,20,23.5,190.5,"ناجح",0.7055555555555556,"جيد"]
[75,"محمد حمد حسين بن عباس الخزاعى","10 - 6",30,26,20,25,22,16,22,20,26.5,207.5,"ناجح",0.76851851851851849,"جيد جدا"]
[76,"محمد محمود صلاح الدين محمود محمد","10 - 6",29,19,28.5,20.5,22,21,23,19,18.5,200.5,"ناجح",0.74259259259259247,"جيد"]
[77,"محمد وليد سيد حسن عبدالمجيد","10 - 6",30,27,29,27,26,28.5,28,27,27.5,250,"ناجح",0.92592592592592593,"ممتاز"]
[78,"محمدنذير محمداياد الحريري","10 - 6",28,17.5,29,23.5,29,25,26,21.5,26,225.5,"ناجح",0.83518518518518514,"جيد جدا"]
[79,"يوسف عادل احمد محمد مدني","10 - 6",29,19.5,17.5,26.5,21,20,23,20,26,202.5,"ناجح",0.75,"جيد جدا"]
[80,"السيدهاشم جعفر علي شبر الوداعي","10 - 7",19.5,21,26.5,16.5,26,25,26,18,26,204.5,"ناجح",0.75740740740740753,"جيد جدا"]
[81,"جوعان حمد محمد على بن نوره","10 - 7",29.5,25,29,27,26,24,23,22,25,230.5,"ناجح",0.85370370370370385,"ممتاز"]
[82,"على سالم محمد ابوعرقوه المرى","10 - 7",16.5,22.5,27,25,26,27,24,22,25,215,"ناجح",0.79629629629629628,"جيد جدا"]
[83,"مجتبى كامل عبدالله محمد","10 - 7",25,15,20,18,18,18,22,21,25,182,"ناجح",0.67407407407407405,"جيد"]
[84,"محمد راشد عبدالمحسن راشد الهميمى","10 - 7",30,29,30,28,28,30,29,28,26,258,"ناجح",0.9555555555555556,"ممتاز"]
[85,"محمد سعيد سعد خالد مقبل","10 - 7",21,28,26,23,26,24,24,20,20,212,"ناجح",0.78518518518518521,"جيد جدا"]
[86,"محمد واصف عارف حيدر","10 - 7",29,25,27.5,29,30,26,25,26,23,240.5,"ناجح",0.89074074074074072,"ممتاز"]

{"sheet":"دور ثانى","index":2,"n_rows":161,"n_cols":18,"rows_kept":161,"cut":false,"hidden":false,"merged":[[7,17,9,17],[7,6,8,6],[7,7,8,7],[7,8,8,8],[7,9,8,9],[7,10,8,10],[7,11,8,11],[7,12,8,12],[7,13,9,13],[7,14,9,14],[7,15,9,15],[7,16,9,16],[7,5,8,5],[2,5,3,14],[7,0,9,0],[7,1,9,1],[7,2,9,2],[7,3,8,3],[7,4,8,4]]}
[]
[]
[null,null,null,null,null,"الراسبون"]
[]
[]
[]
[]
["رقم الجلوس","اسم الطالب","الصف","الرياضيات","الدراسات الاجتماعية","الحوسبة وتكنولوجيا المعلومات","الكيمياء","الفيزياء","الأحياء","التربية الإسلامية","اللغة العربية","اللغة الإنجليزية","المجموع الكلي","نتيجة الطالب","النسبة المئوية","التقدير العام للطالب","الترتيب","مواد الدور الثاني"]
[]
[null,null,null,30,30,30,30,30,30,30,30,30,{"$f":"SUM(D10:L10)","v":270}]
[1,"عبدالله فتحي سيد محمد جمعه","10 - 1",3,30,30,26.5,30,28,30,30,24.5,232,"دور ثانى",0.85925925925925928,"ممتاز",null,"الرياضيات / "]
[2,"عمر عبدالباسط ابراهيم محمد","10 - 1",26.5,23.5,28.5,25,30,14.5,26.5,27,29.5,231,"دور ثانى",0.85555555555555562,"ممتاز",null,"الأحياء / "]
[3,"معتز احمد كامل على خوالده","10 - 1",30,30,28,"غ",28,26,29,29,25,225,"دور ثانى",0.83333333333333348,"جيد جدا",null,"الكيمياء / "]
[4,"مهنا احمد محمد سيف النعيمى","10 - 1","غ",12,"غ",8,8,8,"غ",17,18,71,"دور ثانى",0.26296296296296295,"دون المستوى",null,"الرياضيات / الدراسات الاجتماعية / الحوسبة وتكنولوجيا المعلومات / الكيمياء / الفيزياء / الأحياء / التربية الإسلامية / "]
[5,"مؤمن شريف محمد التاج","10 - 1",29.5,30,29.5,"غ",28,29,30,30,24.5,230.5,"دور ثانى",0.85370370370370385,"ممتاز",null,"الكيمياء / "]
[6,"ياسين احمد صلاح عبداللطيف","10 - 1","غ","غ","غ","غ","غ","غ","غ","غ","غ","غ","دور ثانى","غ","غ",null,"الرياضيات / الدراسات الاجتماعية / الحوسبة وتكنولوجيا المعلومات / الكيمياء / الفيزياء / الأحياء / التربية الإسلامية / اللغة العربية / اللغة الإنجليزية / "]
[7,"بريك سالم دغش الجربوعى المرى","10 - 2",18,24,17,14.5,23,21,18,17,22,174.5,"دور ثانى",0.64629629629629615,"مقبول",null,"الكيمياء / "]
[8,"خالد طارق عبدالرحمن فوزي رامون","10 - 2","غ","غ","غ","غ","غ","غ","غ","غ","غ","غ","دور ثانى","غ","غ",null,"الرياضيات / الدراسات الاجتماعية / الحوسبة وتكنولوجيا المعلومات / الكيمياء / الفيزياء / الأحياء / التربية الإسلامية / اللغة العربية / اللغة الإنجليزية / "]
[9,"خالد ناصر محمد ناصر الدهيمى","10 - 2",14,27,19.5,19.5,23,25,25,24.5,26,203.5,"دور ثانى",0.75370370370370365,"جيد جدا",null,"الرياضيات / "]
[10,"زيد محمود احمد خشان","10 - 2",23.5,29,21,20.5,29,14,29,25.5,24,215.5,"دور ثانى",0.79814814814814805,"جيد جدا",null,"الأحياء / "]
[11,"سالم محمد سالم البطى الكعبى","10 - 2",8,27,21,16,22,19,19.5,20,14,166.5,"دور ثانى",0.6166666666666667,"مقبول",null,"الرياضيات / اللغة الإنجليزية / "]
[12,"سيف فهد موسى حسن على","10 - 2",14.5,24,24,17.5,17,22,21.5,15.5,18,174,"دور ثانى",0.64444444444444438,"مقبول",null,"الرياضيات / "]
[13,"عبدالرحمن اشرف فتحى سالم نصار","10 - 2","غ","غ","غ","غ","غ","غ","غ","غ","غ","غ","دور ثانى","غ","غ",null,"الرياضيات / الدراسات الاجتماعية / الحوسبة وتكنولوجيا المعلومات / الكيمياء / الفيزياء / الأحياء / التربية الإسلامية / اللغة العربية / اللغة الإنجليزية / "]
[14,"عبدالرحمن جمال على صالح سيد","10 - 2",23.5,28,18,13.5,27,22,24.5,21,25,202.5,"دور ثانى",0.75,"جيد جدا",null,"الكيمياء / "]
[15,"عبدالرحيم محمد رشيد الديرشوى","10 - 2",13.5,26,20,22,25,27.5,24.5,23.5,18,200,"دور ثانى",0.74074074074074081,"جيد",null,"الرياضيات / "]
[16,"عبدالعزيز عوض احمد محمد اليافعى","10 - 2",17,23,16,11,25,14.5,25.5,21,19,172,"دور ثانى",0.63703703703703707,"مقبول",null,"الكيمياء / الأحياء / "]
[17,"على نائل محمد عبدالله الخالدى","10 - 2",20,20.5,"غ",6,10.5,17,16.5,13,24,127.5,"دور ثانى",0.47222222222222221,"دون المستوى",null,"الحوسبة وتكنولوجيا المعلومات / الكيمياء / الفيزياء / اللغة العربية / "]
[18,"محمد محمود فاروق العبد","10 - 2",17.5,25,26,14.5,20,17,25,22.5,26,193.5,"دور ثانى",0.71666666666666667,"جيد",null,"الكيمياء / "]
[19,"احمد حافظ محمد ابوالكلام كبيرالدين","10 - 3",9.5,18.5,20.5,12,16,11,20,15,17,139.5,"دور ثانى",0.51666666666666672,"مقبول",null,"الرياضيات / الكيمياء / الأحياء / "]
[20,"احمد محمد احمد قنبر بلال","10 - 3",16,24,22.5,11,16,14,17.5,8,12.5,141.5,"دور ثانى",0.52407407407407403,"مقبول",null,"الكيمياء / الأحياء / اللغة العربية / اللغة الإنجليزية / "]
[21,"امان رشيد خان جول جنان","10 - 3",12.5,15.5,21.5,11,10.5,14,13,13,15,126,"دور ثانى",0.46666666666666662,"دون المستوى",null,"الرياضيات / الكيمياء / الفيزياء / الأحياء / التربية الإسلامية / اللغة العربية / "]
[22,"ايسر جهاد عبدالفتاح كراز","10 - 3",5,18.5,24.5,15,10.5,14,16,15,8,126.5,"دور ثانى",0.4685185185185185,"دون المستوى",null,"الرياضيات / الفيزياء / الأحياء / اللغة الإنجليزية / "]
[23,"بخيت مبخوت سالم سعيد خوار","10 - 3",22.5,16,25.5,17.5,21,13,14,17,14.5,161,"دور ثانى",0.59629629629629632,"مقبول",null,"الأحياء / التربية الإسلامية / اللغة الإنجليزية / "]
[24,"تميم محمد ابراهيم محمد فلامرزى","10 - 3",10.5,8,19.5,14,15,7.5,11,13,12,110.5,"دور ثانى",0.40925925925925921,"دون المستوى",null,"الرياضيات / الدراسات الاجتماعية / الكيمياء / الأحياء / التربية الإسلامية / اللغة العربية / اللغة الإنجليزية / "]
[25,"جابر سعد سالم النابت المرى","10 - 3",11,19,18.5,13,15.5,6.5,14,15,9.5,122,"دور ثانى",0.45185185185185184,"دون المستوى",null,"الرياضيات / الكيمياء / الأحياء / التربية الإسلامية / اللغة الإنجليزية / "]
[26,"جاسم عبدالله خالد عبدالله الكثيرى","10 - 3",19,17.5,18,9.5,15,13,15.5,16,6,129.5,"دور ثانى",0.47962962962962963,"دون المستوى",null,"الكيمياء / الأحياء / اللغة الإنجليزية / "]
[27,"حمد راشد حمد ال شابل المرى","10 - 3",20,16,16,12,19,11,20,18.5,8.5,141,"دور ثانى",0.52222222222222225,"مقبول",null,"الكيمياء / الأحياء / اللغة الإنجليزية / "]
[28,"خالد حسين بلوج زنى","10 - 3",7.5,5.5,20.5,6,11,8,14.5,14,14,101,"دور ثانى",0.37407407407407406,"دون المستوى",null,"الرياضيات / الدراسات الاجتماعية / الكيمياء / الفيزياء / الأحياء / التربية الإسلامية / اللغة العربية / اللغة الإنجليزية / "]
[29,"خلف فرحان عقيل الرويلى العنزى","10 - 3",13,13.5,21.5,7,14.5,11,12,9,10,111.5,"دور ثانى",0.41296296296296298,"دون المستوى",null,"الرياضيات / الدراسات الاجتماعية / الكيمياء / الفيزياء / الأحياء / التربية الإسلامية / اللغة العربية / اللغة الإنجليزية / "]
[30,"راشد خالد على محمد النديله","10 - 3",24,12,21,17.5,23,18,19,20,16.5,171,"دور ثانى",0.6333333333333333,"مقبول",null,"الدراسات الاجتماعية / "]
[31,"سالم سعد سالم النابت المرى","10 - 3",4.5,15,19,13,18.5,11.5,11,12,6.5,111,"دور ثانى",0.41111111111111109,"دون المستوى",null,"الرياضيات / الكيمياء / الأحياء / التربية الإسلامية / اللغة العربية / اللغة الإنجليزية / "]
[32,"سالم على محمد سالم خوار","10 - 3",10,15,20.5,9,17,8,13.5,14,"غ",107,"دور ثانى",0.39629629629629631,"دون المستوى",null,"الرياضيات / الكيمياء / الأحياء / التربية الإسلامية / اللغة العربية / اللغة الإنجليزية / "]
[33,"سعيد حسين ناصر ال شافعه المرى","10 - 3",16.5,13.5,21.5,9,16,12,18.5,16,16,139,"دور ثانى",0.51481481481481484,"مقبول",null,"الدراسات الاجتماعية / الكيمياء / الأحياء / "]
[34,"شاهين علي","10 - 3",20,10,22,8,13,10,12,11,24.5,130.5,"دور ثانى",0.48333333333333334,"دون المستوى",null,"الدراسات الاجتماعية / الكيمياء / الفيزياء / الأحياء / التربية الإسلامية / اللغة العربية / "]
[35,"عبدالرحمن فرج محمد المشعلى القحطانى","10 - 3",15.5,12.5,21,12,26,13,26.5,18,17.5,162,"دور ثانى",0.6,"مقبول",null,"الدراسات الاجتماعية / الكيمياء / الأحياء / "]
[36,"عبدالرشيد حسين عبدي","10 - 3",12,16.5,22,7,16,7.5,12,15,8,116,"دور ثانى",0.42962962962962964,"دون المستوى",null,"الرياضيات / الكيمياء / الأحياء / التربية الإسلامية / اللغة الإنجليزية / "]
[37,"عبدالله سعيد بخيت سعيد خوار","10 - 3",15,11.5,14,13.5,20,13.5,18.5,22,15.5,143.5,"دور ثانى",0.53148148148148144,"مقبول",null,"الدراسات الاجتماعية / الحوسبة وتكنولوجيا المعلومات / الكيمياء / الأحياء / "]
[38,"عبدالله سعيد عبدالله آل نابت المرى","10 - 3",22.5,15.5,15,15.5,22.5,11,14,14,16.5,146.5,"دور ثانى",0.54259259259259263,"مقبول",null,"الأحياء / التربية الإسلامية / اللغة العربية / "]
[39,"عبدالله عادل خصيف","10 - 3","غ","غ","غ","غ","غ","غ","غ","غ","غ","غ","دور ثانى","غ","غ",null,"الرياضيات / الدراسات الاجتماعية / الحوسبة وتكنولوجيا المعلومات / الكيمياء / الفيزياء / الأحياء / التربية الإسلامية / اللغة العربية / اللغة الإنجليزية / "]
[40,"عبدالله مبارك سالم بطى الكعبى","10 - 3",20.5,21,18,16.5,29,13,16,17.5,19,170.5,"دور ثانى",0.63148148148148153,"مقبول",null,"الأحياء / "]
[41,"على عجيم على عجيم الحبابى","10 - 3",15,26.5,21,19,19,11.5,12,15,19,158,"دور ثانى",0.58518518518518514,"مقبول",null,"الأحياء / التربية الإسلامية / "]
[42,"على فهد على احمد محمد","10 - 3",15,10.5,15,9,18,9,17,19,16.5,129,"دور ثانى",0.4777777777777778,"دون المستوى",null,"الدراسات الاجتماعية / الكيمياء / الأحياء / "]
[43,"عمر عبيدالله روح الامين مريضا","10 - 3",11,8.5,19.5,10,9,10.5,18.5,13,25.5,125.5,"دور ثانى",0.46481481481481479,"دون المستوى",null,"الرياضيات / الدراسات الاجتماعية / الكيمياء / الفيزياء / الأحياء / اللغة العربية / "]
[44,"ماجد صلاح خميس يوسف ابراهيم","10 - 3","غ","غ","غ","غ","غ",6,11,"غ",5,22,"دور ثانى",8.1481481481481488E-2,"دون المستوى",null,"الرياضيات / الدراسات الاجتماعية / الحوسبة وتكنولوجيا المعلومات / الكيمياء / الفيزياء / الأحياء / التربية الإسلامية / اللغة العربية / اللغة الإنجليزية / "]
[45,"محمد عبدالله عبدالله ابراهيم الخليفى","10 - 3",19.5,14.5,23,15.5,13,5,13,12,15.5,131,"دور ثانى",0.48518518518518516,"دون المستوى",null,"الدراسات الاجتماعية / الفيزياء / الأحياء / التربية الإسلامية / اللغة العربية / "]
[46,"محمد عبدالله محمد جاسم السويدى","10 - 3",22.5,13,17,19,11,0,14.5,17,16.5,130.5,"دور ثانى",0.48333333333333334,"دون المستوى",null,"الدراسات الاجتماعية / الفيزياء / الأحياء / التربية الإسلامية / "]
[47,"محمدزين عبدالحميد المبارك على","10 - 3",12,14.5,13,16,15,8,12,17,14.5,122,"دور ثانى",0.45185185185185184,"دون المستوى",null,"الرياضيات / الدراسات الاجتماعية / الحوسبة وتكنولوجيا المعلومات / الأحياء / التربية الإسلامية / اللغة الإنجليزية / "]
[48,"محمود اسعد الحاج الخلف","10 - 3",10.5,17.5,16,7,19,12,17.5,17.5,18,135,"دور ثانى",0.5,"مقبول",null,"الرياضيات / الكيمياء / الأحياء / "]
[49,"مسفر سعد محمد ذفال الحبابى","10 - 3","غ","غ","غ","غ","غ",12,13,"غ",13,38,"دور ثانى",0.14074074074074075,"دون المستوى",null,"الرياضيات / الدراسات الاجتماعية / الحوسبة وتكنولوجيا المعلومات / الكيمياء / الفيزياء / الأحياء / التربية الإسلامية / اللغة العربية / اللغة الإنجليزية / "]
[50,"ناصر جهان بخش مرادك درزاده","10 - 3",7.5,7,20,15,11,13.5,15.5,17.5,14,121,"دور ثانى",0.44814814814814807,"دون المستوى",null,"الرياضيات / الدراسات الاجتماعية / الفيزياء / الأحياء / اللغة الإنجليزية / "]
[51,"ناصر محمد خالد احمد الغانم","10 - 3",8,10,20,11,20,9.5,17,14,12,121.5,"دور ثانى",0.45,"دون المستوى",null,"الرياضيات / الدراسات الاجتماعية / الكيمياء / الأحياء / اللغة العربية / اللغة الإنجليزية / "]
[52,"يوسف صالح على عبدالعزيز على","10 - 3",23,10,18.5,16.5,23,15.5,10,16,23.5,156,"دور ثانى",0.57777777777777772,"مقبول",null,"الدراسات الاجتماعية / التربية الإسلامية / "]
[53,"احمد رائد سليمان المومني","10 - 4",11.5,21,27,11.5,20,10.5,22,22,18.5,164,"دور ثانى",0.6074074074074074,"مقبول",null,"الرياضيات / الكيمياء / الأحياء / "]
[54,"أحمد نافذ حماده حموده","10 - 4",12,22,18,20.5,17,12,23,17.5,18,160,"دور ثانى",0.59259259259259256,"مقبول",null,"الرياضيات / الأحياء / "]
[55,"تميم سالم راشد الصعاق المرى","10 - 4",14,11,17,13.5,20,6,17,14.5,6.5,119.5,"دور ثانى",0.44259259259259259,"دون المستوى",null,"الرياضيات / الدراسات الاجتماعية / الكيمياء / الأحياء / اللغة العربية / اللغة الإنجليزية / "]
[56,"جابر سعيد جابر سالم اليربوعى","10 - 4",13.5,12.5,19,17,7,8,15,15,"غ",107,"دور ثانى",0.39629629629629631,"دون المستوى",null,"الرياضيات / الدراسات الاجتماعية / الفيزياء / الأحياء / اللغة الإنجليزية / "]
[57,"جاسم محمود محمد عبداللهي","10 - 4",20.5,26,16,20,20,14,24,23.5,18,182,"دور ثانى",0.67407407407407405,"جيد",null,"الأحياء / "]
[58,"حمد محمد بخيت تويم المرى","10 - 4",19,15.5,11,12,20,7,20.5,18,16.5,139.5,"دور ثانى",0.51666666666666672,"مقبول",null,"الحوسبة وتكنولوجيا المعلومات / الكيمياء / الأحياء / "]
[59,"خالد سعيد محمد البريكان المرى","10 - 4",14,24,18.5,22,22,21,24,23,15.5,184,"دور ثانى",0.68148148148148158,"جيد",null,"الرياضيات / "]
[60,"خميس محمد سيف خميس الريامي","10 - 4",18,19.5,21.5,17,15,11.5,24.5,15,12.5,154.5,"دور ثانى",0.57222222222222219,"مقبول",null,"الأحياء / اللغة الإنجليزية / "]
[61,"راشد حمد راشد سالم خادم","10 - 4",14.5,9.5,19,7.5,13,8.5,13,8,"غ",93,"دور ثانى",0.34444444444444444,"دون المستوى",null,"الرياضيات / الدراسات الاجتماعية / الكيمياء / الفيزياء / الأحياء / التربية الإسلامية / اللغة العربية / اللغة الإنجليزية / "]
[62,"سالم حمد سالم اليربوعى المرى","10 - 4","غ","غ","غ","غ","غ","غ","غ","غ","غ","غ","دور ثانى","غ","غ",null,"الرياضيات / الدراسات الاجتماعية / الحوسبة وتكنولوجيا المعلومات / الكيمياء / الفيزياء / الأحياء / التربية الإسلامية / اللغة العربية / اللغة الإنجليزية / "]
[63,"سليمان حسن علي سليمان موسى","10 - 4",17.5,16,19.5,16,18.5,13.5,26,19,15.5,161.5,"دور ثانى",0.5981481481481481,"مقبول",null,"الأحياء / "]
[64,"شعيب عبدي قرني قلديد","10 - 4",10,11.5,17,13,19,11.5,20,17.5,9.5,129,"دور ثانى",0.4777777777777778,"دون المستوى",null,"الرياضيات / الدراسات الاجتماعية / الكيمياء / الأحياء / اللغة الإنجليزية / "]
[65,"عابدين حافظ عابدين موسى","10 - 4",10,18.5,20.5,15,19,11.5,18,17.5,18.5,148.5,"دور ثانى",0.55000000000000004,"مقبول",null,"الرياضيات / الأحياء / "]
[66,"عبدالرحمن صبرى عثمان محسن اليهرى","10 - 4",17.5,24,21,15.5,22,12.5,21,17.5,12,163,"دور ثانى",0.60370370370370374,"مقبول",null,"الأحياء / اللغة الإنجليزية / "]
[67,"عبدالله سالم محمد سالم خوار","10 - 4",9,17,20.5,24,13.5,8,14,9,"غ",115,"دور ثانى",0.42592592592592593,"دون المستوى",null,"الرياضيات / الفيزياء / الأحياء / التربية الإسلامية / اللغة العربية / اللغة الإنجليزية / "]
[68,"على محمد عويض الصقور المرى","10 - 4",12,13,15.5,16,10.5,11,17,18,17.5,130.5,"دور ثانى",0.48333333333333334,"دون المستوى",null,"الرياضيات / الدراسات الاجتماعية / الفيزياء / الأحياء / "]
[69,"علي عاطف سالم ابراهيم سالم","10 - 4",11.5,19,20,16,7,13,24,21,24,155.5,"دور ثانى",0.57592592592592595,"مقبول",null,"الرياضيات / الفيزياء / الأحياء / "]
[70,"علي محمد عبدالله احمد شمس","10 - 4",20.5,12,17.5,24,18,16,21,21.5,17.5,168,"دور ثانى",0.62222222222222223,"مقبول",null,"الدراسات الاجتماعية / "]
[71,"فهد سويد سلطان محمد الخوار","10 - 4",10,19,18,10.5,12,7.5,20,15,17.5,129.5,"دور ثانى",0.47962962962962963,"دون المستوى",null,"الرياضيات / الكيمياء / الفيزياء / الأحياء / "]
[72,"محمد حافظ محمد ابوالكلام كبيرالدين","10 - 4",8,24,22,12,16,16,20,20.5,21.5,160,"دور ثانى",0.59259259259259256,"مقبول",null,"الرياضيات / الكيمياء / "]
[73,"محمد حسن حسن ناجى الجدره","10 - 4",17,20.5,19,12,14,14,22.5,19.5,16,154.5,"دور ثانى",0.57222222222222219,"مقبول",null,"الكيمياء / الفيزياء / الأحياء / "]
[74,"محمد حمد محمد صالح الصرامى","10 - 4",12,10,19.5,14,24,10,24,20,21,154.5,"دور ثانى",0.57222222222222219,"مقبول",null,"الرياضيات / الدراسات الاجتماعية / الكيمياء / الأحياء / "]
[75,"محمد يوسف محمد ابراهيم محمد","10 - 4",5,16.5,15,10.5,11.5,10,17,16,11.5,113,"دور ثانى",0.41851851851851846,"دون المستوى",null,"الرياضيات / الكيمياء / الفيزياء / الأحياء / اللغة الإنجليزية / "]
[76,"محمد يونس محمد زحمت كش","10 - 4",11.5,17.5,15,17.5,21,13,21.5,15,14.5,146.5,"دور ثانى",0.54259259259259263,"مقبول",null,"الرياضيات / الأحياء / اللغة الإنجليزية / "]
[77,"بدر ناصر جابر سهل المرى","10 - 5",20.5,11,16,13,18,17,12,16,16,139.5,"دور ثانى",0.51666666666666672,"مقبول",null,"الدراسات الاجتماعية / الكيمياء / التربية الإسلامية / "]
[78,"حزام زيد راشد المري","10 - 5",12,16,10.5,16,19,19.5,14,14,15,136,"دور ثانى",0.50370370370370365,"مقبول",null,"الرياضيات / الحوسبة وتكنولوجيا المعلومات / التربية الإسلامية / اللغة العربية / "]
[79,"حمد سعيد سويلم سعد الخوار","10 - 5",15,9,6.5,8,15,2,13.5,12.5,15.5,97,"دور ثانى",0.35925925925925933,"دون المستوى",null,"الدراسات الاجتماعية / الحوسبة وتكنولوجيا المعلومات / الكيمياء / الأحياء / التربية الإسلامية / اللغة العربية / "]
[80,"حمد مبارك مفتاح فرج العبدالله","10 - 5",9,8,14.5,13,11,9.5,16,12,8,101,"دور ثانى",0.37407407407407406,"دون المستوى",null,"الرياضيات / الدراسات الاجتماعية / الحوسبة وتكنولوجيا المعلومات / الكيمياء / الفيزياء / الأحياء / اللغة العربية / اللغة الإنجليزية / "]
[81,"خالد عزيز حسن عبدربه حسن","10 - 5",20,17,15,9,21,20.5,23,21.5,18,165,"دور ثانى",0.61111111111111116,"مقبول",null,"الكيمياء / "]
[82,"دغش بريك دغش الجربوعى المرى","10 - 5",12.5,19,21,22,17,18.5,16,18.5,15,159.5,"دور ثانى",0.59074074074074079,"مقبول",null,"الرياضيات / "]
[83,"راشد حمد ناصر المري","10 - 5",8,18,17,15.5,22,13.5,19.5,17,20,150.5,"دور ثانى",0.55740740740740746,"مقبول",null,"الرياضيات / الأحياء / "]
[84,"راشد شريف خان عيسى خان","10 - 5",19,16,8.5,16,19,16,17,16,23,150.5,"دور ثانى",0.55740740740740746,"مقبول",null,"الحوسبة وتكنولوجيا المعلومات / "]
[85,"سالم محمد راشد طفله الفهيده","10 - 5",8.5,11,18.5,8,13,5,16,10,10,100,"دور ثانى",0.37037037037037041,"دون المستوى",null,"الرياضيات / الدراسات الاجتماعية / الكيمياء / الفيزياء / الأحياء / اللغة العربية / اللغة الإنجليزية / "]
[86,"سعد حمد سعد البويصم المرى","10 - 5",16,15,13.5,15,20,13.5,19,20.5,16,148.5,"دور ثانى",0.55000000000000004,"مقبول",null,"الحوسبة وتكنولوجيا المعلومات / الأحياء / "]
[87,"صلاح عارف احمد عبده جمن","10 - 5",15,18,15,13.5,21,20,19,20,23,164.5,"دور ثانى",0.60925925925925928,"مقبول",null,"الكيمياء / "]
[88,"عبدالعزيز نايف عبدالله نايف","10 - 5",17,22,26.5,21,26,20,26.5,26,13,198,"دور ثانى",0.73333333333333328,"جيد",null,"اللغة الإنجليزية / "]
[89,"عبدالله عبدالرحمن","10 - 5",15.5,15,14.5,16.5,22,12,15,20,20,150.5,"دور ثانى",0.55740740740740746,"مقبول",null,"الحوسبة وتكنولوجيا المعلومات / الأحياء / "]
[90,"عبدالمحسن عادل عبدالمحسن محمد الدهنيم","10 - 5",14,19,14.5,15,18.5,18,17,17,18,151,"دور ثانى",0.55925925925925923,"مقبول",null,"الرياضيات / الحوسبة وتكنولوجيا المعلومات / "]
[91,"على حسن مبخوت سعيد الراشدى","10 - 5",16,10.5,8.5,14,17.5,12,9.5,16,11,115,"دور ثانى",0.42592592592592593,"دون المستوى",null,"الدراسات الاجتماعية / الحوسبة وتكنولوجيا المعلومات / الكيمياء / الأحياء / التربية الإسلامية / اللغة الإنجليزية / "]
[92,"على سالم ظافر ال حثيث الاحبابى","10 - 5",23,23,21.5,17.5,28,12.5,15.5,19,17.5,177.5,"دور ثانى",0.65740740740740744,"جيد",null,"الأحياء / "]
[93,"عمر شادي نعيم زهران","10 - 5","غ","غ","غ","غ","غ","غ","غ","غ","غ","غ","دور ثانى","غ","غ",null,"الرياضيات / الدراسات الاجتماعية / الحوسبة وتكنولوجيا المعلومات / الكيمياء / الفيزياء / الأحياء / التربية الإسلامية / اللغة العربية / اللغة الإنجليزية / "]
[94,"غانم حمد صالح سعيد القريصى","10 - 5",10,7,11.5,9,9,11,11,9,9,86.5,"دور ثانى",0.32037037037037036,"دون المستوى",null,"الرياضيات / الدراسات الاجتماعية / الحوسبة وتكنولوجيا المعلومات / الكيمياء / الفيزياء / الأحياء / التربية الإسلامية / اللغة العربية / اللغة الإنجليزية / "]
[95,"فهد سعد سعيد بخيت الخوار","10 - 5",13.5,12.5,21.5,10,17,10,10,13,8.5,116,"دور ثانى",0.42962962962962964,"دون المستوى",null,"الرياضيات / الدراسات الاجتماعية / الكيمياء / الأحياء / التربية الإسلامية / اللغة العربية / اللغة الإنجليزية / "]
[96,"قصي محمد داود ابراهيم ابوديه","10 - 5",11.5,26.5,18,20,20,17.5,22.5,21,13,170,"دور ثانى",0.62962962962962965,"مقبول",null,"الرياضيات / اللغة الإنجليزية / "]
[97,"محمد امين بن عادل قنوني","10 - 5",15.5,22,14.5,9.5,26,12,18.5,24,15,157,"دور ثانى",0.58148148148148149,"مقبول",null,"الحوسبة وتكنولوجيا المعلومات / الكيمياء / الأحياء / "]
[98,"محمد سعيد جابر سالم اليربوعى","10 - 5","غ","غ","غ","غ","غ","غ","غ","غ","غ","غ","دور ثانى","غ","غ",null,"الرياضيات / الدراسات الاجتماعية / الحوسبة وتكنولوجيا المعلومات / الكيمياء / الفيزياء / الأحياء / التربية الإسلامية / اللغة العربية / اللغة الإنجليزية / "]
[99,"محمد طارق الحاج","10 - 5",20.5,23,18.5,17,21.5,19,20,13,20,172.5,"دور ثانى",0.63888888888888884,"مقبول",null,"اللغة العربية / "]
[100,"محمد عبدالله شيخ محمد","10 - 5",17,21,13,24,28,23,24.5,22,22,194.5,"دور ثانى",0.72037037037037033,"جيد",null,"الحوسبة وتكنولوجيا المعلومات / "]
[101,"محمد محسن محمد دخيل اليربوعى","10 - 5",8.5,13,11,5.5,11,8,6,13,9,85,"دور ثانى",0.31481481481481483,"دون المستوى",null,"الرياضيات / الدراسات الاجتماعية / الحوسبة وتكنولوجيا المعلومات / الكيمياء / الفيزياء / الأحياء / التربية الإسلامية / اللغة العربية / اللغة الإنجليزية / "]
[102,"نصر على نصر على النصر","10 - 5",7,16,16,9,15,12.5,12,14,10,111.5,"دور ثانى",0.41296296296296298,"دون المستوى",null,"الرياضيات / الكيمياء / الأحياء / التربية الإسلامية / اللغة العربية / اللغة الإنجليزية / "]
[103,"حمد اصغر خان نواب خان","10 - 6",7,6,"غ",4,10,6.5,8,7,19,67.5,"دور ثانى",0.25,"دون المستوى",null,"الرياضيات / الدراسات الاجتماعية / الحوسبة وتكنولوجيا المعلومات / الكيمياء / الفيزياء / الأحياء / التربية الإسلامية / اللغة العربية / "]
[104,"خالد سلطان حسن عباس الجمالى","10 - 6",21.5,15.5,26,12,20,14,17,13,18,157,"دور ثانى",0.58148148148148149,"مقبول",null,"الكيمياء / الأحياء / اللغة العربية / "]
[105,"عبدالرجمن يارمحمد معين خان","10 - 6",19.5,10,1,17,24,14,18.5,15,13.5,132.5,"دور ثانى",0.49074074074074076,"دون المستوى",null,"الدراسات الاجتماعية / الحوسبة وتكنولوجيا المعلومات / الأحياء / اللغة الإنجليزية / "]
[106,"عبدالرحمن جاسم محمد قاسم العمادى","10 - 6",19.5,15.5,9,10,17,14.5,15,13,19.5,133,"دور ثانى",0.49259259259259258,"دون المستوى",null,"الحوسبة وتكنولوجيا المعلومات / الكيمياء / الأحياء / اللغة العربية / "]
[107,"عبدالرحمن حسين عبدي","10 - 6",18,7,3,8,15,9.5,17.5,12,21,111,"دور ثانى",0.41111111111111109,"دون المستوى",null,"الدراسات الاجتماعية / الحوسبة وتكنولوجيا المعلومات / الكيمياء / الأحياء / اللغة العربية / "]
[108,"عبدالرحمن محماس غزاى المقاطى العتيبى","10 - 6",11.5,10,"غ",9,12,8.5,18,20,9,98,"دور ثانى",0.36296296296296299,"دون المستوى",null,"الرياضيات / الدراسات الاجتماعية / الحوسبة وتكنولوجيا المعلومات / الكيمياء / الفيزياء / الأحياء / اللغة الإنجليزية / "]
[109,"عبدالعزيز جهان بخش مرادك درزاده","10 - 6",14,7,8,10,16,12.5,16.5,11,15,110,"دور ثانى",0.40740740740740738,"دون المستوى",null,"الرياضيات / الدراسات الاجتماعية / الحوسبة وتكنولوجيا المعلومات / الكيمياء / الأحياء / اللغة العربية / "]
[110,"عبدالعزيز سلطان حسن سالم الكثيرى","10 - 6",20.5,16.5,16,21,19,13,22,17,17.5,162.5,"دور ثانى",0.60185185185185186,"مقبول",null,"الأحياء / "]
[111,"عبدالغني عثمان عمر ورسمة","10 - 6",18,18.5,1.5,16,17,14,18,12,13.5,128.5,"دور ثانى",0.47592592592592597,"دون المستوى",null,"الحوسبة وتكنولوجيا المعلومات / الأحياء / اللغة العربية / اللغة الإنجليزية / "]
[112,"عبدالله جاسم على محمد القايد","10 - 6",25.5,17,12.5,15,18,10,22.5,15,18.5,154,"دور ثانى",0.57037037037037042,"مقبول",null,"الحوسبة وتكنولوجيا المعلومات / الأحياء / "]
[113,"عبدالله محماس غزاى المقاطى العتيبى","10 - 6",12.5,11,9.5,21,19,9.5,12,19,7.5,121,"دور ثانى",0.44814814814814807,"دون المستوى",null,"الرياضيات / الدراسات الاجتماعية / الحوسبة وتكنولوجيا المعلومات / الأحياء / التربية الإسلامية / اللغة الإنجليزية / "]
[114,"عبدالله ناصر عبده السعدى اليافعى","10 - 6",25,18,12,19,24,16,23,17,25,179,"دور ثانى",0.66296296296296309,"جيد",null,"الحوسبة وتكنولوجيا المعلومات / "]
[115,"على فهد على شفيع الفهيده","10 - 6",17,28,7,14,23,18.5,19,19,18,163.5,"دور ثانى",0.60555555555555551,"مقبول",null,"الحوسبة وتكنولوجيا المعلومات / الكيمياء / "]
[116,"فارس وليد محي الدين","10 - 6",15.5,14.5,21.5,15,18,10.5,16,18,25.5,154.5,"دور ثانى",0.57222222222222219,"مقبول",null,"الدراسات الاجتماعية / الأحياء / "]
[117,"قطبى ياسر القطبي ادريس","10 - 6","غ","غ","غ","غ","غ","غ","غ","غ","غ","غ","دور ثانى","غ","غ",null,"الرياضيات / الدراسات الاجتماعية / الحوسبة وتكنولوجيا المعلومات / الكيمياء / الفيزياء / الأحياء / التربية الإسلامية / اللغة العربية / اللغة الإنجليزية / "]
[118,"محمد جابر حسين على الجرحب","10 - 6",18.5,21,24,12,16,17,18,17,14.5,158,"دور ثانى",0.58518518518518514,"مقبول",null,"الكيمياء / اللغة الإنجليزية / "]
[119,"محمد على سالم حمد جبران","10 - 6",5.5,13,7,3,16,12,17,13.5,12.5,99.5,"دور ثانى",0.36851851851851852,"دون المستوى",null,"الرياضيات / الدراسات الاجتماعية / الحوسبة وتكنولوجيا المعلومات / الكيمياء / الأحياء / اللغة العربية / اللغة الإنجليزية / "]
[120,"مشعل عبدالرحمن عبدالله عبدالعزيز الاسحاق","10 - 6",22,17.5,26,18,13,13.5,18.5,15,21.5,165,"دور ثانى",0.61111111111111116,"مقبول",null,"الفيزياء / الأحياء / "]
[121,"مصطفى محمد مصطفى العبيد احمد","10 - 6",20.5,29,15,26.5,23,23.5,25.5,20,14.5,197.5,"دور ثانى",0.73148148148148151,"جيد",null,"اللغة الإنجليزية / "]
[122,"نايف حسن احمد الحيى النعيمى","10 - 6",7.5,10,1.5,8.5,8,7,18.5,16,7,84,"دور ثانى",0.31111111111111112,"دون المستوى",null,"الرياضيات / الدراسات الاجتماعية / الحوسبة وتكنولوجيا المعلومات / الكيمياء / الفيزياء / الأحياء / اللغة الإنجليزية / "]
[123,"نواف على هادى الجربوعى المرى","10 - 6",19,7.5,1,15,15,15,20,10,7,109.5,"دور ثانى",0.40555555555555556,"دون المستوى",null,"الدراسات الاجتماعية / الحوسبة وتكنولوجيا المعلومات / اللغة العربية / اللغة الإنجليزية / "]
[124,"يوسف خالد ناصر عبدالكريم مثنى","10 - 6",12,9,5.5,11.5,18,13.5,15,9,9,102.5,"دور ثانى",0.37962962962962959,"دون المستوى",null,"الرياضيات / الدراسات الاجتماعية / الحوسبة وتكنولوجيا المعلومات / الكيمياء / الأحياء / اللغة العربية / اللغة الإنجليزية / "]
[125,"بلال ابراهيم","10 - 7","غ","غ","غ","غ","غ","غ","غ","غ","غ","غ","دور ثانى","غ","غ",null,"الرياضيات / الدراسات الاجتماعية / الحوسبة وتكنولوجيا المعلومات / الكيمياء / الفيزياء / الأحياء / التربية الإسلامية / اللغة العربية / اللغة الإنجليزية / "]
[126,"تركى مبارك تركى سعد التركى","10 - 7",10.5,25,10,10,23,17,16,16,10,137.5,"دور ثانى",0.5092592592592593,"مقبول",null,"الرياضيات / الحوسبة وتكنولوجيا المعلومات / الكيمياء / اللغة الإنجليزية / "]
[127,"تميم على يوسف محمد الحمادى","10 - 7",14,13.5,21.5,11.5,18,16,12.5,8,7.5,122.5,"دور ثانى",0.45370370370370372,"دون المستوى",null,"الرياضيات / الدراسات الاجتماعية / الكيمياء / التربية الإسلامية / اللغة العربية / اللغة الإنجليزية / "]
[128,"جاسم حسين جاسم على بوكربل","10 - 7",22.5,14,15,20,22,27,24,21.5,18.5,184.5,"دور ثانى",0.68333333333333324,"جيد",null,"الدراسات الاجتماعية / "]
[129,"جاسم محمد فرج البريص المري","10 - 7",13,14,11.5,8,16,11,18.5,16,"غ",108,"دور ثانى",0.4,"دون المستوى",null,"الرياضيات / الدراسات الاجتماعية / الحوسبة وتكنولوجيا المعلومات / الكيمياء / الأحياء / اللغة الإنجليزية / "]
[130,"خالد ناصر محمد اللواء المرى","10 - 7",10.5,11,21.5,19.5,17,11.5,14,13,19,137,"دور ثانى",0.50740740740740742,"مقبول",null,"الرياضيات / الدراسات الاجتماعية / الأحياء / التربية الإسلامية / اللغة العربية / "]
[131,"سالم عبدالله سالم سعيد خوار","10 - 7",15,19,16.5,16,16,6.5,14.5,12.5,13,129,"دور ثانى",0.4777777777777778,"دون المستوى",null,"الأحياء / التربية الإسلامية / اللغة العربية / اللغة الإنجليزية / "]
[132,"سعد مبارك تركى سعد التركى","10 - 7",13,23,7.5,9,23,11.5,21,15.5,11.5,135,"دور ثانى",0.5,"مقبول",null,"الرياضيات / الحوسبة وتكنولوجيا المعلومات / الكيمياء / الأحياء / اللغة الإنجليزية / "]
[133,"سعود خالد محمود بومحمود الشيخ","10 - 7",16.5,11.5,21,16.5,14,20,15,18,15.5,148,"دور ثانى",0.54814814814814816,"مقبول",null,"الدراسات الاجتماعية / الفيزياء / "]
[134,"سلطان سعيد سالم غلفيص النابت","10 - 7",5,11.5,18.5,9.5,11,8.5,13.5,15.5,10,103,"دور ثانى",0.38148148148148148,"دون المستوى",null,"الرياضيات / الدراسات الاجتماعية / الكيمياء / الفيزياء / الأحياء / التربية الإسلامية / اللغة الإنجليزية / "]
[135,"عبدالرحمن عبدالحميد محمد صالح العمودى","10 - 7",14,25,8.5,14.5,20,12,20.5,8,"غ",122.5,"دور ثانى",0.45370370370370372,"دون المستوى",null,"الرياضيات / الحوسبة وتكنولوجيا المعلومات / الكيمياء / الأحياء / اللغة العربية / اللغة الإنجليزية / "]
[136,"عبدالله راشد محسن حزام انديله","10 - 7",22.5,18.5,22.5,21.5,25,12,21,15.5,"غ",158.5,"دور ثانى",0.58703703703703702,"مقبول",null,"الأحياء / اللغة الإنجليزية / "]
[137,"على ناصر على ال مشروم المرى","10 - 7",27,26,25.5,26.5,22,18.5,22.5,13,23,204,"دور ثانى",0.75555555555555554,"جيد جدا",null,"اللغة العربية / "]
[138,"عمر عصام الدين محي حسن","10 - 7","غ","غ","غ","غ","غ","غ","غ","غ","غ","غ","دور ثانى","غ","غ",null,"الرياضيات / الدراسات الاجتماعية / الحوسبة وتكنولوجيا المعلومات / الكيمياء / الفيزياء / الأحياء / التربية الإسلامية / اللغة العربية / اللغة الإنجليزية / "]
[139,"عيسى محمد عبد الله عامرى","10 - 7",14.5,23.5,20.5,21,19,18,20,20.5,18,175,"دور ثانى",0.64814814814814814,"مقبول",null,"الرياضيات / "]
[140,"فارس سالم حسن سالم الكثيرى","10 - 7",18,25.5,19,19.5,17,14,22,24,27.5,186.5,"دور ثانى",0.69074074074074077,"جيد",null,"الأحياء / "]
[141,"فهد ابوبكر محمد مبخوت الصيعرى","10 - 7",10,7.5,2.5,13,15.5,4,13.5,13,14,93,"دور ثانى",0.34444444444444444,"دون المستوى",null,"الرياضيات / الدراسات الاجتماعية / الحوسبة وتكنولوجيا المعلومات / الكيمياء / الأحياء / التربية الإسلامية / اللغة العربية / اللغة الإنجليزية / "]
[142,"مبارك سالم مبارك النابت المرى","10 - 7",12.5,15,10,18.5,16,12.5,17,7,14,122.5,"دور ثانى",0.45370370370370372,"دون المستوى",null,"الرياضيات / الحوسبة وتكنولوجيا المعلومات / الأحياء / اللغة العربية / اللغة الإنجليزية / "]
[143,"محمد احمد جمعه احمد السبيعى","10 - 7",16,12,20.5,10.5,22,15.5,14.5,17,17.5,145.5,"دور ثانى",0.53888888888888886,"مقبول",null,"الدراسات الاجتماعية / الكيمياء / التربية الإسلامية / "]
[144,"محمد بدرالدين ميرغنى ادم على","10 - 7",10.5,10.5,17.5,18,12,14.5,21,24,15,143,"دور ثانى",0.52962962962962967,"مقبول",null,"الرياضيات / الدراسات الاجتماعية / الفيزياء / الأحياء / "]
[145,"محمد راشد سالم صالح لحيمر","10 - 7",14,22,19.5,16,14,16,16.5,17,16,151,"دور ثانى",0.55925925925925923,"مقبول",null,"الرياضيات / الفيزياء / "]
[146,"محمد رائد عبدالرحيم","10 - 7",13,19.5,25,19,13,11.5,18,18,19.5,156.5,"دور ثانى",0.57962962962962961,"مقبول",null,"الرياضيات / الفيزياء / الأحياء / "]
[147,"محمد عادل عبدالله محمد الخورى","10 - 7",8,6.5,10,15,13,9.5,18.5,12,11,103.5,"دور ثانى",0.38333333333333336,"دون المستوى",null,"الرياضيات / الدراسات الاجتماعية / الحوسبة وتكنولوجيا المعلومات / الفيزياء / الأحياء / اللغة العربية / اللغة الإنجليزية / "]
[148,"محمد عبدالله محمد امين ابراهيم","10 - 7",22.5,11,25,16,26.5,15,22.5,22.5,23,184,"دور ثانى",0.68148148148148158,"جيد",null,"الدراسات الاجتماعية / "]
[149,"مشعل خالد احمد سليمان الهيل","10 - 7",19.5,16,21,22.5,27,14,24,18,23,185,"دور ثانى",0.68518518518518523,"جيد",null,"الأحياء / "]
[150,"ناصر راشد على العلى المعاضيد","10 - 7",12.5,14.5,15,15,17,7,13,13,11,118,"دور ثانى",0.437037037037037,"دون المستوى",null,"الرياضيات / الدراسات الاجتماعية / الأحياء / التربية الإسلامية / اللغة العربية / اللغة الإنجليزية / "]
[151,"نايف على هادف انديله الحسناء","10 - 7",8.5,12.5,13,10.5,17,10.5,14,16,10,112,"دور ثانى",0.4148148148148148,"دون المستوى",null,"الرياضيات / الدراسات الاجتماعية / الحوسبة وتكنولوجيا المعلومات / الكيمياء / الأحياء / التربية الإسلامية / اللغة الإنجليزية / "]

{"sheet":"كشف بالتلاميذ الناجحين","index":3,"n_rows":90,"n_cols":8,"rows_kept":90,"cut":false,"hidden":false,"merged":[[0,2,1,2],[2,3,2,7]]}
[]
[]
[null,null,null,"كشف الطلاب الناجحين"]
[null,null,null,"م","اسم الطالب","الصف","المجموع","النسبة المئوية"]
[null,null,null,{"$f":"ROW()-4","v":1},{"$f":"VLOOKUP(D5,ناجح!A11:P100,2,0)","v":"احمد حسن احمد سليمان الهيل"},{"$f":"VLOOKUP(D5,ناجح!A11:P100,3,0)","v":"10 - 1"},{"$f":"VLOOKUP(D5,ناجح!A11:P100,13,0)","v":186},{"$f":"VLOOKUP(D5,ناجح!A11:P100,15,0)","v":0.68888888888888888}]
[null,null,null,2,{"$f":"VLOOKUP(D6,ناجح!A12:P101,2,0)","v":"احمد عبداللاه احمد يحيى عبدالاله"},{"$f":"VLOOKUP(D6,ناجح!A12:P101,3,0)","v":"10 - 1"},{"$f":"VLOOKUP(D6,ناجح!A12:P101,13,0)","v":224},{"$f":"VLOOKUP(D6,ناجح!A12:P101,15,0)","v":0.82962962962962961}]
[null,null,null,3,{"$f":"VLOOKUP(D7,ناجح!A13:P102,2,0)","v":"احمد محمود احمد عبدالسميع عثمان"},{"$f":"VLOOKUP(D7,ناجح!A13:P102,3,0)","v":"10 - 1"},{"$f":"VLOOKUP(D7,ناجح!A13:P102,13,0)","v":253},{"$f":"VLOOKUP(D7,ناجح!A13:P102,15,0)","v":0.937037037037037}]
[null,null,null,4,{"$f":"VLOOKUP(D8,ناجح!A14:P103,2,0)","v":"جمال عبدالغفار كمال على"},{"$f":"VLOOKUP(D8,ناجح!A14:P103,3,0)","v":"10 - 1"},{"$f":"VLOOKUP(D8,ناجح!A14:P103,13,0)","v":228},{"$f":"VLOOKUP(D8,ناجح!A14:P103,15,0)","v":0.84444444444444444}]
[null,null,null,5,{"$f":"VLOOKUP(D9,ناجح!A15:P104,2,0)","v":"حسن محمد العبود الصالح"},{"$f":"VLOOKUP(D9,ناجح!A15:P104,3,0)","v":"10 - 1"},{"$f":"VLOOKUP(D9,ناجح!A15:P104,13,0)","v":243},{"$f":"VLOOKUP(D9,ناجح!A15:P104,15,0)","v":0.9}]
[null,null,null,6,{"$f":"VLOOKUP(D10,ناجح!A16:P105,2,0)","v":"خالد مصعب خضر عبدالله تايه"},{"$f":"VLOOKUP(D10,ناجح!A16:P105,3,0)","v":"10 - 1"},{"$f":"VLOOKUP(D10,ناجح!A16:P105,13,0)","v":267},{"$f":"VLOOKUP(D10,ناجح!A16:P105,15,0)","v":0.98888888888888882}]
[null,null,null,7,{"$f":"VLOOKUP(D11,ناجح!A17:P106,2,0)","v":"سيف سعيد احمد عبدالمجيد عبدالرحيم"},{"$f":"VLOOKUP(D11,ناجح!A17:P106,3,0)","v":"10 - 1"},{"$f":"VLOOKUP(D11,ناجح!A17:P106,13,0)","v":240.5},{"$f":"VLOOKUP(D11,ناجح!A17:P106,15,0)","v":0.89074074074074072}]
[null,null,null,8,{"$f":"VLOOKUP(D12,ناجح!A18:P107,2,0)","v":"شعيب خالد شعيب جاب الله"},{"$f":"VLOOKUP(D12,ناجح!A18:P107,3,0)","v":"10 - 1"},{"$f":"VLOOKUP(D12,ناجح!A18:P107,13,0)","v":241.5},{"$f":"VLOOKUP(D12,ناجح!A18:P107,15,0)","v":0.89444444444444438}]
[null,null,null,9,{"$f":"VLOOKUP(D13,ناجح!A19:P108,2,0)","v":"عادل سعيد فتحي مصطفى عوض  الله"},{"$f":"VLOOKUP(D13,ناجح!A19:P108,3,0)","v":"10 - 1"},{"$f":"VLOOKUP(D13,ناجح!A19:P108,13,0)","v":238.5},{"$f":"VLOOKUP(D13,ناجح!A19:P108,15,0)","v":0.8833333333333333}]
[null,null,null,10,{"$f":"VLOOKUP(D14,ناجح!A20:P109,2,0)","v":"عامر محمد عمر عجيز"},{"$f":"VLOOKUP(D14,ناجح!A20:P109,3,0)","v":"10 - 1"},{"$f":"VLOOKUP(D14,ناجح!A20:P109,13,0)","v":228},{"$f":"VLOOKUP(D14,ناجح!A20:P109,15,0)","v":0.84444444444444444}]
[null,null,null,11,{"$f":"VLOOKUP(D15,ناجح!A21:P110,2,0)","v":"عبدالرحمن خالد محمد سليمان الشيخ"},{"$f":"VLOOKUP(D15,ناجح!A21:P110,3,0)","v":"10 - 1"},{"$f":"VLOOKUP(D15,ناجح!A21:P110,13,0)","v":249},{"$f":"VLOOKUP(D15,ناجح!A21:P110,15,0)","v":0.92222222222222228}]
[null,null,null,12,{"$f":"VLOOKUP(D16,ناجح!A22:P111,2,0)","v":"عبدالرحمن قارى محمد اقبال"},{"$f":"VLOOKUP(D16,ناجح!A22:P111,3,0)","v":"10 - 1"},{"$f":"VLOOKUP(D16,ناجح!A22:P111,13,0)","v":238},{"$f":"VLOOKUP(D16,ناجح!A22:P111,15,0)","v":0.88148148148148153}]
[null,null,null,13,{"$f":"VLOOKUP(D17,ناجح!A23:P112,2,0)","v":"عدنان محمد رضا كرار سليمان"},{"$f":"VLOOKUP(D17,ناجح!A23:P112,3,0)","v":"10 - 1"},{"$f":"VLOOKUP(D17,ناجح!A23:P112,13,0)","v":228.5},{"$f":"VLOOKUP(D17,ناجح!A23:P112,15,0)","v":0.84629629629629632}]
[null,null,null,14,{"$f":"VLOOKUP(D18,ناجح!A24:P113,2,0)","v":"على هصام حامد على الحبابى"},{"$f":"VLOOKUP(D18,ناجح!A24:P113,3,0)","v":"10 - 1"},{"$f":"VLOOKUP(D18,ناجح!A24:P113,13,0)","v":211},{"$f":"VLOOKUP(D18,ناجح!A24:P113,15,0)","v":0.78148148148148133}]
[null,null,null,15,{"$f":"VLOOKUP(D19,ناجح!A25:P114,2,0)","v":"عمر فؤاد اسماعيل ثابت"},{"$f":"VLOOKUP(D19,ناجح!A25:P114,3,0)","v":"10 - 1"},{"$f":"VLOOKUP(D19,ناجح!A25:P114,13,0)","v":232.5},{"$f":"VLOOKUP(D19,ناجح!A25:P114,15,0)","v":0.86111111111111116}]
[null,null,null,16,{"$f":"VLOOKUP(D20,ناجح!A26:P115,2,0)","v":"عمر مصطفى محمد عوه"},{"$f":"VLOOKUP(D20,ناجح!A26:P115,3,0)","v":"10 - 1"},{"$f":"VLOOKUP(D20,ناجح!A26:P115,13,0)","v":242.5},{"$f":"VLOOKUP(D20,ناجح!A26:P115,15,0)","v":0.89814814814814814}]
[null,null,null,17,{"$f":"VLOOKUP(D21,ناجح!A27:P116,2,0)","v":"عمر هشام على بحيرى ابوالخير"},{"$f":"VLOOKUP(D21,ناجح!A27:P116,3,0)","v":"10 - 1"},{"$f":"VLOOKUP(D21,ناجح!A27:P116,13,0)","v":259.5},{"$f":"VLOOKUP(D21,ناجح!A27:P116,15,0)","v":0.96111111111111114}]
[null,null,null,18,{"$f":"VLOOKUP(D22,ناجح!A28:P117,2,0)","v":"فادي عدنان احمد عبدالجليل"},{"$f":"VLOOKUP(D22,ناجح!A28:P117,3,0)","v":"10 - 1"},{"$f":"VLOOKUP(D22,ناجح!A28:P117,13,0)","v":255},{"$f":"VLOOKUP(D22,ناجح!A28:P117,15,0)","v":0.94444444444444442}]
[null,null,null,19,{"$f":"VLOOKUP(D23,ناجح!A29:P118,2,0)","v":"مازن محمود السيد عبدالله عبدالوهاب"},{"$f":"VLOOKUP(D23,ناجح!A29:P118,3,0)","v":"10 - 1"},{"$f":"VLOOKUP(D23,ناجح!A29:P118,13,0)","v":235.5},{"$f":"VLOOKUP(D23,ناجح!A29:P118,15,0)","v":0.87222222222222223}]
[null,null,null,20,{"$f":"VLOOKUP(D24,ناجح!A30:P119,2,0)","v":"محمد احمد محمود شناق"},{"$f":"VLOOKUP(D24,ناجح!A30:P119,3,0)","v":"10 - 1"},{"$f":"VLOOKUP(D24,ناجح!A30:P119,13,0)","v":246},{"$f":"VLOOKUP(D24,ناجح!A30:P119,15,0)","v":0.91111111111111109}]
[null,null,null,21,{"$f":"VLOOKUP(D25,ناجح!A31:P120,2,0)","v":"محمد عبدالله السيد بيومي حسن"},{"$f":"VLOOKUP(D25,ناجح!A31:P120,3,0)","v":"10 - 1"},{"$f":"VLOOKUP(D25,ناجح!A31:P120,13,0)","v":256},{"$f":"VLOOKUP(D25,ناجح!A31:P120,15,0)","v":0.94814814814814818}]
[null,null,null,22,{"$f":"VLOOKUP(D26,ناجح!A32:P121,2,0)","v":"محمد عقيل عدنان سيد احمد"},{"$f":"VLOOKUP(D26,ناجح!A32:P121,3,0)","v":"10 - 1"},{"$f":"VLOOKUP(D26,ناجح!A32:P121,13,0)","v":241},{"$f":"VLOOKUP(D26,ناجح!A32:P121,15,0)","v":0.89259259259259272}]
[null,null,null,23,{"$f":"VLOOKUP(D27,ناجح!A33:P122,2,0)","v":"محمد علي عطيت الله ابراهيم عبداللاه"},{"$f":"VLOOKUP(D27,ناجح!A33:P122,3,0)","v":"10 - 1"},{"$f":"VLOOKUP(D27,ناجح!A33:P122,13,0)","v":232},{"$f":"VLOOKUP(D27,ناجح!A33:P122,15,0)","v":0.85925925925925928}]
[null,null,null,24,{"$f":"VLOOKUP(D28,ناجح!A34:P123,2,0)","v":"محمد عمر عبدالرحيم على"},{"$f":"VLOOKUP(D28,ناجح!A34:P123,3,0)","v":"10 - 1"},{"$f":"VLOOKUP(D28,ناجح!A34:P123,13,0)","v":257.5},{"$f":"VLOOKUP(D28,ناجح!A34:P123,15,0)","v":0.95370370370370372}]
[null,null,null,25,{"$f":"VLOOKUP(D29,ناجح!A35:P124,2,0)","v":"محمد عمر فتحى عبدالتواب عبدالمقصود"},{"$f":"VLOOKUP(D29,ناجح!A35:P124,3,0)","v":"10 - 1"},{"$f":"VLOOKUP(D29,ناجح!A35:P124,13,0)","v":257.5},{"$f":"VLOOKUP(D29,ناجح!A35:P124,15,0)","v":0.95370370370370372}]
[null,null,null,26,{"$f":"VLOOKUP(D30,ناجح!A36:P125,2,0)","v":"محمود حبيب الله"},{"$f":"VLOOKUP(D30,ناجح!A36:P125,3,0)","v":"10 - 1"},{"$f":"VLOOKUP(D30,ناجح!A36:P125,13,0)","v":253},{"$f":"VLOOKUP(D30,ناجح!A36:P125,15,0)","v":0.937037037037037}]
[null,null,null,27,{"$f":"VLOOKUP(D31,ناجح!A37:P126,2,0)","v":"محمود عادل عبدالمحسن محمد"},{"$f":"VLOOKUP(D31,ناجح!A37:P126,3,0)","v":"10 - 1"},{"$f":"VLOOKUP(D31,ناجح!A37:P126,13,0)","v":260},{"$f":"VLOOKUP(D31,ناجح!A37:P126,15,0)","v":0.96296296296296291}]
[null,null,null,28,{"$f":"VLOOKUP(D32,ناجح!A38:P127,2,0)","v":"يوسف محمد سليمان موسى عامر"},{"$f":"VLOOKUP(D32,ناجح!A38:P127,3,0)","v":"10 - 1"},{"$f":"VLOOKUP(D32,ناجح!A38:P127,13,0)","v":249.5},{"$f":"VLOOKUP(D32,ناجح!A38:P127,15,0)","v":0.92407407407407405}]
[null,null,null,29,{"$f":"VLOOKUP(D33,ناجح!A39:P128,2,0)","v":"احمد اسامه جميل ابوالعلا"},{"$f":"VLOOKUP(D33,ناجح!A39:P128,3,0)","v":"10 - 2"},{"$f":"VLOOKUP(D33,ناجح!A39:P128,13,0)","v":234.5},{"$f":"VLOOKUP(D33,ناجح!A39:P128,15,0)","v":0.86851851851851847}]
[null,null,null,30,{"$f":"VLOOKUP(D34,ناجح!A40:P129,2,0)","v":"أحمد اقبال ابواصبع"},{"$f":"VLOOKUP(D34,ناجح!A40:P129,3,0)","v":"10 - 2"},{"$f":"VLOOKUP(D34,ناجح!A40:P129,13,0)","v":258.5},{"$f":"VLOOKUP(D34,ناجح!A40:P129,15,0)","v":0.95740740740740737}]
[null,null,null,31,{"$f":"VLOOKUP(D35,ناجح!A41:P130,2,0)","v":"احمد شريف ابراهيم الدسوقى عوض"},{"$f":"VLOOKUP(D35,ناجح!A41:P130,3,0)","v":"10 - 2"},{"$f":"VLOOKUP(D35,ناجح!A41:P130,13,0)","v":224.5},{"$f":"VLOOKUP(D35,ناجح!A41:P130,15,0)","v":0.83148148148148149}]
[null,null,null,32,{"$f":"VLOOKUP(D36,ناجح!A42:P131,2,0)","v":"امين بن المنذر بن عثمان"},{"$f":"VLOOKUP(D36,ناجح!A42:P131,3,0)","v":"10 - 2"},{"$f":"VLOOKUP(D36,ناجح!A42:P131,13,0)","v":175},{"$f":"VLOOKUP(D36,ناجح!A42:P131,15,0)","v":0.64814814814814814}]
[null,null,null,{"$f":"ROW()-4","v":33},{"$f":"VLOOKUP(D37,ناجح!A43:P132,2,0)","v":"براء اشرف سعيد زكي السيد"},{"$f":"VLOOKUP(D37,ناجح!A43:P132,3,0)","v":"10 - 2"},{"$f":"VLOOKUP(D37,ناجح!A43:P132,13,0)","v":210},{"$f":"VLOOKUP(D37,ناجح!A43:P132,15,0)","v":0.7777777777777779}]
[null,null,null,34,{"$f":"VLOOKUP(D38,ناجح!A44:P133,2,0)","v":"جوين عماد عبدالحليم داود"},{"$f":"VLOOKUP(D38,ناجح!A44:P133,3,0)","v":"10 - 2"},{"$f":"VLOOKUP(D38,ناجح!A44:P133,13,0)","v":192.5},{"$f":"VLOOKUP(D38,ناجح!A44:P133,15,0)","v":0.71296296296296291}]
[null,null,null,35,{"$f":"VLOOKUP(D39,ناجح!A45:P134,2,0)","v":"حمد ناجى مسعد احمد الطيرى"},{"$f":"VLOOKUP(D39,ناجح!A45:P134,3,0)","v":"10 - 2"},{"$f":"VLOOKUP(D39,ناجح!A45:P134,13,0)","v":219.5},{"$f":"VLOOKUP(D39,ناجح!A45:P134,15,0)","v":0.812962962962963}]
[null,null,null,36,{"$f":"VLOOKUP(D40,ناجح!A46:P135,2,0)","v":"راشد حمد على البكرى اليافعى"},{"$f":"VLOOKUP(D40,ناجح!A46:P135,3,0)","v":"10 - 2"},{"$f":"VLOOKUP(D40,ناجح!A46:P135,13,0)","v":194},{"$f":"VLOOKUP(D40,ناجح!A46:P135,15,0)","v":0.71851851851851867}]
[null,null,null,37,{"$f":"VLOOKUP(D41,ناجح!A47:P136,2,0)","v":"رامي سعد فراج فرج علي"},{"$f":"VLOOKUP(D41,ناجح!A47:P136,3,0)","v":"10 - 2"},{"$f":"VLOOKUP(D41,ناجح!A47:P136,13,0)","v":221},{"$f":"VLOOKUP(D41,ناجح!A47:P136,15,0)","v":0.81851851851851842}]
[null,null,null,38,{"$f":"VLOOKUP(D42,ناجح!A48:P137,2,0)","v":"زكي واءلئ شحده عطيه ابوعيده"},{"$f":"VLOOKUP(D42,ناجح!A48:P137,3,0)","v":"10 - 2"},{"$f":"VLOOKUP(D42,ناجح!A48:P137,13,0)","v":211},{"$f":"VLOOKUP(D42,ناجح!A48:P137,15,0)","v":0.78148148148148133}]
[null,null,null,39,{"$f":"VLOOKUP(D43,ناجح!A49:P138,2,0)","v":"سلمان محمد اسلام ناصر احمد"},{"$f":"VLOOKUP(D43,ناجح!A49:P138,3,0)","v":"10 - 2"},{"$f":"VLOOKUP(D43,ناجح!A49:P138,13,0)","v":183},{"$f":"VLOOKUP(D43,ناجح!A49:P138,15,0)","v":0.67777777777777781}]
[null,null,null,40,{"$f":"VLOOKUP(D44,ناجح!A50:P139,2,0)","v":"عبدالرحمن محمد محسن البكري"},{"$f":"VLOOKUP(D44,ناجح!A50:P139,3,0)","v":"10 - 2"},{"$f":"VLOOKUP(D44,ناجح!A50:P139,13,0)","v":196.5},{"$f":"VLOOKUP(D44,ناجح!A50:P139,15,0)","v":0.72777777777777775}]
[null,null,null,41,{"$f":"VLOOKUP(D45,ناجح!A51:P140,2,0)","v":"عبدالرحمن هيثم اديب ابودلو"},{"$f":"VLOOKUP(D45,ناجح!A51:P140,3,0)","v":"10 - 2"},{"$f":"VLOOKUP(D45,ناجح!A51:P140,13,0)","v":225},{"$f":"VLOOKUP(D45,ناجح!A51:P140,15,0)","v":0.83333333333333348}]
[null,null,null,42,{"$f":"VLOOKUP(D46,ناجح!A52:P141,2,0)","v":"على عبدالحافظ على منصر منيف"},{"$f":"VLOOKUP(D46,ناجح!A52:P141,3,0)","v":"10 - 2"},{"$f":"VLOOKUP(D46,ناجح!A52:P141,13,0)","v":214.5},{"$f":"VLOOKUP(D46,ناجح!A52:P141,15,0)","v":0.7944444444444444}]
[null,null,null,43,{"$f":"VLOOKUP(D47,ناجح!A53:P142,2,0)","v":"فيصل محمد راشد جخدب الهميمى"},{"$f":"VLOOKUP(D47,ناجح!A53:P142,3,0)","v":"10 - 2"},{"$f":"VLOOKUP(D47,ناجح!A53:P142,13,0)","v":232},{"$f":"VLOOKUP(D47,ناجح!A53:P142,15,0)","v":0.85925925925925928}]
[null,null,null,44,{"$f":"VLOOKUP(D48,ناجح!A54:P143,2,0)","v":"قيس محمد داود ابراهيم ابوديه"},{"$f":"VLOOKUP(D48,ناجح!A54:P143,3,0)","v":"10 - 2"},{"$f":"VLOOKUP(D48,ناجح!A54:P143,13,0)","v":252},{"$f":"VLOOKUP(D48,ناجح!A54:P143,15,0)","v":0.93333333333333324}]
[null,null,null,45,{"$f":"VLOOKUP(D49,ناجح!A55:P144,2,0)","v":"لؤي ايهاب محمد احمد محمد"},{"$f":"VLOOKUP(D49,ناجح!A55:P144,3,0)","v":"10 - 2"},{"$f":"VLOOKUP(D49,ناجح!A55:P144,13,0)","v":221},{"$f":"VLOOKUP(D49,ناجح!A55:P144,15,0)","v":0.81851851851851842}]
[null,null,null,46,{"$f":"VLOOKUP(D50,ناجح!A56:P145,2,0)","v":"محمد على راشد محمد انديله"},{"$f":"VLOOKUP(D50,ناجح!A56:P145,3,0)","v":"10 - 2"},{"$f":"VLOOKUP(D50,ناجح!A56:P145,13,0)","v":204},{"$f":"VLOOKUP(D50,ناجح!A56:P145,15,0)","v":0.75555555555555554}]
[null,null,null,47,{"$f":"VLOOKUP(D51,ناجح!A57:P146,2,0)","v":"محمدخير حسين رغفان"},{"$f":"VLOOKUP(D51,ناجح!A57:P146,3,0)","v":"10 - 2"},{"$f":"VLOOKUP(D51,ناجح!A57:P146,13,0)","v":223.5},{"$f":"VLOOKUP(D51,ناجح!A57:P146,15,0)","v":0.82777777777777772}]
[null,null,null,48,{"$f":"VLOOKUP(D52,ناجح!A58:P147,2,0)","v":"وليد الامين عثمان"},{"$f":"VLOOKUP(D52,ناجح!A58:P147,3,0)","v":"10 - 2"},{"$f":"VLOOKUP(D52,ناجح!A58:P147,13,0)","v":208.5},{"$f":"VLOOKUP(D52,ناجح!A58:P147,15,0)","v":0.77222222222222225}]
[null,null,null,49,{"$f":"VLOOKUP(D53,ناجح!A59:P148,2,0)","v":"يزيد سامح حسنى محيسن"},{"$f":"VLOOKUP(D53,ناجح!A59:P148,3,0)","v":"10 - 2"},{"$f":"VLOOKUP(D53,ناجح!A59:P148,13,0)","v":250.5},{"$f":"VLOOKUP(D53,ناجح!A59:P148,15,0)","v":0.92777777777777781}]
[null,null,null,50,{"$f":"VLOOKUP(D54,ناجح!A60:P149,2,0)","v":"يوسف محمد عطيه عطيه حسن"},{"$f":"VLOOKUP(D54,ناجح!A60:P149,3,0)","v":"10 - 2"},{"$f":"VLOOKUP(D54,ناجح!A60:P149,13,0)","v":249},{"$f":"VLOOKUP(D54,ناجح!A60:P149,15,0)","v":0.92222222222222228}]
[null,null,null,51,{"$f":"VLOOKUP(D55,ناجح!A61:P150,2,0)","v":"أحمد يوسف خالد يوسف شراب"},{"$f":"VLOOKUP(D55,ناجح!A61:P150,3,0)","v":"10 - 4"},{"$f":"VLOOKUP(D55,ناجح!A61:P150,13,0)","v":164},{"$f":"VLOOKUP(D55,ناجح!A61:P150,15,0)","v":0.6074074074074074}]
[null,null,null,52,{"$f":"VLOOKUP(D56,ناجح!A62:P151,2,0)","v":"جاسم ناصر جاسم محمد المفتاح"},{"$f":"VLOOKUP(D56,ناجح!A62:P151,3,0)","v":"10 - 4"},{"$f":"VLOOKUP(D56,ناجح!A62:P151,13,0)","v":191},{"$f":"VLOOKUP(D56,ناجح!A62:P151,15,0)","v":0.70740740740740737}]
[null,null,null,53,{"$f":"VLOOKUP(D57,ناجح!A63:P152,2,0)","v":"عبدالله ضيف الله برمان الدوسري"},{"$f":"VLOOKUP(D57,ناجح!A63:P152,3,0)","v":"10 - 4"},{"$f":"VLOOKUP(D57,ناجح!A63:P152,13,0)","v":219.5},{"$f":"VLOOKUP(D57,ناجح!A63:P152,15,0)","v":0.812962962962963}]
[null,null,null,54,{"$f":"VLOOKUP(D58,ناجح!A64:P153,2,0)","v":"عدي فريد احمد حسين"},{"$f":"VLOOKUP(D58,ناجح!A64:P153,3,0)","v":"10 - 4"},{"$f":"VLOOKUP(D58,ناجح!A64:P153,13,0)","v":200},{"$f":"VLOOKUP(D58,ناجح!A64:P153,15,0)","v":0.74074074074074081}]
[null,null,null,55,{"$f":"VLOOKUP(D59,ناجح!A65:P154,2,0)","v":"عزيز خالد سالم ابو شنار"},{"$f":"VLOOKUP(D59,ناجح!A65:P154,3,0)","v":"10 - 4"},{"$f":"VLOOKUP(D59,ناجح!A65:P154,13,0)","v":201},{"$f":"VLOOKUP(D59,ناجح!A65:P154,15,0)","v":0.74444444444444446}]
[null,null,null,56,{"$f":"VLOOKUP(D60,ناجح!A66:P155,2,0)","v":"عمر محمد محمود ابوزاهر"},{"$f":"VLOOKUP(D60,ناجح!A66:P155,3,0)","v":"10 - 4"},{"$f":"VLOOKUP(D60,ناجح!A66:P155,13,0)","v":254.5},{"$f":"VLOOKUP(D60,ناجح!A66:P155,15,0)","v":0.94259259259259254}]
[null,null,null,57,{"$f":"VLOOKUP(D61,ناجح!A67:P156,2,0)","v":"محمد عبدالعزيز عبدالكريم يحى يعقوب"},{"$f":"VLOOKUP(D61,ناجح!A67:P156,3,0)","v":"10 - 4"},{"$f":"VLOOKUP(D61,ناجح!A67:P156,13,0)","v":209},{"$f":"VLOOKUP(D61,ناجح!A67:P156,15,0)","v":0.77407407407407403}]
[null,null,null,58,{"$f":"VLOOKUP(D62,ناجح!A68:P157,2,0)","v":"محمد عبدالله بخيت محمد المهيري"},{"$f":"VLOOKUP(D62,ناجح!A68:P157,3,0)","v":"10 - 4"},{"$f":"VLOOKUP(D62,ناجح!A68:P157,13,0)","v":210},{"$f":"VLOOKUP(D62,ناجح!A68:P157,15,0)","v":0.7777777777777779}]
[null,null,null,59,{"$f":"VLOOKUP(D63,ناجح!A69:P158,2,0)","v":"محمد هشام حامد على ابوخطيطه"},{"$f":"VLOOKUP(D63,ناجح!A69:P158,3,0)","v":"10 - 4"},{"$f":"VLOOKUP(D63,ناجح!A69:P158,13,0)","v":250},{"$f":"VLOOKUP(D63,ناجح!A69:P158,15,0)","v":0.92592592592592593}]
[null,null,null,60,{"$f":"VLOOKUP(D64,ناجح!A70:P159,2,0)","v":"حسن محمود ابراهيم علي البنا"},{"$f":"VLOOKUP(D64,ناجح!A70:P159,3,0)","v":"10 - 5"},{"$f":"VLOOKUP(D64,ناجح!A70:P159,13,0)","v":247},{"$f":"VLOOKUP(D64,ناجح!A70:P159,15,0)","v":0.91481481481481486}]
[null,null,null,61,{"$f":"VLOOKUP(D65,ناجح!A71:P160,2,0)","v":"زياد مصطفى كامل محمد ابوالبها"},{"$f":"VLOOKUP(D65,ناجح!A71:P160,3,0)","v":"10 - 5"},{"$f":"VLOOKUP(D65,ناجح!A71:P160,13,0)","v":217},{"$f":"VLOOKUP(D65,ناجح!A71:P160,15,0)","v":0.8037037037037037}]
[null,null,null,62,{"$f":"VLOOKUP(D66,ناجح!A72:P161,2,0)","v":"سعيد محمد سالم عمار خوار"},{"$f":"VLOOKUP(D66,ناجح!A72:P161,3,0)","v":"10 - 5"},{"$f":"VLOOKUP(D66,ناجح!A72:P161,13,0)","v":207},{"$f":"VLOOKUP(D66,ناجح!A72:P161,15,0)","v":0.76666666666666672}]
[null,null,null,63,{"$f":"VLOOKUP(D67,ناجح!A73:P162,2,0)","v":"عبدالله فهد عبدالله عبدالعزيز الرميحى"},{"$f":"VLOOKUP(D67,ناجح!A73:P162,3,0)","v":"10 - 5"},{"$f":"VLOOKUP(D67,ناجح!A73:P162,13,0)","v":203},{"$f":"VLOOKUP(D67,ناجح!A73:P162,15,0)","v":0.75185185185185188}]
[null,null,null,64,{"$f":"VLOOKUP(D68,ناجح!A74:P163,2,0)","v":"عبدالله فؤاد حازم شريف"},{"$f":"VLOOKUP(D68,ناجح!A74:P163,3,0)","v":"10 - 5"},{"$f":"VLOOKUP(D68,ناجح!A74:P163,13,0)","v":208.5},{"$f":"VLOOKUP(D68,ناجح!A74:P163,15,0)","v":0.77222222222222225}]
[null,null,null,{"$f":"ROW()-4","v":65},{"$f":"VLOOKUP(D69,ناجح!A75:P164,2,0)","v":"محمد جابر محمد الصعاق المرى"},{"$f":"VLOOKUP(D69,ناجح!A75:P164,3,0)","v":"10 - 5"},{"$f":"VLOOKUP(D69,ناجح!A75:P164,13,0)","v":167.5},{"$f":"VLOOKUP(D69,ناجح!A75:P164,15,0)","v":0.62037037037037035}]
[null,null,null,66,{"$f":"VLOOKUP(D70,ناجح!A76:P165,2,0)","v":"مصطفى اسامه محمد زهدي سيد"},{"$f":"VLOOKUP(D70,ناجح!A76:P165,3,0)","v":"10 - 5"},{"$f":"VLOOKUP(D70,ناجح!A76:P165,13,0)","v":212},{"$f":"VLOOKUP(D70,ناجح!A76:P165,15,0)","v":0.78518518518518521}]
[null,null,null,67,{"$f":"VLOOKUP(D71,ناجح!A77:P166,2,0)","v":"مهند عمر سمير كلباني"},{"$f":"VLOOKUP(D71,ناجح!A77:P166,3,0)","v":"10 - 5"},{"$f":"VLOOKUP(D71,ناجح!A77:P166,13,0)","v":201.5},{"$f":"VLOOKUP(D71,ناجح!A77:P166,15,0)","v":0.74629629629629635}]
[null,null,null,68,{"$f":"VLOOKUP(D72,ناجح!A78:P167,2,0)","v":"شفيع فهد على شفيع الفهيده"},{"$f":"VLOOKUP(D72,ناجح!A78:P167,3,0)","v":"10 - 6"},{"$f":"VLOOKUP(D72,ناجح!A78:P167,13,0)","v":234.5},{"$f":"VLOOKUP(D72,ناجح!A78:P167,15,0)","v":0.86851851851851847}]
[null,null,null,69,{"$f":"VLOOKUP(D73,ناجح!A79:P168,2,0)","v":"عبدالرحمن مرتضى عبدالعال ساتى الحسن"},{"$f":"VLOOKUP(D73,ناجح!A79:P168,3,0)","v":"10 - 6"},{"$f":"VLOOKUP(D73,ناجح!A79:P168,13,0)","v":204},{"$f":"VLOOKUP(D73,ناجح!A79:P168,15,0)","v":0.75555555555555554}]
[null,null,null,70,{"$f":"VLOOKUP(D74,ناجح!A80:P169,2,0)","v":"عبدالقادر انس العمر"},{"$f":"VLOOKUP(D74,ناجح!A80:P169,3,0)","v":"10 - 6"},{"$f":"VLOOKUP(D74,ناجح!A80:P169,13,0)","v":246.5},{"$f":"VLOOKUP(D74,ناجح!A80:P169,15,0)","v":0.91296296296296309}]
[null,null,null,71,{"$f":"VLOOKUP(D75,ناجح!A81:P170,2,0)","v":"عبدالله حمد سالم العيسائى اليافعى"},{"$f":"VLOOKUP(D75,ناجح!A81:P170,3,0)","v":"10 - 6"},{"$f":"VLOOKUP(D75,ناجح!A81:P170,13,0)","v":206},{"$f":"VLOOKUP(D75,ناجح!A81:P170,15,0)","v":0.76296296296296295}]
[null,null,null,72,{"$f":"VLOOKUP(D76,ناجح!A82:P171,2,0)","v":"عبدالله على عبدالمحسن راشد الهميمى"},{"$f":"VLOOKUP(D76,ناجح!A82:P171,3,0)","v":"10 - 6"},{"$f":"VLOOKUP(D76,ناجح!A82:P171,13,0)","v":216.5},{"$f":"VLOOKUP(D76,ناجح!A82:P171,15,0)","v":0.80185185185185182}]
[null,null,null,73,{"$f":"VLOOKUP(D77,ناجح!A83:P172,2,0)","v":"على احمد عبدالله احمد العبدالله"},{"$f":"VLOOKUP(D77,ناجح!A83:P172,3,0)","v":"10 - 6"},{"$f":"VLOOKUP(D77,ناجح!A83:P172,13,0)","v":180.5},{"$f":"VLOOKUP(D77,ناجح!A83:P172,15,0)","v":0.66851851851851851}]
[null,null,null,74,{"$f":"VLOOKUP(D78,ناجح!A84:P173,2,0)","v":"محمد الفاضل يوسف محمد"},{"$f":"VLOOKUP(D78,ناجح!A84:P173,3,0)","v":"10 - 6"},{"$f":"VLOOKUP(D78,ناجح!A84:P173,13,0)","v":190.5},{"$f":"VLOOKUP(D78,ناجح!A84:P173,15,0)","v":0.7055555555555556}]
[null,null,null,75,{"$f":"VLOOKUP(D79,ناجح!A85:P174,2,0)","v":"محمد حمد حسين بن عباس الخزاعى"},{"$f":"VLOOKUP(D79,ناجح!A85:P174,3,0)","v":"10 - 6"},{"$f":"VLOOKUP(D79,ناجح!A85:P174,13,0)","v":207.5},{"$f":"VLOOKUP(D79,ناجح!A85:P174,15,0)","v":0.76851851851851849}]
[null,null,null,76,{"$f":"VLOOKUP(D80,ناجح!A86:P175,2,0)","v":"محمد محمود صلاح الدين محمود محمد"},{"$f":"VLOOKUP(D80,ناجح!A86:P175,3,0)","v":"10 - 6"},{"$f":"VLOOKUP(D80,ناجح!A86:P175,13,0)","v":200.5},{"$f":"VLOOKUP(D80,ناجح!A86:P175,15,0)","v":0.74259259259259247}]
[null,null,null,77,{"$f":"VLOOKUP(D81,ناجح!A87:P176,2,0)","v":"محمد وليد سيد حسن عبدالمجيد"},{"$f":"VLOOKUP(D81,ناجح!A87:P176,3,0)","v":"10 - 6"},{"$f":"VLOOKUP(D81,ناجح!A87:P176,13,0)","v":250},{"$f":"VLOOKUP(D81,ناجح!A87:P176,15,0)","v":0.92592592592592593}]
[null,null,null,78,{"$f":"VLOOKUP(D82,ناجح!A88:P177,2,0)","v":"محمدنذير محمداياد الحريري"},{"$f":"VLOOKUP(D82,ناجح!A88:P177,3,0)","v":"10 - 6"},{"$f":"VLOOKUP(D82,ناجح!A88:P177,13,0)","v":225.5},{"$f":"VLOOKUP(D82,ناجح!A88:P177,15,0)","v":0.83518518518518514}]
[null,null,null,79,{"$f":"VLOOKUP(D83,ناجح!A89:P178,2,0)","v":"يوسف عادل احمد محمد مدني"},{"$f":"VLOOKUP(D83,ناجح!A89:P178,3,0)","v":"10 - 6"},{"$f":"VLOOKUP(D83,ناجح!A89:P178,13,0)","v":202.5},{"$f":"VLOOKUP(D83,ناجح!A89:P178,15,0)","v":0.75}]
[null,null,null,80,{"$f":"VLOOKUP(D84,ناجح!A90:P179,2,0)","v":"السيدهاشم جعفر علي شبر الوداعي"},{"$f":"VLOOKUP(D84,ناجح!A90:P179,3,0)","v":"10 - 7"},{"$f":"VLOOKUP(D84,ناجح!A90:P179,13,0)","v":204.5},{"$f":"VLOOKUP(D84,ناجح!A90:P179,15,0)","v":0.75740740740740753}]
[null,null,null,81,{"$f":"VLOOKUP(D85,ناجح!A91:P180,2,0)","v":"جوعان حمد محمد على بن نوره"},{"$f":"VLOOKUP(D85,ناجح!A91:P180,3,0)","v":"10 - 7"},{"$f":"VLOOKUP(D85,ناجح!A91:P180,13,0)","v":230.5},{"$f":"VLOOKUP(D85,ناجح!A91:P180,15,0)","v":0.85370370370370385}]
[null,null,null,82,{"$f":"VLOOKUP(D86,ناجح!A92:P181,2,0)","v":"على سالم محمد ابوعرقوه المرى"},{"$f":"VLOOKUP(D86,ناجح!A92:P181,3,0)","v":"10 - 7"},{"$f":"VLOOKUP(D86,ناجح!A92:P181,13,0)","v":215},{"$f":"VLOOKUP(D86,ناجح!A92:P181,15,0)","v":0.79629629629629628}]
[null,null,null,83,{"$f":"VLOOKUP(D87,ناجح!A93:P182,2,0)","v":"مجتبى كامل عبدالله محمد"},{"$f":"VLOOKUP(D87,ناجح!A93:P182,3,0)","v":"10 - 7"},{"$f":"VLOOKUP(D87,ناجح!A93:P182,13,0)","v":182},{"$f":"VLOOKUP(D87,ناجح!A93:P182,15,0)","v":0.67407407407407405}]
[null,null,null,84,{"$f":"VLOOKUP(D88,ناجح!A94:P183,2,0)","v":"محمد راشد عبدالمحسن راشد الهميمى"},{"$f":"VLOOKUP(D88,ناجح!A94:P183,3,0)","v":"10 - 7"},{"$f":"VLOOKUP(D88,ناجح!A94:P183,13,0)","v":258},{"$f":"VLOOKUP(D88,ناجح!A94:P183,15,0)","v":0.9555555555555556}]
[null,null,null,85,{"$f":"VLOOKUP(D89,ناجح!A95:P184,2,0)","v":"محمد سعيد سعد خالد مقبل"},{"$f":"VLOOKUP(D89,ناجح!A95:P184,3,0)","v":"10 - 7"},{"$f":"VLOOKUP(D89,ناجح!A95:P184,13,0)","v":212},{"$f":"VLOOKUP(D89,ناجح!A95:P184,15,0)","v":0.78518518518518521}]
[null,null,null,86,{"$f":"VLOOKUP(D90,ناجح!A96:P185,2,0)","v":"محمد واصف عارف حيدر"},{"$f":"VLOOKUP(D90,ناجح!A96:P185,3,0)","v":"10 - 7"},{"$f":"VLOOKUP(D90,ناجح!A96:P185,13,0)","v":240.5},{"$f":"VLOOKUP(D90,ناجح!A96:P185,15,0)","v":0.89074074074074072}]

{"sheet":"كشف مواد الدور الثاني","index":4,"n_rows":155,"n_cols":7,"rows_kept":155,"cut":false,"hidden":false,"merged":[[2,3,2,6]]}
[]
[]
[null,null,null,"كشف الطلاب الراسبين"]
[null,null,"م","رقم الجلوس","اسم الطالب","الصف","مواد الدور الثانى"]
[null,null,{"$f":"ROW()-4","v":1},{"$f":"VLOOKUP(C5,'دور ثانى'!$A$11:$R$170,1,0)","v":1},{"$f":"VLOOKUP(C5,'دور ثانى'!$A$11:$R$170,2,0)","v":"عبدالله فتحي سيد محمد جمعه"},{"$f":"VLOOKUP(C5,'دور ثانى'!$A$11:$R$170,3,0)","v":"10 - 1"},{"$f":"VLOOKUP(C5,'دور ثانى'!$A$11:$R$170,18,0)","v":"الرياضيات / "}]
[null,null,{"$f":"ROW()-4","v":2},{"$f":"VLOOKUP(C6,'دور ثانى'!$A$11:$R$170,1,0)","v":2},{"$f":"VLOOKUP(C6,'دور ثانى'!$A$11:$R$170,2,0)","v":"عمر عبدالباسط ابراهيم محمد"},{"$f":"VLOOKUP(C6,'دور ثانى'!$A$11:$R$170,3,0)","v":"10 - 1"},{"$f":"VLOOKUP(C6,'دور ثانى'!$A$11:$R$170,18,0)","v":"الأحياء / "}]
[null,null,3,{"$f":"VLOOKUP(C7,'دور ثانى'!$A$11:$R$170,1,0)","v":3},{"$f":"VLOOKUP(C7,'دور ثانى'!$A$11:$R$170,2,0)","v":"معتز احمد كامل على خوالده"},{"$f":"VLOOKUP(C7,'دور ثانى'!$A$11:$R$170,3,0)","v":"10 - 1"},{"$f":"VLOOKUP(C7,'دور ثانى'!$A$11:$R$170,18,0)","v":"الكيمياء / "}]
[null,null,4,{"$f":"VLOOKUP(C8,'دور ثانى'!$A$11:$R$170,1,0)","v":4},{"$f":"VLOOKUP(C8,'دور ثانى'!$A$11:$R$170,2,0)","v":"مهنا احمد محمد سيف النعيمى"},{"$f":"VLOOKUP(C8,'دور ثانى'!$A$11:$R$170,3,0)","v":"10 - 1"},{"$f":"VLOOKUP(C8,'دور ثانى'!$A$11:$R$170,18,0)","v":"الرياضيات / الدراسات الاجتماعية / الحوسبة وتكنولوجيا المعلومات / الكيمياء / الفيزياء / الأحياء / التربية الإسلامية / "}]
[null,null,5,{"$f":"VLOOKUP(C9,'دور ثانى'!$A$11:$R$170,1,0)","v":5},{"$f":"VLOOKUP(C9,'دور ثانى'!$A$11:$R$170,2,0)","v":"مؤمن شريف محمد التاج"},{"$f":"VLOOKUP(C9,'دور ثانى'!$A$11:$R$170,3,0)","v":"10 - 1"},{"$f":"VLOOKUP(C9,'دور ثانى'!$A$11:$R$170,18,0)","v":"الكيمياء / "}]
[null,null,6,{"$f":"VLOOKUP(C10,'دور ثانى'!$A$11:$R$170,1,0)","v":6},{"$f":"VLOOKUP(C10,'دور ثانى'!$A$11:$R$170,2,0)","v":"ياسين احمد صلاح عبداللطيف"},{"$f":"VLOOKUP(C10,'دور ثانى'!$A$11:$R$170,3,0)","v":"10 - 1"},{"$f":"VLOOKUP(C10,'دور ثانى'!$A$11:$R$170,18,0)","v":"الرياضيات / الدراسات الاجتماعية / الحوسبة وتكنولوجيا المعلومات / الكيمياء / الفيزياء / الأحياء / التربية الإسلامية / اللغة العربية / اللغة الإنجليزية / "}]
[null,null,7,{"$f":"VLOOKUP(C11,'دور ثانى'!$A$11:$R$170,1,0)","v":7},{"$f":"VLOOKUP(C11,'دور ثانى'!$A$11:$R$170,2,0)","v":"بريك سالم دغش الجربوعى المرى"},{"$f":"VLOOKUP(C11,'دور ثانى'!$A$11:$R$170,3,0)","v":"10 - 2"},{"$f":"VLOOKUP(C11,'دور ثانى'!$A$11:$R$170,18,0)","v":"الكيمياء / "}]
[null,null,8,{"$f":"VLOOKUP(C12,'دور ثانى'!$A$11:$R$170,1,0)","v":8},{"$f":"VLOOKUP(C12,'دور ثانى'!$A$11:$R$170,2,0)","v":"خالد طارق عبدالرحمن فوزي رامون"},{"$f":"VLOOKUP(C12,'دور ثانى'!$A$11:$R$170,3,0)","v":"10 - 2"},{"$f":"VLOOKUP(C12,'دور ثانى'!$A$11:$R$170,18,0)","v":"الرياضيات / الدراسات الاجتماعية / الحوسبة وتكنولوجيا المعلومات / الكيمياء / الفيزياء / الأحياء / التربية الإسلامية / اللغة العربية / اللغة الإنجليزية / "}]
[null,null,9,{"$f":"VLOOKUP(C13,'دور ثانى'!$A$11:$R$170,1,0)","v":9},{"$f":"VLOOKUP(C13,'دور ثانى'!$A$11:$R$170,2,0)","v":"خالد ناصر محمد ناصر الدهيمى"},{"$f":"VLOOKUP(C13,'دور ثانى'!$A$11:$R$170,3,0)","v":"10 - 2"},{"$f":"VLOOKUP(C13,'دور ثانى'!$A$11:$R$170,18,0)","v":"الرياضيات / "}]
[null,null,10,{"$f":"VLOOKUP(C14,'دور ثانى'!$A$11:$R$170,1,0)","v":10},{"$f":"VLOOKUP(C14,'دور ثانى'!$A$11:$R$170,2,0)","v":"زيد محمود احمد خشان"},{"$f":"VLOOKUP(C14,'دور ثانى'!$A$11:$R$170,3,0)","v":"10 - 2"},{"$f":"VLOOKUP(C14,'دور ثانى'!$A$11:$R$170,18,0)","v":"الأحياء / "}]
[null,null,11,{"$f":"VLOOKUP(C15,'دور ثانى'!$A$11:$R$170,1,0)","v":11},{"$f":"VLOOKUP(C15,'دور ثانى'!$A$11:$R$170,2,0)","v":"سالم محمد سالم البطى الكعبى"},{"$f":"VLOOKUP(C15,'دور ثانى'!$A$11:$R$170,3,0)","v":"10 - 2"},{"$f":"VLOOKUP(C15,'دور ثانى'!$A$11:$R$170,18,0)","v":"الرياضيات / اللغة الإنجليزية / "}]
[null,null,12,{"$f":"VLOOKUP(C16,'دور ثانى'!$A$11:$R$170,1,0)","v":12},{"$f":"VLOOKUP(C16,'دور ثانى'!$A$11:$R$170,2,0)","v":"سيف فهد موسى حسن على"},{"$f":"VLOOKUP(C16,'دور ثانى'!$A$11:$R$170,3,0)","v":"10 - 2"},{"$f":"VLOOKUP(C16,'دور ثانى'!$A$11:$R$170,18,0)","v":"الرياضيات / "}]
[null,null,13,{"$f":"VLOOKUP(C17,'دور ثانى'!$A$11:$R$170,1,0)","v":13},{"$f":"VLOOKUP(C17,'دور ثانى'!$A$11:$R$170,2,0)","v":"عبدالرحمن اشرف فتحى سالم نصار"},{"$f":"VLOOKUP(C17,'دور ثانى'!$A$11:$R$170,3,0)","v":"10 - 2"},{"$f":"VLOOKUP(C17,'دور ثانى'!$A$11:$R$170,18,0)","v":"الرياضيات / الدراسات الاجتماعية / الحوسبة وتكنولوجيا المعلومات / الكيمياء / الفيزياء / الأحياء / التربية الإسلامية / اللغة العربية / اللغة الإنجليزية / "}]
[null,null,14,{"$f":"VLOOKUP(C18,'دور ثانى'!$A$11:$R$170,1,0)","v":14},{"$f":"VLOOKUP(C18,'دور ثانى'!$A$11:$R$170,2,0)","v":"عبدالرحمن جمال على صالح سيد"},{"$f":"VLOOKUP(C18,'دور ثانى'!$A$11:$R$170,3,0)","v":"10 - 2"},{"$f":"VLOOKUP(C18,'دور ثانى'!$A$11:$R$170,18,0)","v":"الكيمياء / "}]
[null,null,15,{"$f":"VLOOKUP(C19,'دور ثانى'!$A$11:$R$170,1,0)","v":15},{"$f":"VLOOKUP(C19,'دور ثانى'!$A$11:$R$170,2,0)","v":"عبدالرحيم محمد رشيد الديرشوى"},{"$f":"VLOOKUP(C19,'دور ثانى'!$A$11:$R$170,3,0)","v":"10 - 2"},{"$f":"VLOOKUP(C19,'دور ثانى'!$A$11:$R$170,18,0)","v":"الرياضيات / "}]
[null,null,16,{"$f":"VLOOKUP(C20,'دور ثانى'!$A$11:$R$170,1,0)","v":16},{"$f":"VLOOKUP(C20,'دور ثانى'!$A$11:$R$170,2,0)","v":"عبدالعزيز عوض احمد محمد اليافعى"},{"$f":"VLOOKUP(C20,'دور ثانى'!$A$11:$R$170,3,0)","v":"10 - 2"},{"$f":"VLOOKUP(C20,'دور ثانى'!$A$11:$R$170,18,0)","v":"الكيمياء / الأحياء / "}]
[null,null,17,{"$f":"VLOOKUP(C21,'دور ثانى'!$A$11:$R$170,1,0)","v":17},{"$f":"VLOOKUP(C21,'دور ثانى'!$A$11:$R$170,2,0)","v":"على نائل محمد عبدالله الخالدى"},{"$f":"VLOOKUP(C21,'دور ثانى'!$A$11:$R$170,3,0)","v":"10 - 2"},{"$f":"VLOOKUP(C21,'دور ثانى'!$A$11:$R$170,18,0)","v":"الحوسبة وتكنولوجيا المعلومات / الكيمياء / الفيزياء / اللغة العربية / "}]
[null,null,18,{"$f":"VLOOKUP(C22,'دور ثانى'!$A$11:$R$170,1,0)","v":18},{"$f":"VLOOKUP(C22,'دور ثانى'!$A$11:$R$170,2,0)","v":"محمد محمود فاروق العبد"},{"$f":"VLOOKUP(C22,'دور ثانى'!$A$11:$R$170,3,0)","v":"10 - 2"},{"$f":"VLOOKUP(C22,'دور ثانى'!$A$11:$R$170,18,0)","v":"الكيمياء / "}]
[null,null,19,{"$f":"VLOOKUP(C23,'دور ثانى'!$A$11:$R$170,1,0)","v":19},{"$f":"VLOOKUP(C23,'دور ثانى'!$A$11:$R$170,2,0)","v":"احمد حافظ محمد ابوالكلام كبيرالدين"},{"$f":"VLOOKUP(C23,'دور ثانى'!$A$11:$R$170,3,0)","v":"10 - 3"},{"$f":"VLOOKUP(C23,'دور ثانى'!$A$11:$R$170,18,0)","v":"الرياضيات / الكيمياء / الأحياء / "}]
[null,null,20,{"$f":"VLOOKUP(C24,'دور ثانى'!$A$11:$R$170,1,0)","v":20},{"$f":"VLOOKUP(C24,'دور ثانى'!$A$11:$R$170,2,0)","v":"احمد محمد احمد قنبر بلال"},{"$f":"VLOOKUP(C24,'دور ثانى'!$A$11:$R$170,3,0)","v":"10 - 3"},{"$f":"VLOOKUP(C24,'دور ثانى'!$A$11:$R$170,18,0)","v":"الكيمياء / الأحياء / اللغة العربية / اللغة الإنجليزية / "}]
[null,null,21,{"$f":"VLOOKUP(C25,'دور ثانى'!$A$11:$R$170,1,0)","v":21},{"$f":"VLOOKUP(C25,'دور ثانى'!$A$11:$R$170,2,0)","v":"امان رشيد خان جول جنان"},{"$f":"VLOOKUP(C25,'دور ثانى'!$A$11:$R$170,3,0)","v":"10 - 3"},{"$f":"VLOOKUP(C25,'دور ثانى'!$A$11:$R$170,18,0)","v":"الرياضيات / الكيمياء / الفيزياء / الأحياء / التربية الإسلامية / اللغة العربية / "}]
[null,null,22,{"$f":"VLOOKUP(C26,'دور ثانى'!$A$11:$R$170,1,0)","v":22},{"$f":"VLOOKUP(C26,'دور ثانى'!$A$11:$R$170,2,0)","v":"ايسر جهاد عبدالفتاح كراز"},{"$f":"VLOOKUP(C26,'دور ثانى'!$A$11:$R$170,3,0)","v":"10 - 3"},{"$f":"VLOOKUP(C26,'دور ثانى'!$A$11:$R$170,18,0)","v":"الرياضيات / الفيزياء / الأحياء / اللغة الإنجليزية / "}]
[null,null,23,{"$f":"VLOOKUP(C27,'دور ثانى'!$A$11:$R$170,1,0)","v":23},{"$f":"VLOOKUP(C27,'دور ثانى'!$A$11:$R$170,2,0)","v":"بخيت مبخوت سالم سعيد خوار"},{"$f":"VLOOKUP(C27,'دور ثانى'!$A$11:$R$170,3,0)","v":"10 - 3"},{"$f":"VLOOKUP(C27,'دور ثانى'!$A$11:$R$170,18,0)","v":"الأحياء / التربية الإسلامية / اللغة الإنجليزية / "}]
[null,null,24,{"$f":"VLOOKUP(C28,'دور ثانى'!$A$11:$R$170,1,0)","v":24},{"$f":"VLOOKUP(C28,'دور ثانى'!$A$11:$R$170,2,0)","v":"تميم محمد ابراهيم محمد فلامرزى"},{"$f":"VLOOKUP(C28,'دور ثانى'!$A$11:$R$170,3,0)","v":"10 - 3"},{"$f":"VLOOKUP(C28,'دور ثانى'!$A$11:$R$170,18,0)","v":"الرياضيات / الدراسات الاجتماعية / الكيمياء / الأحياء / التربية الإسلامية / اللغة العربية / اللغة الإنجليزية / "}]
[null,null,25,{"$f":"VLOOKUP(C29,'دور ثانى'!$A$11:$R$170,1,0)","v":25},{"$f":"VLOOKUP(C29,'دور ثانى'!$A$11:$R$170,2,0)","v":"جابر سعد سالم النابت المرى"},{"$f":"VLOOKUP(C29,'دور ثانى'!$A$11:$R$170,3,0)","v":"10 - 3"},{"$f":"VLOOKUP(C29,'دور ثانى'!$A$11:$R$170,18,0)","v":"الرياضيات / الكيمياء / الأحياء / التربية الإسلامية / اللغة الإنجليزية / "}]
[null,null,26,{"$f":"VLOOKUP(C30,'دور ثانى'!$A$11:$R$170,1,0)","v":26},{"$f":"VLOOKUP(C30,'دور ثانى'!$A$11:$R$170,2,0)","v":"جاسم عبدالله خالد عبدالله الكثيرى"},{"$f":"VLOOKUP(C30,'دور ثانى'!$A$11:$R$170,3,0)","v":"10 - 3"},{"$f":"VLOOKUP(C30,'دور ثانى'!$A$11:$R$170,18,0)","v":"الكيمياء / الأحياء / اللغة الإنجليزية / "}]
[null,null,27,{"$f":"VLOOKUP(C31,'دور ثانى'!$A$11:$R$170,1,0)","v":27},{"$f":"VLOOKUP(C31,'دور ثانى'!$A$11:$R$170,2,0)","v":"حمد راشد حمد ال شابل المرى"},{"$f":"VLOOKUP(C31,'دور ثانى'!$A$11:$R$170,3,0)","v":"10 - 3"},{"$f":"VLOOKUP(C31,'دور ثانى'!$A$11:$R$170,18,0)","v":"الكيمياء / الأحياء / اللغة الإنجليزية / "}]
[null,null,28,{"$f":"VLOOKUP(C32,'دور ثانى'!$A$11:$R$170,1,0)","v":28},{"$f":"VLOOKUP(C32,'دور ثانى'!$A$11:$R$170,2,0)","v":"خالد حسين بلوج زنى"},{"$f":"VLOOKUP(C32,'دور ثانى'!$A$11:$R$170,3,0)","v":"10 - 3"},{"$f":"VLOOKUP(C32,'دور ثانى'!$A$11:$R$170,18,0)","v":"الرياضيات / الدراسات الاجتماعية / الكيمياء / الفيزياء / الأحياء / التربية الإسلامية / اللغة العربية / اللغة الإنجليزية / "}]
[null,null,29,{"$f":"VLOOKUP(C33,'دور ثانى'!$A$11:$R$170,1,0)","v":29},{"$f":"VLOOKUP(C33,'دور ثانى'!$A$11:$R$170,2,0)","v":"خلف فرحان عقيل الرويلى العنزى"},{"$f":"VLOOKUP(C33,'دور ثانى'!$A$11:$R$170,3,0)","v":"10 - 3"},{"$f":"VLOOKUP(C33,'دور ثانى'!$A$11:$R$170,18,0)","v":"الرياضيات / الدراسات الاجتماعية / الكيمياء / الفيزياء / الأحياء / التربية الإسلامية / اللغة العربية / اللغة الإنجليزية / "}]
[null,null,30,{"$f":"VLOOKUP(C34,'دور ثانى'!$A$11:$R$170,1,0)","v":30},{"$f":"VLOOKUP(C34,'دور ثانى'!$A$11:$R$170,2,0)","v":"راشد خالد على محمد النديله"},{"$f":"VLOOKUP(C34,'دور ثانى'!$A$11:$R$170,3,0)","v":"10 - 3"},{"$f":"VLOOKUP(C34,'دور ثانى'!$A$11:$R$170,18,0)","v":"الدراسات الاجتماعية / "}]
[null,null,31,{"$f":"VLOOKUP(C35,'دور ثانى'!$A$11:$R$170,1,0)","v":31},{"$f":"VLOOKUP(C35,'دور ثانى'!$A$11:$R$170,2,0)","v":"سالم سعد سالم النابت المرى"},{"$f":"VLOOKUP(C35,'دور ثانى'!$A$11:$R$170,3,0)","v":"10 - 3"},{"$f":"VLOOKUP(C35,'دور ثانى'!$A$11:$R$170,18,0)","v":"الرياضيات / الكيمياء / الأحياء / التربية الإسلامية / اللغة العربية / اللغة الإنجليزية / "}]
[null,null,32,{"$f":"VLOOKUP(C36,'دور ثانى'!$A$11:$R$170,1,0)","v":32},{"$f":"VLOOKUP(C36,'دور ثانى'!$A$11:$R$170,2,0)","v":"سالم على محمد سالم خوار"},{"$f":"VLOOKUP(C36,'دور ثانى'!$A$11:$R$170,3,0)","v":"10 - 3"},{"$f":"VLOOKUP(C36,'دور ثانى'!$A$11:$R$170,18,0)","v":"الرياضيات / الكيمياء / الأحياء / التربية الإسلامية / اللغة العربية / اللغة الإنجليزية / "}]
[null,null,33,{"$f":"VLOOKUP(C37,'دور ثانى'!$A$11:$R$170,1,0)","v":33},{"$f":"VLOOKUP(C37,'دور ثانى'!$A$11:$R$170,2,0)","v":"سعيد حسين ناصر ال شافعه المرى"},{"$f":"VLOOKUP(C37,'دور ثانى'!$A$11:$R$170,3,0)","v":"10 - 3"},{"$f":"VLOOKUP(C37,'دور ثانى'!$A$11:$R$170,18,0)","v":"الدراسات الاجتماعية / الكيمياء / الأحياء / "}]
[null,null,34,{"$f":"VLOOKUP(C38,'دور ثانى'!$A$11:$R$170,1,0)","v":34},{"$f":"VLOOKUP(C38,'دور ثانى'!$A$11:$R$170,2,0)","v":"شاهين علي"},{"$f":"VLOOKUP(C38,'دور ثانى'!$A$11:$R$170,3,0)","v":"10 - 3"},{"$f":"VLOOKUP(C38,'دور ثانى'!$A$11:$R$170,18,0)","v":"الدراسات الاجتماعية / الكيمياء / الفيزياء / الأحياء / التربية الإسلامية / اللغة العربية / "}]
[null,null,35,{"$f":"VLOOKUP(C39,'دور ثانى'!$A$11:$R$170,1,0)","v":35},{"$f":"VLOOKUP(C39,'دور ثانى'!$A$11:$R$170,2,0)","v":"عبدالرحمن فرج محمد المشعلى القحطانى"},{"$f":"VLOOKUP(C39,'دور ثانى'!$A$11:$R$170,3,0)","v":"10 - 3"},{"$f":"VLOOKUP(C39,'دور ثانى'!$A$11:$R$170,18,0)","v":"الدراسات الاجتماعية / الكيمياء / الأحياء / "}]
[null,null,36,{"$f":"VLOOKUP(C40,'دور ثانى'!$A$11:$R$170,1,0)","v":36},{"$f":"VLOOKUP(C40,'دور ثانى'!$A$11:$R$170,2,0)","v":"عبدالرشيد حسين عبدي"},{"$f":"VLOOKUP(C40,'دور ثانى'!$A$11:$R$170,3,0)","v":"10 - 3"},{"$f":"VLOOKUP(C40,'دور ثانى'!$A$11:$R$170,18,0)","v":"الرياضيات / الكيمياء / الأحياء / التربية الإسلامية / اللغة الإنجليزية / "}]
[null,null,37,{"$f":"VLOOKUP(C41,'دور ثانى'!$A$11:$R$170,1,0)","v":37},{"$f":"VLOOKUP(C41,'دور ثانى'!$A$11:$R$170,2,0)","v":"عبدالله سعيد بخيت سعيد خوار"},{"$f":"VLOOKUP(C41,'دور ثانى'!$A$11:$R$170,3,0)","v":"10 - 3"},{"$f":"VLOOKUP(C41,'دور ثانى'!$A$11:$R$170,18,0)","v":"الدراسات الاجتماعية / الحوسبة وتكنولوجيا المعلومات / الكيمياء / الأحياء / "}]
[null,null,38,{"$f":"VLOOKUP(C42,'دور ثانى'!$A$11:$R$170,1,0)","v":38},{"$f":"VLOOKUP(C42,'دور ثانى'!$A$11:$R$170,2,0)","v":"عبدالله سعيد عبدالله آل نابت المرى"},{"$f":"VLOOKUP(C42,'دور ثانى'!$A$11:$R$170,3,0)","v":"10 - 3"},{"$f":"VLOOKUP(C42,'دور ثانى'!$A$11:$R$170,18,0)","v":"الأحياء / التربية الإسلامية / اللغة العربية / "}]
[null,null,39,{"$f":"VLOOKUP(C43,'دور ثانى'!$A$11:$R$170,1,0)","v":39},{"$f":"VLOOKUP(C43,'دور ثانى'!$A$11:$R$170,2,0)","v":"عبدالله عادل خصيف"},{"$f":"VLOOKUP(C43,'دور ثانى'!$A$11:$R$170,3,0)","v":"10 - 3"},{"$f":"VLOOKUP(C43,'دور ثانى'!$A$11:$R$170,18,0)","v":"الرياضيات / الدراسات الاجتماعية / الحوسبة وتكنولوجيا المعلومات / الكيمياء / الفيزياء / الأحياء / التربية الإسلامية / اللغة العربية / اللغة الإنجليزية / "}]
[null,null,40,{"$f":"VLOOKUP(C44,'دور ثانى'!$A$11:$R$170,1,0)","v":40},{"$f":"VLOOKUP(C44,'دور ثانى'!$A$11:$R$170,2,0)","v":"عبدالله مبارك سالم بطى الكعبى"},{"$f":"VLOOKUP(C44,'دور ثانى'!$A$11:$R$170,3,0)","v":"10 - 3"},{"$f":"VLOOKUP(C44,'دور ثانى'!$A$11:$R$170,18,0)","v":"الأحياء / "}]
[null,null,41,{"$f":"VLOOKUP(C45,'دور ثانى'!$A$11:$R$170,1,0)","v":41},{"$f":"VLOOKUP(C45,'دور ثانى'!$A$11:$R$170,2,0)","v":"على عجيم على عجيم الحبابى"},{"$f":"VLOOKUP(C45,'دور ثانى'!$A$11:$R$170,3,0)","v":"10 - 3"},{"$f":"VLOOKUP(C45,'دور ثانى'!$A$11:$R$170,18,0)","v":"الأحياء / التربية الإسلامية / "}]
[null,null,42,{"$f":"VLOOKUP(C46,'دور ثانى'!$A$11:$R$170,1,0)","v":42},{"$f":"VLOOKUP(C46,'دور ثانى'!$A$11:$R$170,2,0)","v":"على فهد على احمد محمد"},{"$f":"VLOOKUP(C46,'دور ثانى'!$A$11:$R$170,3,0)","v":"10 - 3"},{"$f":"VLOOKUP(C46,'دور ثانى'!$A$11:$R$170,18,0)","v":"الدراسات الاجتماعية / الكيمياء / الأحياء / "}]
[null,null,43,{"$f":"VLOOKUP(C47,'دور ثانى'!$A$11:$R$170,1,0)","v":43},{"$f":"VLOOKUP(C47,'دور ثانى'!$A$11:$R$170,2,0)","v":"عمر عبيدالله روح الامين مريضا"},{"$f":"VLOOKUP(C47,'دور ثانى'!$A$11:$R$170,3,0)","v":"10 - 3"},{"$f":"VLOOKUP(C47,'دور ثانى'!$A$11:$R$170,18,0)","v":"الرياضيات / الدراسات الاجتماعية / الكيمياء / الفيزياء / الأحياء / اللغة العربية / "}]
[null,null,44,{"$f":"VLOOKUP(C48,'دور ثانى'!$A$11:$R$170,1,0)","v":44},{"$f":"VLOOKUP(C48,'دور ثانى'!$A$11:$R$170,2,0)","v":"ماجد صلاح خميس يوسف ابراهيم"},{"$f":"VLOOKUP(C48,'دور ثانى'!$A$11:$R$170,3,0)","v":"10 - 3"},{"$f":"VLOOKUP(C48,'دور ثانى'!$A$11:$R$170,18,0)","v":"الرياضيات / الدراسات الاجتماعية / الحوسبة وتكنولوجيا المعلومات / الكيمياء / الفيزياء / الأحياء / التربية الإسلامية / اللغة العربية / اللغة الإنجليزية / "}]
[null,null,45,{"$f":"VLOOKUP(C49,'دور ثانى'!$A$11:$R$170,1,0)","v":45},{"$f":"VLOOKUP(C49,'دور ثانى'!$A$11:$R$170,2,0)","v":"محمد عبدالله عبدالله ابراهيم الخليفى"},{"$f":"VLOOKUP(C49,'دور ثانى'!$A$11:$R$170,3,0)","v":"10 - 3"},{"$f":"VLOOKUP(C49,'دور ثانى'!$A$11:$R$170,18,0)","v":"الدراسات الاجتماعية / الفيزياء / الأحياء / التربية الإسلامية / اللغة العربية / "}]
[null,null,46,{"$f":"VLOOKUP(C50,'دور ثانى'!$A$11:$R$170,1,0)","v":46},{"$f":"VLOOKUP(C50,'دور ثانى'!$A$11:$R$170,2,0)","v":"محمد عبدالله محمد جاسم السويدى"},{"$f":"VLOOKUP(C50,'دور ثانى'!$A$11:$R$170,3,0)","v":"10 - 3"},{"$f":"VLOOKUP(C50,'دور ثانى'!$A$11:$R$170,18,0)","v":"الدراسات الاجتماعية / الفيزياء / الأحياء / التربية الإسلامية / "}]
[null,null,47,{"$f":"VLOOKUP(C51,'دور ثانى'!$A$11:$R$170,1,0)","v":47},{"$f":"VLOOKUP(C51,'دور ثانى'!$A$11:$R$170,2,0)","v":"محمدزين عبدالحميد المبارك على"},{"$f":"VLOOKUP(C51,'دور ثانى'!$A$11:$R$170,3,0)","v":"10 - 3"},{"$f":"VLOOKUP(C51,'دور ثانى'!$A$11:$R$170,18,0)","v":"الرياضيات / الدراسات الاجتماعية / الحوسبة وتكنولوجيا المعلومات / الأحياء / التربية الإسلامية / اللغة الإنجليزية / "}]
[null,null,48,{"$f":"VLOOKUP(C52,'دور ثانى'!$A$11:$R$170,1,0)","v":48},{"$f":"VLOOKUP(C52,'دور ثانى'!$A$11:$R$170,2,0)","v":"محمود اسعد الحاج الخلف"},{"$f":"VLOOKUP(C52,'دور ثانى'!$A$11:$R$170,3,0)","v":"10 - 3"},{"$f":"VLOOKUP(C52,'دور ثانى'!$A$11:$R$170,18,0)","v":"الرياضيات / الكيمياء / الأحياء / "}]
[null,null,49,{"$f":"VLOOKUP(C53,'دور ثانى'!$A$11:$R$170,1,0)","v":49},{"$f":"VLOOKUP(C53,'دور ثانى'!$A$11:$R$170,2,0)","v":"مسفر سعد محمد ذفال الحبابى"},{"$f":"VLOOKUP(C53,'دور ثانى'!$A$11:$R$170,3,0)","v":"10 - 3"},{"$f":"VLOOKUP(C53,'دور ثانى'!$A$11:$R$170,18,0)","v":"الرياضيات / الدراسات الاجتماعية / الحوسبة وتكنولوجيا المعلومات / الكيمياء / الفيزياء / الأحياء / التربية الإسلامية / اللغة العربية / اللغة الإنجليزية / "}]
[null,null,50,{"$f":"VLOOKUP(C54,'دور ثانى'!$A$11:$R$170,1,0)","v":50},{"$f":"VLOOKUP(C54,'دور ثانى'!$A$11:$R$170,2,0)","v":"ناصر جهان بخش مرادك درزاده"},{"$f":"VLOOKUP(C54,'دور ثانى'!$A$11:$R$170,3,0)","v":"10 - 3"},{"$f":"VLOOKUP(C54,'دور ثانى'!$A$11:$R$170,18,0)","v":"الرياضيات / الدراسات الاجتماعية / الفيزياء / الأحياء / اللغة الإنجليزية / "}]
[null,null,51,{"$f":"VLOOKUP(C55,'دور ثانى'!$A$11:$R$170,1,0)","v":51},{"$f":"VLOOKUP(C55,'دور ثانى'!$A$11:$R$170,2,0)","v":"ناصر محمد خالد احمد الغانم"},{"$f":"VLOOKUP(C55,'دور ثانى'!$A$11:$R$170,3,0)","v":"10 - 3"},{"$f":"VLOOKUP(C55,'دور ثانى'!$A$11:$R$170,18,0)","v":"الرياضيات / الدراسات الاجتماعية / الكيمياء / الأحياء / اللغة العربية / اللغة الإنجليزية / "}]
[null,null,52,{"$f":"VLOOKUP(C56,'دور ثانى'!$A$11:$R$170,1,0)","v":52},{"$f":"VLOOKUP(C56,'دور ثانى'!$A$11:$R$170,2,0)","v":"يوسف صالح على عبدالعزيز على"},{"$f":"VLOOKUP(C56,'دور ثانى'!$A$11:$R$170,3,0)","v":"10 - 3"},{"$f":"VLOOKUP(C56,'دور ثانى'!$A$11:$R$170,18,0)","v":"الدراسات الاجتماعية / التربية الإسلامية / "}]
[null,null,53,{"$f":"VLOOKUP(C57,'دور ثانى'!$A$11:$R$170,1,0)","v":53},{"$f":"VLOOKUP(C57,'دور ثانى'!$A$11:$R$170,2,0)","v":"احمد رائد سليمان المومني"},{"$f":"VLOOKUP(C57,'دور ثانى'!$A$11:$R$170,3,0)","v":"10 - 4"},{"$f":"VLOOKUP(C57,'دور ثانى'!$A$11:$R$170,18,0)","v":"الرياضيات / الكيمياء / الأحياء / "}]
[null,null,54,{"$f":"VLOOKUP(C58,'دور ثانى'!$A$11:$R$170,1,0)","v":54},{"$f":"VLOOKUP(C58,'دور ثانى'!$A$11:$R$170,2,0)","v":"أحمد نافذ حماده حموده"},{"$f":"VLOOKUP(C58,'دور ثانى'!$A$11:$R$170,3,0)","v":"10 - 4"},{"$f":"VLOOKUP(C58,'دور ثانى'!$A$11:$R$170,18,0)","v":"الرياضيات / الأحياء / "}]
[null,null,55,{"$f":"VLOOKUP(C59,'دور ثانى'!$A$11:$R$170,1,0)","v":55},{"$f":"VLOOKUP(C59,'دور ثانى'!$A$11:$R$170,2,0)","v":"تميم سالم راشد الصعاق المرى"},{"$f":"VLOOKUP(C59,'دور ثانى'!$A$11:$R$170,3,0)","v":"10 - 4"},{"$f":"VLOOKUP(C59,'دور ثانى'!$A$11:$R$170,18,0)","v":"الرياضيات / الدراسات الاجتماعية / الكيمياء / الأحياء / اللغة العربية / اللغة الإنجليزية / "}]
[null,null,56,{"$f":"VLOOKUP(C60,'دور ثانى'!$A$11:$R$170,1,0)","v":56},{"$f":"VLOOKUP(C60,'دور ثانى'!$A$11:$R$170,2,0)","v":"جابر سعيد جابر سالم اليربوعى"},{"$f":"VLOOKUP(C60,'دور ثانى'!$A$11:$R$170,3,0)","v":"10 - 4"},{"$f":"VLOOKUP(C60,'دور ثانى'!$A$11:$R$170,18,0)","v":"الرياضيات / الدراسات الاجتماعية / الفيزياء / الأحياء / اللغة الإنجليزية / "}]
[null,null,57,{"$f":"VLOOKUP(C61,'دور ثانى'!$A$11:$R$170,1,0)","v":57},{"$f":"VLOOKUP(C61,'دور ثانى'!$A$11:$R$170,2,0)","v":"جاسم محمود محمد عبداللهي"},{"$f":"VLOOKUP(C61,'دور ثانى'!$A$11:$R$170,3,0)","v":"10 - 4"},{"$f":"VLOOKUP(C61,'دور ثانى'!$A$11:$R$170,18,0)","v":"الأحياء / "}]
[null,null,58,{"$f":"VLOOKUP(C62,'دور ثانى'!$A$11:$R$170,1,0)","v":58},{"$f":"VLOOKUP(C62,'دور ثانى'!$A$11:$R$170,2,0)","v":"حمد محمد بخيت تويم المرى"},{"$f":"VLOOKUP(C62,'دور ثانى'!$A$11:$R$170,3,0)","v":"10 - 4"},{"$f":"VLOOKUP(C62,'دور ثانى'!$A$11:$R$170,18,0)","v":"الحوسبة وتكنولوجيا المعلومات / الكيمياء / الأحياء / "}]
[null,null,59,{"$f":"VLOOKUP(C63,'دور ثانى'!$A$11:$R$170,1,0)","v":59},{"$f":"VLOOKUP(C63,'دور ثانى'!$A$11:$R$170,2,0)","v":"خالد سعيد محمد البريكان المرى"},{"$f":"VLOOKUP(C63,'دور ثانى'!$A$11:$R$170,3,0)","v":"10 - 4"},{"$f":"VLOOKUP(C63,'دور ثانى'!$A$11:$R$170,18,0)","v":"الرياضيات / "}]
[null,null,60,{"$f":"VLOOKUP(C64,'دور ثانى'!$A$11:$R$170,1,0)","v":60},{"$f":"VLOOKUP(C64,'دور ثانى'!$A$11:$R$170,2,0)","v":"خميس محمد سيف خميس الريامي"},{"$f":"VLOOKUP(C64,'دور ثانى'!$A$11:$R$170,3,0)","v":"10 - 4"},{"$f":"VLOOKUP(C64,'دور ثانى'!$A$11:$R$170,18,0)","v":"الأحياء / اللغة الإنجليزية / "}]
[null,null,61,{"$f":"VLOOKUP(C65,'دور ثانى'!$A$11:$R$170,1,0)","v":61},{"$f":"VLOOKUP(C65,'دور ثانى'!$A$11:$R$170,2,0)","v":"راشد حمد راشد سالم خادم"},{"$f":"VLOOKUP(C65,'دور ثانى'!$A$11:$R$170,3,0)","v":"10 - 4"},{"$f":"VLOOKUP(C65,'دور ثانى'!$A$11:$R$170,18,0)","v":"الرياضيات / الدراسات الاجتماعية / الكيمياء / الفيزياء / الأحياء / التربية الإسلامية / اللغة العربية / اللغة الإنجليزية / "}]
[null,null,62,{"$f":"VLOOKUP(C66,'دور ثانى'!$A$11:$R$170,1,0)","v":62},{"$f":"VLOOKUP(C66,'دور ثانى'!$A$11:$R$170,2,0)","v":"سالم حمد سالم اليربوعى المرى"},{"$f":"VLOOKUP(C66,'دور ثانى'!$A$11:$R$170,3,0)","v":"10 - 4"},{"$f":"VLOOKUP(C66,'دور ثانى'!$A$11:$R$170,18,0)","v":"الرياضيات / الدراسات الاجتماعية / الحوسبة وتكنولوجيا المعلومات / الكيمياء / الفيزياء / الأحياء / التربية الإسلامية / اللغة العربية / اللغة الإنجليزية / "}]
[null,null,63,{"$f":"VLOOKUP(C67,'دور ثانى'!$A$11:$R$170,1,0)","v":63},{"$f":"VLOOKUP(C67,'دور ثانى'!$A$11:$R$170,2,0)","v":"سليمان حسن علي سليمان موسى"},{"$f":"VLOOKUP(C67,'دور ثانى'!$A$11:$R$170,3,0)","v":"10 - 4"},{"$f":"VLOOKUP(C67,'دور ثانى'!$A$11:$R$170,18,0)","v":"الأحياء / "}]
[null,null,64,{"$f":"VLOOKUP(C68,'دور ثانى'!$A$11:$R$170,1,0)","v":64},{"$f":"VLOOKUP(C68,'دور ثانى'!$A$11:$R$170,2,0)","v":"شعيب عبدي قرني قلديد"},{"$f":"VLOOKUP(C68,'دور ثانى'!$A$11:$R$170,3,0)","v":"10 - 4"},{"$f":"VLOOKUP(C68,'دور ثانى'!$A$11:$R$170,18,0)","v":"الرياضيات / الدراسات الاجتماعية / الكيمياء / الأحياء / اللغة الإنجليزية / "}]
[null,null,65,{"$f":"VLOOKUP(C69,'دور ثانى'!$A$11:$R$170,1,0)","v":65},{"$f":"VLOOKUP(C69,'دور ثانى'!$A$11:$R$170,2,0)","v":"عابدين حافظ عابدين موسى"},{"$f":"VLOOKUP(C69,'دور ثانى'!$A$11:$R$170,3,0)","v":"10 - 4"},{"$f":"VLOOKUP(C69,'دور ثانى'!$A$11:$R$170,18,0)","v":"الرياضيات / الأحياء / "}]
[null,null,{"$f":"ROW()-4","v":66},{"$f":"VLOOKUP(C70,'دور ثانى'!$A$11:$R$170,1,0)","v":66},{"$f":"VLOOKUP(C70,'دور ثانى'!$A$11:$R$170,2,0)","v":"عبدالرحمن صبرى عثمان محسن اليهرى"},{"$f":"VLOOKUP(C70,'دور ثانى'!$A$11:$R$170,3,0)","v":"10 - 4"},{"$f":"VLOOKUP(C70,'دور ثانى'!$A$11:$R$170,18,0)","v":"الأحياء / اللغة الإنجليزية / "}]
[null,null,67,{"$f":"VLOOKUP(C71,'دور ثانى'!$A$11:$R$170,1,0)","v":67},{"$f":"VLOOKUP(C71,'دور ثانى'!$A$11:$R$170,2,0)","v":"عبدالله سالم محمد سالم خوار"},{"$f":"VLOOKUP(C71,'دور ثانى'!$A$11:$R$170,3,0)","v":"10 - 4"},{"$f":"VLOOKUP(C71,'دور ثانى'!$A$11:$R$170,18,0)","v":"الرياضيات / الفيزياء / الأحياء / التربية الإسلامية / اللغة العربية / اللغة الإنجليزية / "}]
[null,null,68,{"$f":"VLOOKUP(C72,'دور ثانى'!$A$11:$R$170,1,0)","v":68},{"$f":"VLOOKUP(C72,'دور ثانى'!$A$11:$R$170,2,0)","v":"على محمد عويض الصقور المرى"},{"$f":"VLOOKUP(C72,'دور ثانى'!$A$11:$R$170,3,0)","v":"10 - 4"},{"$f":"VLOOKUP(C72,'دور ثانى'!$A$11:$R$170,18,0)","v":"الرياضيات / الدراسات الاجتماعية / الفيزياء / الأحياء / "}]
[null,null,69,{"$f":"VLOOKUP(C73,'دور ثانى'!$A$11:$R$170,1,0)","v":69},{"$f":"VLOOKUP(C73,'دور ثانى'!$A$11:$R$170,2,0)","v":"علي عاطف سالم ابراهيم سالم"},{"$f":"VLOOKUP(C73,'دور ثانى'!$A$11:$R$170,3,0)","v":"10 - 4"},{"$f":"VLOOKUP(C73,'دور ثانى'!$A$11:$R$170,18,0)","v":"الرياضيات / الفيزياء / الأحياء / "}]
[null,null,70,{"$f":"VLOOKUP(C74,'دور ثانى'!$A$11:$R$170,1,0)","v":70},{"$f":"VLOOKUP(C74,'دور ثانى'!$A$11:$R$170,2,0)","v":"علي محمد عبدالله احمد شمس"},{"$f":"VLOOKUP(C74,'دور ثانى'!$A$11:$R$170,3,0)","v":"10 - 4"},{"$f":"VLOOKUP(C74,'دور ثانى'!$A$11:$R$170,18,0)","v":"الدراسات الاجتماعية / "}]
[null,null,71,{"$f":"VLOOKUP(C75,'دور ثانى'!$A$11:$R$170,1,0)","v":71},{"$f":"VLOOKUP(C75,'دور ثانى'!$A$11:$R$170,2,0)","v":"فهد سويد سلطان محمد الخوار"},{"$f":"VLOOKUP(C75,'دور ثانى'!$A$11:$R$170,3,0)","v":"10 - 4"},{"$f":"VLOOKUP(C75,'دور ثانى'!$A$11:$R$170,18,0)","v":"الرياضيات / الكيمياء / الفيزياء / الأحياء / "}]
[null,null,72,{"$f":"VLOOKUP(C76,'دور ثانى'!$A$11:$R$170,1,0)","v":72},{"$f":"VLOOKUP(C76,'دور ثانى'!$A$11:$R$170,2,0)","v":"محمد حافظ محمد ابوالكلام كبيرالدين"},{"$f":"VLOOKUP(C76,'دور ثانى'!$A$11:$R$170,3,0)","v":"10 - 4"},{"$f":"VLOOKUP(C76,'دور ثانى'!$A$11:$R$170,18,0)","v":"الرياضيات / الكيمياء / "}]
[null,null,73,{"$f":"VLOOKUP(C77,'دور ثانى'!$A$11:$R$170,1,0)","v":73},{"$f":"VLOOKUP(C77,'دور ثانى'!$A$11:$R$170,2,0)","v":"محمد حسن حسن ناجى الجدره"},{"$f":"VLOOKUP(C77,'دور ثانى'!$A$11:$R$170,3,0)","v":"10 - 4"},{"$f":"VLOOKUP(C77,'دور ثانى'!$A$11:$R$170,18,0)","v":"الكيمياء / الفيزياء / الأحياء / "}]
[null,null,74,{"$f":"VLOOKUP(C78,'دور ثانى'!$A$11:$R$170,1,0)","v":74},{"$f":"VLOOKUP(C78,'دور ثانى'!$A$11:$R$170,2,0)","v":"محمد حمد محمد صالح الصرامى"},{"$f":"VLOOKUP(C78,'دور ثانى'!$A$11:$R$170,3,0)","v":"10 - 4"},{"$f":"VLOOKUP(C78,'دور ثانى'!$A$11:$R$170,18,0)","v":"الرياضيات / الدراسات الاجتماعية / الكيمياء / الأحياء / "}]
[null,null,75,{"$f":"VLOOKUP(C79,'دور ثانى'!$A$11:$R$170,1,0)","v":75},{"$f":"VLOOKUP(C79,'دور ثانى'!$A$11:$R$170,2,0)","v":"محمد يوسف محمد ابراهيم محمد"},{"$f":"VLOOKUP(C79,'دور ثانى'!$A$11:$R$170,3,0)","v":"10 - 4"},{"$f":"VLOOKUP(C79,'دور ثانى'!$A$11:$R$170,18,0)","v":"الرياضيات / الكيمياء / الفيزياء / الأحياء / اللغة الإنجليزية / "}]
[null,null,76,{"$f":"VLOOKUP(C80,'دور ثانى'!$A$11:$R$170,1,0)","v":76},{"$f":"VLOOKUP(C80,'دور ثانى'!$A$11:$R$170,2,0)","v":"محمد يونس محمد زحمت كش"},{"$f":"VLOOKUP(C80,'دور ثانى'!$A$11:$R$170,3,0)","v":"10 - 4"},{"$f":"VLOOKUP(C80,'دور ثانى'!$A$11:$R$170,18,0)","v":"الرياضيات / الأحياء / اللغة الإنجليزية / "}]
[null,null,77,{"$f":"VLOOKUP(C81,'دور ثانى'!$A$11:$R$170,1,0)","v":77},{"$f":"VLOOKUP(C81,'دور ثانى'!$A$11:$R$170,2,0)","v":"بدر ناصر جابر سهل المرى"},{"$f":"VLOOKUP(C81,'دور ثانى'!$A$11:$R$170,3,0)","v":"10 - 5"},{"$f":"VLOOKUP(C81,'دور ثانى'!$A$11:$R$170,18,0)","v":"الدراسات الاجتماعية / الكيمياء / التربية الإسلامية / "}]
[null,null,78,{"$f":"VLOOKUP(C82,'دور ثانى'!$A$11:$R$170,1,0)","v":78},{"$f":"VLOOKUP(C82,'دور ثانى'!$A$11:$R$170,2,0)","v":"حزام زيد راشد المري"},{"$f":"VLOOKUP(C82,'دور ثانى'!$A$11:$R$170,3,0)","v":"10 - 5"},{"$f":"VLOOKUP(C82,'دور ثانى'!$A$11:$R$170,18,0)","v":"الرياضيات / الحوسبة وتكنولوجيا المعلومات / التربية الإسلامية / اللغة العربية / "}]
[null,null,79,{"$f":"VLOOKUP(C83,'دور ثانى'!$A$11:$R$170,1,0)","v":79},{"$f":"VLOOKUP(C83,'دور ثانى'!$A$11:$R$170,2,0)","v":"حمد سعيد سويلم سعد الخوار"},{"$f":"VLOOKUP(C83,'دور ثانى'!$A$11:$R$170,3,0)","v":"10 - 5"},{"$f":"VLOOKUP(C83,'دور ثانى'!$A$11:$R$170,18,0)","v":"الدراسات الاجتماعية / الحوسبة وتكنولوجيا المعلومات / الكيمياء / الأحياء / التربية الإسلامية / اللغة العربية / "}]
[null,null,80,{"$f":"VLOOKUP(C84,'دور ثانى'!$A$11:$R$170,1,0)","v":80},{"$f":"VLOOKUP(C84,'دور ثانى'!$A$11:$R$170,2,0)","v":"حمد مبارك مفتاح فرج العبدالله"},{"$f":"VLOOKUP(C84,'دور ثانى'!$A$11:$R$170,3,0)","v":"10 - 5"},{"$f":"VLOOKUP(C84,'دور ثانى'!$A$11:$R$170,18,0)","v":"الرياضيات / الدراسات الاجتماعية / الحوسبة وتكنولوجيا المعلومات / الكيمياء / الفيزياء / الأحياء / اللغة العربية / اللغة الإنجليزية / "}]
[null,null,81,{"$f":"VLOOKUP(C85,'دور ثانى'!$A$11:$R$170,1,0)","v":81},{"$f":"VLOOKUP(C85,'دور ثانى'!$A$11:$R$170,2,0)","v":"خالد عزيز حسن عبدربه حسن"},{"$f":"VLOOKUP(C85,'دور ثانى'!$A$11:$R$170,3,0)","v":"10 - 5"},{"$f":"VLOOKUP(C85,'دور ثانى'!$A$11:$R$170,18,0)","v":"الكيمياء / "}]
[null,null,82,{"$f":"VLOOKUP(C86,'دور ثانى'!$A$11:$R$170,1,0)","v":82},{"$f":"VLOOKUP(C86,'دور ثانى'!$A$11:$R$170,2,0)","v":"دغش بريك دغش الجربوعى المرى"},{"$f":"VLOOKUP(C86,'دور ثانى'!$A$11:$R$170,3,0)","v":"10 - 5"},{"$f":"VLOOKUP(C86,'دور ثانى'!$A$11:$R$170,18,0)","v":"الرياضيات / "}]
[null,null,83,{"$f":"VLOOKUP(C87,'دور ثانى'!$A$11:$R$170,1,0)","v":83},{"$f":"VLOOKUP(C87,'دور ثانى'!$A$11:$R$170,2,0)","v":"راشد حمد ناصر المري"},{"$f":"VLOOKUP(C87,'دور ثانى'!$A$11:$R$170,3,0)","v":"10 - 5"},{"$f":"VLOOKUP(C87,'دور ثانى'!$A$11:$R$170,18,0)","v":"الرياضيات / الأحياء / "}]
[null,null,84,{"$f":"VLOOKUP(C88,'دور ثانى'!$A$11:$R$170,1,0)","v":84},{"$f":"VLOOKUP(C88,'دور ثانى'!$A$11:$R$170,2,0)","v":"راشد شريف خان عيسى خان"},{"$f":"VLOOKUP(C88,'دور ثانى'!$A$11:$R$170,3,0)","v":"10 - 5"},{"$f":"VLOOKUP(C88,'دور ثانى'!$A$11:$R$170,18,0)","v":"الحوسبة وتكنولوجيا المعلومات / "}]
[null,null,85,{"$f":"VLOOKUP(C89,'دور ثانى'!$A$11:$R$170,1,0)","v":85},{"$f":"VLOOKUP(C89,'دور ثانى'!$A$11:$R$170,2,0)","v":"سالم محمد راشد طفله الفهيده"},{"$f":"VLOOKUP(C89,'دور ثانى'!$A$11:$R$170,3,0)","v":"10 - 5"},{"$f":"VLOOKUP(C89,'دور ثانى'!$A$11:$R$170,18,0)","v":"الرياضيات / الدراسات الاجتماعية / الكيمياء / الفيزياء / الأحياء / اللغة العربية / اللغة الإنجليزية / "}]
[null,null,86,{"$f":"VLOOKUP(C90,'دور ثانى'!$A$11:$R$170,1,0)","v":86},{"$f":"VLOOKUP(C90,'دور ثانى'!$A$11:$R$170,2,0)","v":"سعد حمد سعد البويصم المرى"},{"$f":"VLOOKUP(C90,'دور ثانى'!$A$11:$R$170,3,0)","v":"10 - 5"},{"$f":"VLOOKUP(C90,'دور ثانى'!$A$11:$R$170,18,0)","v":"الحوسبة وتكنولوجيا المعلومات / الأحياء / "}]
[null,null,87,{"$f":"VLOOKUP(C91,'دور ثانى'!$A$11:$R$170,1,0)","v":87},{"$f":"VLOOKUP(C91,'دور ثانى'!$A$11:$R$170,2,0)","v":"صلاح عارف احمد عبده جمن"},{"$f":"VLOOKUP(C91,'دور ثانى'!$A$11:$R$170,3,0)","v":"10 - 5"},{"$f":"VLOOKUP(C91,'دور ثانى'!$A$11:$R$170,18,0)","v":"الكيمياء / "}]
[null,null,88,{"$f":"VLOOKUP(C92,'دور ثانى'!$A$11:$R$170,1,0)","v":88},{"$f":"VLOOKUP(C92,'دور ثانى'!$A$11:$R$170,2,0)","v":"عبدالعزيز نايف عبدالله نايف"},{"$f":"VLOOKUP(C92,'دور ثانى'!$A$11:$R$170,3,0)","v":"10 - 5"},{"$f":"VLOOKUP(C92,'دور ثانى'!$A$11:$R$170,18,0)","v":"اللغة الإنجليزية / "}]
[null,null,89,{"$f":"VLOOKUP(C93,'دور ثانى'!$A$11:$R$170,1,0)","v":89},{"$f":"VLOOKUP(C93,'دور ثانى'!$A$11:$R$170,2,0)","v":"عبدالله عبدالرحمن"},{"$f":"VLOOKUP(C93,'دور ثانى'!$A$11:$R$170,3,0)","v":"10 - 5"},{"$f":"VLOOKUP(C93,'دور ثانى'!$A$11:$R$170,18,0)","v":"الحوسبة وتكنولوجيا المعلومات / الأحياء / "}]
[null,null,90,{"$f":"VLOOKUP(C94,'دور ثانى'!$A$11:$R$170,1,0)","v":90},{"$f":"VLOOKUP(C94,'دور ثانى'!$A$11:$R$170,2,0)","v":"عبدالمحسن عادل عبدالمحسن محمد الدهنيم"},{"$f":"VLOOKUP(C94,'دور ثانى'!$A$11:$R$170,3,0)","v":"10 - 5"},{"$f":"VLOOKUP(C94,'دور ثانى'!$A$11:$R$170,18,0)","v":"الرياضيات / الحوسبة وتكنولوجيا المعلومات / "}]
[null,null,91,{"$f":"VLOOKUP(C95,'دور ثانى'!$A$11:$R$170,1,0)","v":91},{"$f":"VLOOKUP(C95,'دور ثانى'!$A$11:$R$170,2,0)","v":"على حسن مبخوت سعيد الراشدى"},{"$f":"VLOOKUP(C95,'دور ثانى'!$A$11:$R$170,3,0)","v":"10 - 5"},{"$f":"VLOOKUP(C95,'دور ثانى'!$A$11:$R$170,18,0)","v":"الدراسات الاجتماعية / الحوسبة وتكنولوجيا المعلومات / الكيمياء / الأحياء / التربية الإسلامية / اللغة الإنجليزية / "}]
[null,null,92,{"$f":"VLOOKUP(C96,'دور ثانى'!$A$11:$R$170,1,0)","v":92},{"$f":"VLOOKUP(C96,'دور ثانى'!$A$11:$R$170,2,0)","v":"على سالم ظافر ال حثيث الاحبابى"},{"$f":"VLOOKUP(C96,'دور ثانى'!$A$11:$R$170,3,0)","v":"10 - 5"},{"$f":"VLOOKUP(C96,'دور ثانى'!$A$11:$R$170,18,0)","v":"الأحياء / "}]
[null,null,93,{"$f":"VLOOKUP(C97,'دور ثانى'!$A$11:$R$170,1,0)","v":93},{"$f":"VLOOKUP(C97,'دور ثانى'!$A$11:$R$170,2,0)","v":"عمر شادي نعيم زهران"},{"$f":"VLOOKUP(C97,'دور ثانى'!$A$11:$R$170,3,0)","v":"10 - 5"},{"$f":"VLOOKUP(C97,'دور ثانى'!$A$11:$R$170,18,0)","v":"الرياضيات / الدراسات الاجتماعية / الحوسبة وتكنولوجيا المعلومات / الكيمياء / الفيزياء / الأحياء / التربية الإسلامية / اللغة العربية / اللغة الإنجليزية / "}]
[null,null,94,{"$f":"VLOOKUP(C98,'دور ثانى'!$A$11:$R$170,1,0)","v":94},{"$f":"VLOOKUP(C98,'دور ثانى'!$A$11:$R$170,2,0)","v":"غانم حمد صالح سعيد القريصى"},{"$f":"VLOOKUP(C98,'دور ثانى'!$A$11:$R$170,3,0)","v":"10 - 5"},{"$f":"VLOOKUP(C98,'دور ثانى'!$A$11:$R$170,18,0)","v":"الرياضيات / الدراسات الاجتماعية / الحوسبة وتكنولوجيا المعلومات / الكيمياء / الفيزياء / الأحياء / التربية الإسلامية / اللغة العربية / اللغة الإنجليزية / "}]
[null,null,95,{"$f":"VLOOKUP(C99,'دور ثانى'!$A$11:$R$170,1,0)","v":95},{"$f":"VLOOKUP(C99,'دور ثانى'!$A$11:$R$170,2,0)","v":"فهد سعد سعيد بخيت الخوار"},{"$f":"VLOOKUP(C99,'دور ثانى'!$A$11:$R$170,3,0)","v":"10 - 5"},{"$f":"VLOOKUP(C99,'دور ثانى'!$A$11:$R$170,18,0)","v":"الرياضيات / الدراسات الاجتماعية / الكيمياء / الأحياء / التربية الإسلامية / اللغة العربية / اللغة الإنجليزية / "}]
[null,null,96,{"$f":"VLOOKUP(C100,'دور ثانى'!$A$11:$R$170,1,0)","v":96},{"$f":"VLOOKUP(C100,'دور ثانى'!$A$11:$R$170,2,0)","v":"قصي محمد داود ابراهيم ابوديه"},{"$f":"VLOOKUP(C100,'دور ثانى'!$A$11:$R$170,3,0)","v":"10 - 5"},{"$f":"VLOOKUP(C100,'دور ثانى'!$A$11:$R$170,18,0)","v":"الرياضيات / اللغة الإنجليزية / "}]
[null,null,97,{"$f":"VLOOKUP(C101,'دور ثانى'!$A$11:$R$170,1,0)","v":97},{"$f":"VLOOKUP(C101,'دور ثانى'!$A$11:$R$170,2,0)","v":"محمد امين بن عادل قنوني"},{"$f":"VLOOKUP(C101,'دور ثانى'!$A$11:$R$170,3,0)","v":"10 - 5"},{"$f":"VLOOKUP(C101,'دور ثانى'!$A$11:$R$170,18,0)","v":"الحوسبة وتكنولوجيا المعلومات / الكيمياء / الأحياء / "}]
[null,null,98,{"$f":"VLOOKUP(C102,'دور ثانى'!$A$11:$R$170,1,0)","v":98},{"$f":"VLOOKUP(C102,'دور ثانى'!$A$11:$R$170,2,0)","v":"محمد سعيد جابر سالم اليربوعى"},{"$f":"VLOOKUP(C102,'دور ثانى'!$A$11:$R$170,3,0)","v":"10 - 5"},{"$f":"VLOOKUP(C102,'دور ثانى'!$A$11:$R$170,18,0)","v":"الرياضيات / الدراسات الاجتماعية / الحوسبة وتكنولوجيا المعلومات / الكيمياء / الفيزياء / الأحياء / التربية الإسلامية / اللغة العربية / اللغة الإنجليزية / "}]
[null,null,99,{"$f":"VLOOKUP(C103,'دور ثانى'!$A$11:$R$170,1,0)","v":99},{"$f":"VLOOKUP(C103,'دور ثانى'!$A$11:$R$170,2,0)","v":"محمد طارق الحاج"},{"$f":"VLOOKUP(C103,'دور ثانى'!$A$11:$R$170,3,0)","v":"10 - 5"},{"$f":"VLOOKUP(C103,'دور ثانى'!$A$11:$R$170,18,0)","v":"اللغة العربية / "}]
[null,null,100,{"$f":"VLOOKUP(C104,'دور ثانى'!$A$11:$R$170,1,0)","v":100},{"$f":"VLOOKUP(C104,'دور ثانى'!$A$11:$R$170,2,0)","v":"محمد عبدالله شيخ محمد"},{"$f":"VLOOKUP(C104,'دور ثانى'!$A$11:$R$170,3,0)","v":"10 - 5"},{"$f":"VLOOKUP(C104,'دور ثانى'!$A$11:$R$170,18,0)","v":"الحوسبة وتكنولوجيا المعلومات / "}]
[null,null,101,{"$f":"VLOOKUP(C105,'دور ثانى'!$A$11:$R$170,1,0)","v":101},{"$f":"VLOOKUP(C105,'دور ثانى'!$A$11:$R$170,2,0)","v":"محمد محسن محمد دخيل اليربوعى"},{"$f":"VLOOKUP(C105,'دور ثانى'!$A$11:$R$170,3,0)","v":"10 - 5"},{"$f":"VLOOKUP(C105,'دور ثانى'!$A$11:$R$170,18,0)","v":"الرياضيات / الدراسات الاجتماعية / الحوسبة وتكنولوجيا المعلومات / الكيمياء / الفيزياء / الأحياء / التربية الإسلامية / اللغة العربية / اللغة الإنجليزية / "}]
[null,null,102,{"$f":"VLOOKUP(C106,'دور ثانى'!$A$11:$R$170,1,0)","v":102},{"$f":"VLOOKUP(C106,'دور ثانى'!$A$11:$R$170,2,0)","v":"نصر على نصر على النصر"},{"$f":"VLOOKUP(C106,'دور ثانى'!$A$11:$R$170,3,0)","v":"10 - 5"},{"$f":"VLOOKUP(C106,'دور ثانى'!$A$11:$R$170,18,0)","v":"الرياضيات / الكيمياء / الأحياء / التربية الإسلامية / اللغة العربية / اللغة الإنجليزية / "}]
[null,null,103,{"$f":"VLOOKUP(C107,'دور ثانى'!$A$11:$R$170,1,0)","v":103},{"$f":"VLOOKUP(C107,'دور ثانى'!$A$11:$R$170,2,0)","v":"حمد اصغر خان نواب خان"},{"$f":"VLOOKUP(C107,'دور ثانى'!$A$11:$R$170,3,0)","v":"10 - 6"},{"$f":"VLOOKUP(C107,'دور ثانى'!$A$11:$R$170,18,0)","v":"الرياضيات / الدراسات الاجتماعية / الحوسبة وتكنولوجيا المعلومات / الكيمياء / الفيزياء / الأحياء / التربية الإسلامية / اللغة العربية / "}]
[null,null,104,{"$f":"VLOOKUP(C108,'دور ثانى'!$A$11:$R$170,1,0)","v":104},{"$f":"VLOOKUP(C108,'دور ثانى'!$A$11:$R$170,2,0)","v":"خالد سلطان حسن عباس الجمالى"},{"$f":"VLOOKUP(C108,'دور ثانى'!$A$11:$R$170,3,0)","v":"10 - 6"},{"$f":"VLOOKUP(C108,'دور ثانى'!$A$11:$R$170,18,0)","v":"الكيمياء / الأحياء / اللغة العربية / "}]
[null,null,105,{"$f":"VLOOKUP(C109,'دور ثانى'!$A$11:$R$170,1,0)","v":105},{"$f":"VLOOKUP(C109,'دور ثانى'!$A$11:$R$170,2,0)","v":"عبدالرجمن يارمحمد معين خان"},{"$f":"VLOOKUP(C109,'دور ثانى'!$A$11:$R$170,3,0)","v":"10 - 6"},{"$f":"VLOOKUP(C109,'دور ثانى'!$A$11:$R$170,18,0)","v":"الدراسات الاجتماعية / الحوسبة وتكنولوجيا المعلومات / الأحياء / اللغة الإنجليزية / "}]
[null,null,106,{"$f":"VLOOKUP(C110,'دور ثانى'!$A$11:$R$170,1,0)","v":106},{"$f":"VLOOKUP(C110,'دور ثانى'!$A$11:$R$170,2,0)","v":"عبدالرحمن جاسم محمد قاسم العمادى"},{"$f":"VLOOKUP(C110,'دور ثانى'!$A$11:$R$170,3,0)","v":"10 - 6"},{"$f":"VLOOKUP(C110,'دور ثانى'!$A$11:$R$170,18,0)","v":"الحوسبة وتكنولوجيا المعلومات / الكيمياء / الأحياء / اللغة العربية / "}]
[null,null,107,{"$f":"VLOOKUP(C111,'دور ثانى'!$A$11:$R$170,1,0)","v":107},{"$f":"VLOOKUP(C111,'دور ثانى'!$A$11:$R$170,2,0)","v":"عبدالرحمن حسين عبدي"},{"$f":"VLOOKUP(C111,'دور ثانى'!$A$11:$R$170,3,0)","v":"10 - 6"},{"$f":"VLOOKUP(C111,'دور ثانى'!$A$11:$R$170,18,0)","v":"الدراسات الاجتماعية / الحوسبة وتكنولوجيا المعلومات / الكيمياء / الأحياء / اللغة العربية / "}]
[null,null,108,{"$f":"VLOOKUP(C112,'دور ثانى'!$A$11:$R$170,1,0)","v":108},{"$f":"VLOOKUP(C112,'دور ثانى'!$A$11:$R$170,2,0)","v":"عبدالرحمن محماس غزاى المقاطى العتيبى"},{"$f":"VLOOKUP(C112,'دور ثانى'!$A$11:$R$170,3,0)","v":"10 - 6"},{"$f":"VLOOKUP(C112,'دور ثانى'!$A$11:$R$170,18,0)","v":"الرياضيات / الدراسات الاجتماعية / الحوسبة وتكنولوجيا المعلومات / الكيمياء / الفيزياء / الأحياء / اللغة الإنجليزية / "}]
[null,null,109,{"$f":"VLOOKUP(C113,'دور ثانى'!$A$11:$R$170,1,0)","v":109},{"$f":"VLOOKUP(C113,'دور ثانى'!$A$11:$R$170,2,0)","v":"عبدالعزيز جهان بخش مرادك درزاده"},{"$f":"VLOOKUP(C113,'دور ثانى'!$A$11:$R$170,3,0)","v":"10 - 6"},{"$f":"VLOOKUP(C113,'دور ثانى'!$A$11:$R$170,18,0)","v":"الرياضيات / الدراسات الاجتماعية / الحوسبة وتكنولوجيا المعلومات / الكيمياء / الأحياء / اللغة العربية / "}]
[null,null,110,{"$f":"VLOOKUP(C114,'دور ثانى'!$A$11:$R$170,1,0)","v":110},{"$f":"VLOOKUP(C114,'دور ثانى'!$A$11:$R$170,2,0)","v":"عبدالعزيز سلطان حسن سالم الكثيرى"},{"$f":"VLOOKUP(C114,'دور ثانى'!$A$11:$R$170,3,0)","v":"10 - 6"},{"$f":"VLOOKUP(C114,'دور ثانى'!$A$11:$R$170,18,0)","v":"الأحياء / "}]
[null,null,111,{"$f":"VLOOKUP(C115,'دور ثانى'!$A$11:$R$170,1,0)","v":111},{"$f":"VLOOKUP(C115,'دور ثانى'!$A$11:$R$170,2,0)","v":"عبدالغني عثمان عمر ورسمة"},{"$f":"VLOOKUP(C115,'دور ثانى'!$A$11:$R$170,3,0)","v":"10 - 6"},{"$f":"VLOOKUP(C115,'دور ثانى'!$A$11:$R$170,18,0)","v":"الحوسبة وتكنولوجيا المعلومات / الأحياء / اللغة العربية / اللغة الإنجليزية / "}]
[null,null,112,{"$f":"VLOOKUP(C116,'دور ثانى'!$A$11:$R$170,1,0)","v":112},{"$f":"VLOOKUP(C116,'دور ثانى'!$A$11:$R$170,2,0)","v":"عبدالله جاسم على محمد القايد"},{"$f":"VLOOKUP(C116,'دور ثانى'!$A$11:$R$170,3,0)","v":"10 - 6"},{"$f":"VLOOKUP(C116,'دور ثانى'!$A$11:$R$170,18,0)","v":"الحوسبة وتكنولوجيا المعلومات / الأحياء / "}]
[null,null,113,{"$f":"VLOOKUP(C117,'دور ثانى'!$A$11:$R$170,1,0)","v":113},{"$f":"VLOOKUP(C117,'دور ثانى'!$A$11:$R$170,2,0)","v":"عبدالله محماس غزاى المقاطى العتيبى"},{"$f":"VLOOKUP(C117,'دور ثانى'!$A$11:$R$170,3,0)","v":"10 - 6"},{"$f":"VLOOKUP(C117,'دور ثانى'!$A$11:$R$170,18,0)","v":"الرياضيات / الدراسات الاجتماعية / الحوسبة وتكنولوجيا المعلومات / الأحياء / التربية الإسلامية / اللغة الإنجليزية / "}]
[null,null,114,{"$f":"VLOOKUP(C118,'دور ثانى'!$A$11:$R$170,1,0)","v":114},{"$f":"VLOOKUP(C118,'دور ثانى'!$A$11:$R$170,2,0)","v":"عبدالله ناصر عبده السعدى اليافعى"},{"$f":"VLOOKUP(C118,'دور ثانى'!$A$11:$R$170,3,0)","v":"10 - 6"},{"$f":"VLOOKUP(C118,'دور ثانى'!$A$11:$R$170,18,0)","v":"الحوسبة وتكنولوجيا المعلومات / "}]
[null,null,115,{"$f":"VLOOKUP(C119,'دور ثانى'!$A$11:$R$170,1,0)","v":115},{"$f":"VLOOKUP(C119,'دور ثانى'!$A$11:$R$170,2,0)","v":"على فهد على شفيع الفهيده"},{"$f":"VLOOKUP(C119,'دور ثانى'!$A$11:$R$170,3,0)","v":"10 - 6"},{"$f":"VLOOKUP(C119,'دور ثانى'!$A$11:$R$170,18,0)","v":"الحوسبة وتكنولوجيا المعلومات / الكيمياء / "}]
[null,null,116,{"$f":"VLOOKUP(C120,'دور ثانى'!$A$11:$R$170,1,0)","v":116},{"$f":"VLOOKUP(C120,'دور ثانى'!$A$11:$R$170,2,0)","v":"فارس وليد محي الدين"},{"$f":"VLOOKUP(C120,'دور ثانى'!$A$11:$R$170,3,0)","v":"10 - 6"},{"$f":"VLOOKUP(C120,'دور ثانى'!$A$11:$R$170,18,0)","v":"الدراسات الاجتماعية / الأحياء / "}]
[null,null,117,{"$f":"VLOOKUP(C121,'دور ثانى'!$A$11:$R$170,1,0)","v":117},{"$f":"VLOOKUP(C121,'دور ثانى'!$A$11:$R$170,2,0)","v":"قطبى ياسر القطبي ادريس"},{"$f":"VLOOKUP(C121,'دور ثانى'!$A$11:$R$170,3,0)","v":"10 - 6"},{"$f":"VLOOKUP(C121,'دور ثانى'!$A$11:$R$170,18,0)","v":"الرياضيات / الدراسات الاجتماعية / الحوسبة وتكنولوجيا المعلومات / الكيمياء / الفيزياء / الأحياء / التربية الإسلامية / اللغة العربية / اللغة الإنجليزية / "}]
[null,null,118,{"$f":"VLOOKUP(C122,'دور ثانى'!$A$11:$R$170,1,0)","v":118},{"$f":"VLOOKUP(C122,'دور ثانى'!$A$11:$R$170,2,0)","v":"محمد جابر حسين على الجرحب"},{"$f":"VLOOKUP(C122,'دور ثانى'!$A$11:$R$170,3,0)","v":"10 - 6"},{"$f":"VLOOKUP(C122,'دور ثانى'!$A$11:$R$170,18,0)","v":"الكيمياء / اللغة الإنجليزية / "}]
[null,null,119,{"$f":"VLOOKUP(C123,'دور ثانى'!$A$11:$R$170,1,0)","v":119},{"$f":"VLOOKUP(C123,'دور ثانى'!$A$11:$R$170,2,0)","v":"محمد على سالم حمد جبران"},{"$f":"VLOOKUP(C123,'دور ثانى'!$A$11:$R$170,3,0)","v":"10 - 6"},{"$f":"VLOOKUP(C123,'دور ثانى'!$A$11:$R$170,18,0)","v":"الرياضيات / الدراسات الاجتماعية / الحوسبة وتكنولوجيا المعلومات / الكيمياء / الأحياء / اللغة العربية / اللغة الإنجليزية / "}]
[null,null,120,{"$f":"VLOOKUP(C124,'دور ثانى'!$A$11:$R$170,1,0)","v":120},{"$f":"VLOOKUP(C124,'دور ثانى'!$A$11:$R$170,2,0)","v":"مشعل عبدالرحمن عبدالله عبدالعزيز الاسحاق"},{"$f":"VLOOKUP(C124,'دور ثانى'!$A$11:$R$170,3,0)","v":"10 - 6"},{"$f":"VLOOKUP(C124,'دور ثانى'!$A$11:$R$170,18,0)","v":"الفيزياء / الأحياء / "}]
[null,null,121,{"$f":"VLOOKUP(C125,'دور ثانى'!$A$11:$R$170,1,0)","v":121},{"$f":"VLOOKUP(C125,'دور ثانى'!$A$11:$R$170,2,0)","v":"مصطفى محمد مصطفى العبيد احمد"},{"$f":"VLOOKUP(C125,'دور ثانى'!$A$11:$R$170,3,0)","v":"10 - 6"},{"$f":"VLOOKUP(C125,'دور ثانى'!$A$11:$R$170,18,0)","v":"اللغة الإنجليزية / "}]
[null,null,122,{"$f":"VLOOKUP(C126,'دور ثانى'!$A$11:$R$170,1,0)","v":122},{"$f":"VLOOKUP(C126,'دور ثانى'!$A$11:$R$170,2,0)","v":"نايف حسن احمد الحيى النعيمى"},{"$f":"VLOOKUP(C126,'دور ثانى'!$A$11:$R$170,3,0)","v":"10 - 6"},{"$f":"VLOOKUP(C126,'دور ثانى'!$A$11:$R$170,18,0)","v":"الرياضيات / الدراسات الاجتماعية / الحوسبة وتكنولوجيا المعلومات / الكيمياء / الفيزياء / الأحياء / اللغة الإنجليزية / "}]
[null,null,123,{"$f":"VLOOKUP(C127,'دور ثانى'!$A$11:$R$170,1,0)","v":123},{"$f":"VLOOKUP(C127,'دور ثانى'!$A$11:$R$170,2,0)","v":"نواف على هادى الجربوعى المرى"},{"$f":"VLOOKUP(C127,'دور ثانى'!$A$11:$R$170,3,0)","v":"10 - 6"},{"$f":"VLOOKUP(C127,'دور ثانى'!$A$11:$R$170,18,0)","v":"الدراسات الاجتماعية / الحوسبة وتكنولوجيا المعلومات / اللغة العربية / اللغة الإنجليزية / "}]
[null,null,124,{"$f":"VLOOKUP(C128,'دور ثانى'!$A$11:$R$170,1,0)","v":124},{"$f":"VLOOKUP(C128,'دور ثانى'!$A$11:$R$170,2,0)","v":"يوسف خالد ناصر عبدالكريم مثنى"},{"$f":"VLOOKUP(C128,'دور ثانى'!$A$11:$R$170,3,0)","v":"10 - 6"},{"$f":"VLOOKUP(C128,'دور ثانى'!$A$11:$R$170,18,0)","v":"الرياضيات / الدراسات الاجتماعية / الحوسبة وتكنولوجيا المعلومات / الكيمياء / الأحياء / اللغة العربية / اللغة الإنجليزية / "}]
[null,null,125,{"$f":"VLOOKUP(C129,'دور ثانى'!$A$11:$R$170,1,0)","v":125},{"$f":"VLOOKUP(C129,'دور ثانى'!$A$11:$R$170,2,0)","v":"بلال ابراهيم"},{"$f":"VLOOKUP(C129,'دور ثانى'!$A$11:$R$170,3,0)","v":"10 - 7"},{"$f":"VLOOKUP(C129,'دور ثانى'!$A$11:$R$170,18,0)","v":"الرياضيات / الدراسات الاجتماعية / الحوسبة وتكنولوجيا المعلومات / الكيمياء / الفيزياء / الأحياء / التربية الإسلامية / اللغة العربية / اللغة الإنجليزية / "}]
[null,null,126,{"$f":"VLOOKUP(C130,'دور ثانى'!$A$11:$R$170,1,0)","v":126},{"$f":"VLOOKUP(C130,'دور ثانى'!$A$11:$R$170,2,0)","v":"تركى مبارك تركى سعد التركى"},{"$f":"VLOOKUP(C130,'دور ثانى'!$A$11:$R$170,3,0)","v":"10 - 7"},{"$f":"VLOOKUP(C130,'دور ثانى'!$A$11:$R$170,18,0)","v":"الرياضيات / الحوسبة وتكنولوجيا المعلومات / الكيمياء / اللغة الإنجليزية / "}]
[null,null,127,{"$f":"VLOOKUP(C131,'دور ثانى'!$A$11:$R$170,1,0)","v":127},{"$f":"VLOOKUP(C131,'دور ثانى'!$A$11:$R$170,2,0)","v":"تميم على يوسف محمد الحمادى"},{"$f":"VLOOKUP(C131,'دور ثانى'!$A$11:$R$170,3,0)","v":"10 - 7"},{"$f":"VLOOKUP(C131,'دور ثانى'!$A$11:$R$170,18,0)","v":"الرياضيات / الدراسات الاجتماعية / الكيمياء / التربية الإسلامية / اللغة العربية / اللغة الإنجليزية / "}]
[null,null,128,{"$f":"VLOOKUP(C132,'دور ثانى'!$A$11:$R$170,1,0)","v":128},{"$f":"VLOOKUP(C132,'دور ثانى'!$A$11:$R$170,2,0)","v":"جاسم حسين جاسم على بوكربل"},{"$f":"VLOOKUP(C132,'دور ثانى'!$A$11:$R$170,3,0)","v":"10 - 7"},{"$f":"VLOOKUP(C132,'دور ثانى'!$A$11:$R$170,18,0)","v":"الدراسات الاجتماعية / "}]
[null,null,129,{"$f":"VLOOKUP(C133,'دور ثانى'!$A$11:$R$170,1,0)","v":129},{"$f":"VLOOKUP(C133,'دور ثانى'!$A$11:$R$170,2,0)","v":"جاسم محمد فرج البريص المري"},{"$f":"VLOOKUP(C133,'دور ثانى'!$A$11:$R$170,3,0)","v":"10 - 7"},{"$f":"VLOOKUP(C133,'دور ثانى'!$A$11:$R$170,18,0)","v":"الرياضيات / الدراسات الاجتماعية / الحوسبة وتكنولوجيا المعلومات / الكيمياء / الأحياء / اللغة الإنجليزية / "}]
[null,null,{"$f":"ROW()-4","v":130},{"$f":"VLOOKUP(C134,'دور ثانى'!$A$11:$R$170,1,0)","v":130},{"$f":"VLOOKUP(C134,'دور ثانى'!$A$11:$R$170,2,0)","v":"خالد ناصر محمد اللواء المرى"},{"$f":"VLOOKUP(C134,'دور ثانى'!$A$11:$R$170,3,0)","v":"10 - 7"},{"$f":"VLOOKUP(C134,'دور ثانى'!$A$11:$R$170,18,0)","v":"الرياضيات / الدراسات الاجتماعية / الأحياء / التربية الإسلامية / اللغة العربية / "}]
[null,null,131,{"$f":"VLOOKUP(C135,'دور ثانى'!$A$11:$R$170,1,0)","v":131},{"$f":"VLOOKUP(C135,'دور ثانى'!$A$11:$R$170,2,0)","v":"سالم عبدالله سالم سعيد خوار"},{"$f":"VLOOKUP(C135,'دور ثانى'!$A$11:$R$170,3,0)","v":"10 - 7"},{"$f":"VLOOKUP(C135,'دور ثانى'!$A$11:$R$170,18,0)","v":"الأحياء / التربية الإسلامية / اللغة العربية / اللغة الإنجليزية / "}]
[null,null,132,{"$f":"VLOOKUP(C136,'دور ثانى'!$A$11:$R$170,1,0)","v":132},{"$f":"VLOOKUP(C136,'دور ثانى'!$A$11:$R$170,2,0)","v":"سعد مبارك تركى سعد التركى"},{"$f":"VLOOKUP(C136,'دور ثانى'!$A$11:$R$170,3,0)","v":"10 - 7"},{"$f":"VLOOKUP(C136,'دور ثانى'!$A$11:$R$170,18,0)","v":"الرياضيات / الحوسبة وتكنولوجيا المعلومات / الكيمياء / الأحياء / اللغة الإنجليزية / "}]
[null,null,133,{"$f":"VLOOKUP(C137,'دور ثانى'!$A$11:$R$170,1,0)","v":133},{"$f":"VLOOKUP(C137,'دور ثانى'!$A$11:$R$170,2,0)","v":"سعود خالد محمود بومحمود الشيخ"},{"$f":"VLOOKUP(C137,'دور ثانى'!$A$11:$R$170,3,0)","v":"10 - 7"},{"$f":"VLOOKUP(C137,'دور ثانى'!$A$11:$R$170,18,0)","v":"الدراسات الاجتماعية / الفيزياء / "}]
[null,null,134,{"$f":"VLOOKUP(C138,'دور ثانى'!$A$11:$R$170,1,0)","v":134},{"$f":"VLOOKUP(C138,'دور ثانى'!$A$11:$R$170,2,0)","v":"سلطان سعيد سالم غلفيص النابت"},{"$f":"VLOOKUP(C138,'دور ثانى'!$A$11:$R$170,3,0)","v":"10 - 7"},{"$f":"VLOOKUP(C138,'دور ثانى'!$A$11:$R$170,18,0)","v":"الرياضيات / الدراسات الاجتماعية / الكيمياء / الفيزياء / الأحياء / التربية الإسلامية / اللغة الإنجليزية / "}]
[null,null,135,{"$f":"VLOOKUP(C139,'دور ثانى'!$A$11:$R$170,1,0)","v":135},{"$f":"VLOOKUP(C139,'دور ثانى'!$A$11:$R$170,2,0)","v":"عبدالرحمن عبدالحميد محمد صالح العمودى"},{"$f":"VLOOKUP(C139,'دور ثانى'!$A$11:$R$170,3,0)","v":"10 - 7"},{"$f":"VLOOKUP(C139,'دور ثانى'!$A$11:$R$170,18,0)","v":"الرياضيات / الحوسبة وتكنولوجيا المعلومات / الكيمياء / الأحياء / اللغة العربية / اللغة الإنجليزية / "}]
[null,null,136,{"$f":"VLOOKUP(C140,'دور ثانى'!$A$11:$R$170,1,0)","v":136},{"$f":"VLOOKUP(C140,'دور ثانى'!$A$11:$R$170,2,0)","v":"عبدالله راشد محسن حزام انديله"},{"$f":"VLOOKUP(C140,'دور ثانى'!$A$11:$R$170,3,0)","v":"10 - 7"},{"$f":"VLOOKUP(C140,'دور ثانى'!$A$11:$R$170,18,0)","v":"الأحياء / اللغة الإنجليزية / "}]
[null,null,137,{"$f":"VLOOKUP(C141,'دور ثانى'!$A$11:$R$170,1,0)","v":137},{"$f":"VLOOKUP(C141,'دور ثانى'!$A$11:$R$170,2,0)","v":"على ناصر على ال مشروم المرى"},{"$f":"VLOOKUP(C141,'دور ثانى'!$A$11:$R$170,3,0)","v":"10 - 7"},{"$f":"VLOOKUP(C141,'دور ثانى'!$A$11:$R$170,18,0)","v":"اللغة العربية / "}]
[null,null,138,{"$f":"VLOOKUP(C142,'دور ثانى'!$A$11:$R$170,1,0)","v":138},{"$f":"VLOOKUP(C142,'دور ثانى'!$A$11:$R$170,2,0)","v":"عمر عصام الدين محي حسن"},{"$f":"VLOOKUP(C142,'دور ثانى'!$A$11:$R$170,3,0)","v":"10 - 7"},{"$f":"VLOOKUP(C142,'دور ثانى'!$A$11:$R$170,18,0)","v":"الرياضيات / الدراسات الاجتماعية / الحوسبة وتكنولوجيا المعلومات / الكيمياء / الفيزياء / الأحياء / التربية الإسلامية / اللغة العربية / اللغة الإنجليزية / "}]
[null,null,139,{"$f":"VLOOKUP(C143,'دور ثانى'!$A$11:$R$170,1,0)","v":139},{"$f":"VLOOKUP(C143,'دور ثانى'!$A$11:$R$170,2,0)","v":"عيسى محمد عبد الله عامرى"},{"$f":"VLOOKUP(C143,'دور ثانى'!$A$11:$R$170,3,0)","v":"10 - 7"},{"$f":"VLOOKUP(C143,'دور ثانى'!$A$11:$R$170,18,0)","v":"الرياضيات / "}]
[null,null,140,{"$f":"VLOOKUP(C144,'دور ثانى'!$A$11:$R$170,1,0)","v":140},{"$f":"VLOOKUP(C144,'دور ثانى'!$A$11:$R$170,2,0)","v":"فارس سالم حسن سالم الكثيرى"},{"$f":"VLOOKUP(C144,'دور ثانى'!$A$11:$R$170,3,0)","v":"10 - 7"},{"$f":"VLOOKUP(C144,'دور ثانى'!$A$11:$R$170,18,0)","v":"الأحياء / "}]
[null,null,141,{"$f":"VLOOKUP(C145,'دور ثانى'!$A$11:$R$170,1,0)","v":141},{"$f":"VLOOKUP(C145,'دور ثانى'!$A$11:$R$170,2,0)","v":"فهد ابوبكر محمد مبخوت الصيعرى"},{"$f":"VLOOKUP(C145,'دور ثانى'!$A$11:$R$170,3,0)","v":"10 - 7"},{"$f":"VLOOKUP(C145,'دور ثانى'!$A$11:$R$170,18,0)","v":"الرياضيات / الدراسات الاجتماعية / الحوسبة وتكنولوجيا المعلومات / الكيمياء / الأحياء / التربية الإسلامية / اللغة العربية / اللغة الإنجليزية / "}]
[null,null,142,{"$f":"VLOOKUP(C146,'دور ثانى'!$A$11:$R$170,1,0)","v":142},{"$f":"VLOOKUP(C146,'دور ثانى'!$A$11:$R$170,2,0)","v":"مبارك سالم مبارك النابت المرى"},{"$f":"VLOOKUP(C146,'دور ثانى'!$A$11:$R$170,3,0)","v":"10 - 7"},{"$f":"VLOOKUP(C146,'دور ثانى'!$A$11:$R$170,18,0)","v":"الرياضيات / الحوسبة وتكنولوجيا المعلومات / الأحياء / اللغة العربية / اللغة الإنجليزية / "}]
[null,null,143,{"$f":"VLOOKUP(C147,'دور ثانى'!$A$11:$R$170,1,0)","v":143},{"$f":"VLOOKUP(C147,'دور ثانى'!$A$11:$R$170,2,0)","v":"محمد احمد جمعه احمد السبيعى"},{"$f":"VLOOKUP(C147,'دور ثانى'!$A$11:$R$170,3,0)","v":"10 - 7"},{"$f":"VLOOKUP(C147,'دور ثانى'!$A$11:$R$170,18,0)","v":"الدراسات الاجتماعية / الكيمياء / التربية الإسلامية / "}]
[null,null,144,{"$f":"VLOOKUP(C148,'دور ثانى'!$A$11:$R$170,1,0)","v":144},{"$f":"VLOOKUP(C148,'دور ثانى'!$A$11:$R$170,2,0)","v":"محمد بدرالدين ميرغنى ادم على"},{"$f":"VLOOKUP(C148,'دور ثانى'!$A$11:$R$170,3,0)","v":"10 - 7"},{"$f":"VLOOKUP(C148,'دور ثانى'!$A$11:$R$170,18,0)","v":"الرياضيات / الدراسات الاجتماعية / الفيزياء / الأحياء / "}]
[null,null,145,{"$f":"VLOOKUP(C149,'دور ثانى'!$A$11:$R$170,1,0)","v":145},{"$f":"VLOOKUP(C149,'دور ثانى'!$A$11:$R$170,2,0)","v":"محمد راشد سالم صالح لحيمر"},{"$f":"VLOOKUP(C149,'دور ثانى'!$A$11:$R$170,3,0)","v":"10 - 7"},{"$f":"VLOOKUP(C149,'دور ثانى'!$A$11:$R$170,18,0)","v":"الرياضيات / الفيزياء / "}]
[null,null,146,{"$f":"VLOOKUP(C150,'دور ثانى'!$A$11:$R$170,1,0)","v":146},{"$f":"VLOOKUP(C150,'دور ثانى'!$A$11:$R$170,2,0)","v":"محمد رائد عبدالرحيم"},{"$f":"VLOOKUP(C150,'دور ثانى'!$A$11:$R$170,3,0)","v":"10 - 7"},{"$f":"VLOOKUP(C150,'دور ثانى'!$A$11:$R$170,18,0)","v":"الرياضيات / الفيزياء / الأحياء / "}]
[null,null,147,{"$f":"VLOOKUP(C151,'دور ثانى'!$A$11:$R$170,1,0)","v":147},{"$f":"VLOOKUP(C151,'دور ثانى'!$A$11:$R$170,2,0)","v":"محمد عادل عبدالله محمد الخورى"},{"$f":"VLOOKUP(C151,'دور ثانى'!$A$11:$R$170,3,0)","v":"10 - 7"},{"$f":"VLOOKUP(C151,'دور ثانى'!$A$11:$R$170,18,0)","v":"الرياضيات / الدراسات الاجتماعية / الحوسبة وتكنولوجيا المعلومات / الفيزياء / الأحياء / اللغة العربية / اللغة الإنجليزية / "}]
[null,null,148,{"$f":"VLOOKUP(C152,'دور ثانى'!$A$11:$R$170,1,0)","v":148},{"$f":"VLOOKUP(C152,'دور ثانى'!$A$11:$R$170,2,0)","v":"محمد عبدالله محمد امين ابراهيم"},{"$f":"VLOOKUP(C152,'دور ثانى'!$A$11:$R$170,3,0)","v":"10 - 7"},{"$f":"VLOOKUP(C152,'دور ثانى'!$A$11:$R$170,18,0)","v":"الدراسات الاجتماعية / "}]
[null,null,149,{"$f":"VLOOKUP(C153,'دور ثانى'!$A$11:$R$170,1,0)","v":149},{"$f":"VLOOKUP(C153,'دور ثانى'!$A$11:$R$170,2,0)","v":"مشعل خالد احمد سليمان الهيل"},{"$f":"VLOOKUP(C153,'دور ثانى'!$A$11:$R$170,3,0)","v":"10 - 7"},{"$f":"VLOOKUP(C153,'دور ثانى'!$A$11:$R$170,18,0)","v":"الأحياء / "}]
[null,null,150,{"$f":"VLOOKUP(C154,'دور ثانى'!$A$11:$R$170,1,0)","v":150},{"$f":"VLOOKUP(C154,'دور ثانى'!$A$11:$R$170,2,0)","v":"ناصر راشد على العلى المعاضيد"},{"$f":"VLOOKUP(C154,'دور ثانى'!$A$11:$R$170,3,0)","v":"10 - 7"},{"$f":"VLOOKUP(C154,'دور ثانى'!$A$11:$R$170,18,0)","v":"الرياضيات / الدراسات الاجتماعية / الأحياء / التربية الإسلامية / اللغة العربية / اللغة الإنجليزية / "}]
[null,null,151,{"$f":"VLOOKUP(C155,'دور ثانى'!$A$11:$R$170,1,0)","v":151},{"$f":"VLOOKUP(C155,'دور ثانى'!$A$11:$R$170,2,0)","v":"نايف على هادف انديله الحسناء"},{"$f":"VLOOKUP(C155,'دور ثانى'!$A$11:$R$170,3,0)","v":"10 - 7"},{"$f":"VLOOKUP(C155,'دور ثانى'!$A$11:$R$170,18,0)","v":"الرياضيات / الدراسات الاجتماعية / الحوسبة وتكنولوجيا المعلومات / الكيمياء / الأحياء / التربية الإسلامية / اللغة الإنجليزية / "}]

{"sheet":"الغائبين عن الاختبار","index":5,"n_rows":31,"n_cols":5,"rows_kept":31,"cut":false,"hidden":false,"merged":[[4,1,5,1],[4,2,5,2],[4,3,5,3],[31,2,31,3],[1,2,1,3]]}
[]
[]
[]
[]
[null,"م","رقم الجلوس","اسم الطالب","الدرجة"]
[null,null,null,null,30]
[null,1,{"$f":"IF($B7=\"\",\"\",INDEX(شيت!A$11:A$247,SMALL(IF(شيت!$D$11:$D$247=\"غ\",ROW($10:$59)-13),$B7)))","v":{"$error":"#N/A"}},{"$f":"IF($B7=\"\",\"\",INDEX(شيت!B$11:B$247,SMALL(IF(شيت!$D$11:$D$247=\"غ\",ROW($10:$59)-13),$B7)))","v":{"$error":"#N/A"}}]
[null,{"$f":"IF(ROW($B2)<=COUNTIF(شيت!$D$11:$D$60,\"غ\"),ROW($B2),\"\")","v":2},{"$f":"IF($B8=\"\",\"\",INDEX(شيت!A$11:A$247,SMALL(IF(شيت!$D$11:$D$247=\"غ\",ROW($10:$59)-13),$B8)))","v":{"$error":"#N/A"}},{"$f":"IF($B8=\"\",\"\",INDEX(شيت!B$11:B$247,SMALL(IF(شيت!$D$11:$D$247=\"غ\",ROW($10:$59)-13),$B8)))","v":{"$error":"#N/A"}}]
[null,{"$f":"IF(ROW($B3)<=COUNTIF(شيت!$D$11:$D$60,\"غ\"),ROW($B3),\"\")","v":3},{"$f":"IF($B9=\"\",\"\",INDEX(شيت!A$11:A$247,SMALL(IF(شيت!$D$11:$D$247=\"غ\",ROW($10:$59)-13),$B9)))","v":{"$error":"#N/A"}},{"$f":"IF($B9=\"\",\"\",INDEX(شيت!B$11:B$247,SMALL(IF(شيت!$D$11:$D$247=\"غ\",ROW($10:$59)-13),$B9)))","v":{"$error":"#N/A"}}]
[null,{"$f":"IF(ROW($B4)<=COUNTIF(شيت!$D$11:$D$60,\"غ\"),ROW($B4),\"\")","v":""},{"$f":"IF($B10=\"\",\"\",INDEX(شيت!A$11:A$247,SMALL(IF(شيت!$D$11:$D$247=\"غ\",ROW($10:$59)-13),$B10)))","v":""},{"$f":"IF($B10=\"\",\"\",INDEX(شيت!B$11:B$247,SMALL(IF(شيت!$D$11:$D$247=\"غ\",ROW($10:$59)-13),$B10)))","v":""}]
[null,{"$f":"IF(ROW($B5)<=COUNTIF(شيت!$D$11:$D$60,\"غ\"),ROW($B5),\"\")","v":""},{"$f":"IF($B11=\"\",\"\",INDEX(شيت!A$11:A$247,SMALL(IF(شيت!$D$11:$D$247=\"غ\",ROW($10:$59)-13),$B11)))","v":""},{"$f":"IF($B11=\"\",\"\",INDEX(شيت!B$11:B$247,SMALL(IF(شيت!$D$11:$D$247=\"غ\",ROW($10:$59)-13),$B11)))","v":""}]
[null,{"$f":"IF(ROW($B6)<=COUNTIF(شيت!$D$11:$D$60,\"غ\"),ROW($B6),\"\")","v":""},{"$f":"IF($B12=\"\",\"\",INDEX(شيت!A$11:A$247,SMALL(IF(شيت!$D$11:$D$247=\"غ\",ROW($10:$59)-13),$B12)))","v":""},{"$f":"IF($B12=\"\",\"\",INDEX(شيت!B$11:B$247,SMALL(IF(شيت!$D$11:$D$247=\"غ\",ROW($10:$59)-13),$B12)))","v":""}]
[null,{"$f":"IF(ROW($B7)<=COUNTIF(شيت!$D$11:$D$60,\"غ\"),ROW($B7),\"\")","v":""},{"$f":"IF($B13=\"\",\"\",INDEX(شيت!A$11:A$247,SMALL(IF(شيت!$D$11:$D$247=\"غ\",ROW($10:$59)-13),$B13)))","v":""},{"$f":"IF($B13=\"\",\"\",INDEX(شيت!B$11:B$247,SMALL(IF(شيت!$D$11:$D$247=\"غ\",ROW($10:$59)-13),$B13)))","v":""}]
[null,{"$f":"IF(ROW($B8)<=COUNTIF(شيت!$D$11:$D$60,\"غ\"),ROW($B8),\"\")","v":""},{"$f":"IF($B14=\"\",\"\",INDEX(شيت!A$11:A$247,SMALL(IF(شيت!$D$11:$D$247=\"غ\",ROW($10:$59)-13),$B14)))","v":""},{"$f":"IF($B14=\"\",\"\",INDEX(شيت!B$11:B$247,SMALL(IF(شيت!$D$11:$D$247=\"غ\",ROW($10:$59)-13),$B14)))","v":""}]
[null,{"$f":"IF(ROW($B9)<=COUNTIF(شيت!$D$11:$D$60,\"غ\"),ROW($B9),\"\")","v":""},{"$f":"IF($B15=\"\",\"\",INDEX(شيت!A$11:A$247,SMALL(IF(شيت!$D$11:$D$247=\"غ\",ROW($10:$59)-13),$B15)))","v":""},{"$f":"IF($B15=\"\",\"\",INDEX(شيت!B$11:B$247,SMALL(IF(شيت!$D$11:$D$247=\"غ\",ROW($10:$59)-13),$B15)))","v":""}]
[null,{"$f":"IF(ROW($B10)<=COUNTIF(شيت!$D$11:$D$60,\"غ\"),ROW($B10),\"\")","v":""},{"$f":"IF($B16=\"\",\"\",INDEX(شيت!A$11:A$247,SMALL(IF(شيت!$D$11:$D$247=\"غ\",ROW($10:$59)-13),$B16)))","v":""},{"$f":"IF($B16=\"\",\"\",INDEX(شيت!B$11:B$247,SMALL(IF(شيت!$D$11:$D$247=\"غ\",ROW($10:$59)-13),$B16)))","v":""}]
[null,{"$f":"IF(ROW($B11)<=COUNTIF(شيت!$D$11:$D$60,\"غ\"),ROW($B11),\"\")","v":""},{"$f":"IF($B17=\"\",\"\",INDEX(شيت!A$11:A$247,SMALL(IF(شيت!$D$11:$D$247=\"غ\",ROW($10:$59)-13),$B17)))","v":""},{"$f":"IF($B17=\"\",\"\",INDEX(شيت!B$11:B$247,SMALL(IF(شيت!$D$11:$D$247=\"غ\",ROW($10:$59)-13),$B17)))","v":""}]
[null,{"$f":"IF(ROW($B12)<=COUNTIF(شيت!$D$11:$D$60,\"غ\"),ROW($B12),\"\")","v":""},{"$f":"IF($B18=\"\",\"\",INDEX(شيت!A$11:A$247,SMALL(IF(شيت!$D$11:$D$247=\"غ\",ROW($10:$59)-13),$B18)))","v":""},{"$f":"IF($B18=\"\",\"\",INDEX(شيت!B$11:B$247,SMALL(IF(شيت!$D$11:$D$247=\"غ\",ROW($10:$59)-13),$B18)))","v":""}]
[null,{"$f":"IF(ROW($B13)<=COUNTIF(شيت!$D$11:$D$60,\"غ\"),ROW($B13),\"\")","v":""},{"$f":"IF($B19=\"\",\"\",INDEX(شيت!A$11:A$247,SMALL(IF(شيت!$D$11:$D$247=\"غ\",ROW($10:$59)-13),$B19)))","v":""},{"$f":"IF($B19=\"\",\"\",INDEX(شيت!B$11:B$247,SMALL(IF(شيت!$D$11:$D$247=\"غ\",ROW($10:$59)-13),$B19)))","v":""}]
[null,{"$f":"IF(ROW($B14)<=COUNTIF(شيت!$D$11:$D$60,\"غ\"),ROW($B14),\"\")","v":""},{"$f":"IF($B20=\"\",\"\",INDEX(شيت!A$11:A$247,SMALL(IF(شيت!$D$11:$D$247=\"غ\",ROW($10:$59)-13),$B20)))","v":""},{"$f":"IF($B20=\"\",\"\",INDEX(شيت!B$11:B$247,SMALL(IF(شيت!$D$11:$D$247=\"غ\",ROW($10:$59)-13),$B20)))","v":""}]
[null,{"$f":"IF(ROW($B15)<=COUNTIF(شيت!$D$11:$D$60,\"غ\"),ROW($B15),\"\")","v":""},{"$f":"IF($B21=\"\",\"\",INDEX(شيت!A$11:A$247,SMALL(IF(شيت!$D$11:$D$247=\"غ\",ROW($10:$59)-13),$B21)))","v":""},{"$f":"IF($B21=\"\",\"\",INDEX(شيت!B$11:B$247,SMALL(IF(شيت!$D$11:$D$247=\"غ\",ROW($10:$59)-13),$B21)))","v":""}]
[null,{"$f":"IF(ROW($B16)<=COUNTIF(شيت!$D$11:$D$60,\"غ\"),ROW($B16),\"\")","v":""},{"$f":"IF($B22=\"\",\"\",INDEX(شيت!A$11:A$247,SMALL(IF(شيت!$D$11:$D$247=\"غ\",ROW($10:$59)-13),$B22)))","v":""},{"$f":"IF($B22=\"\",\"\",INDEX(شيت!B$11:B$247,SMALL(IF(شيت!$D$11:$D$247=\"غ\",ROW($10:$59)-13),$B22)))","v":""}]
[null,{"$f":"IF(ROW($B17)<=COUNTIF(شيت!$D$11:$D$60,\"غ\"),ROW($B17),\"\")","v":""},{"$f":"IF($B23=\"\",\"\",INDEX(شيت!A$11:A$247,SMALL(IF(شيت!$D$11:$D$247=\"غ\",ROW($10:$59)-13),$B23)))","v":""},{"$f":"IF($B23=\"\",\"\",INDEX(شيت!B$11:B$247,SMALL(IF(شيت!$D$11:$D$247=\"غ\",ROW($10:$59)-13),$B23)))","v":""}]
[null,{"$f":"IF(ROW($B18)<=COUNTIF(شيت!$D$11:$D$60,\"غ\"),ROW($B18),\"\")","v":""},{"$f":"IF($B24=\"\",\"\",INDEX(شيت!A$11:A$247,SMALL(IF(شيت!$D$11:$D$247=\"غ\",ROW($10:$59)-13),$B24)))","v":""},{"$f":"IF($B24=\"\",\"\",INDEX(شيت!B$11:B$247,SMALL(IF(شيت!$D$11:$D$247=\"غ\",ROW($10:$59)-13),$B24)))","v":""}]
[null,{"$f":"IF(ROW($B19)<=COUNTIF(شيت!$D$11:$D$60,\"غ\"),ROW($B19),\"\")","v":""},{"$f":"IF($B25=\"\",\"\",INDEX(شيت!A$11:A$247,SMALL(IF(شيت!$D$11:$D$247=\"غ\",ROW($10:$59)-13),$B25)))","v":""},{"$f":"IF($B25=\"\",\"\",INDEX(شيت!B$11:B$247,SMALL(IF(شيت!$D$11:$D$247=\"غ\",ROW($10:$59)-13),$B25)))","v":""}]
[null,{"$f":"IF(ROW($B20)<=COUNTIF(شيت!$D$11:$D$60,\"غ\"),ROW($B20),\"\")","v":""},{"$f":"IF($B26=\"\",\"\",INDEX(شيت!A$11:A$247,SMALL(IF(شيت!$D$11:$D$247=\"غ\",ROW($10:$59)-13),$B26)))","v":""},{"$f":"IF($B26=\"\",\"\",INDEX(شيت!B$11:B$247,SMALL(IF(شيت!$D$11:$D$247=\"غ\",ROW($10:$59)-13),$B26)))","v":""}]
[null,{"$f":"IF(ROW($B21)<=COUNTIF(شيت!$D$11:$D$60,\"غ\"),ROW($B21),\"\")","v":""},{"$f":"IF($B27=\"\",\"\",INDEX(شيت!A$11:A$247,SMALL(IF(شيت!$D$11:$D$247=\"غ\",ROW($10:$59)-13),$B27)))","v":""},{"$f":"IF($B27=\"\",\"\",INDEX(شيت!B$11:B$247,SMALL(IF(شيت!$D$11:$D$247=\"غ\",ROW($10:$59)-13),$B27)))","v":""}]
[null,{"$f":"IF(ROW($B22)<=COUNTIF(شيت!$D$11:$D$60,\"غ\"),ROW($B22),\"\")","v":""},{"$f":"IF($B28=\"\",\"\",INDEX(شيت!A$11:A$247,SMALL(IF(شيت!$D$11:$D$247=\"غ\",ROW($10:$59)-13),$B28)))","v":""},{"$f":"IF($B28=\"\",\"\",INDEX(شيت!B$11:B$247,SMALL(IF(شيت!$D$11:$D$247=\"غ\",ROW($10:$59)-13),$B28)))","v":""}]
[null,{"$f":"IF(ROW($B23)<=COUNTIF(شيت!$D$11:$D$60,\"غ\"),ROW($B23),\"\")","v":""},{"$f":"IF($B29=\"\",\"\",INDEX(شيت!A$11:A$247,SMALL(IF(شيت!$D$11:$D$247=\"غ\",ROW($10:$59)-13),$B29)))","v":""},{"$f":"IF($B29=\"\",\"\",INDEX(شيت!B$11:B$247,SMALL(IF(شيت!$D$11:$D$247=\"غ\",ROW($10:$59)-13),$B29)))","v":""}]
[null,{"$f":"IF(ROW($B24)<=COUNTIF(شيت!$D$11:$D$60,\"غ\"),ROW($B24),\"\")","v":""},{"$f":"IF($B30=\"\",\"\",INDEX(شيت!A$11:A$247,SMALL(IF(شيت!$D$11:$D$247=\"غ\",ROW($10:$59)-13),$B30)))","v":""},{"$f":"IF($B30=\"\",\"\",INDEX(شيت!B$11:B$247,SMALL(IF(شيت!$D$11:$D$247=\"غ\",ROW($10:$59)-13),$B30)))","v":""}]
[null,{"$f":"IF(ROW($B25)<=COUNTIF(شيت!$D$11:$D$60,\"غ\"),ROW($B25),\"\")","v":""},{"$f":"IF($B31=\"\",\"\",INDEX(شيت!A$11:A$247,SMALL(IF(شيت!$D$11:$D$247=\"غ\",ROW($10:$59)-13),$B31)))","v":""},{"$f":"IF($B31=\"\",\"\",INDEX(شيت!B$11:B$247,SMALL(IF(شيت!$D$11:$D$247=\"غ\",ROW($10:$59)-13),$B31)))","v":""}]

{"sheet":"إحصاء نتيجة الدور الأول جميع ال","index":6,"n_rows":10,"n_cols":19,"rows_kept":10,"cut":false,"hidden":false,"merged":[[1,4,1,7],[1,13,1,16]]}
[]
[null,null,null,null,"إحصاء نتيجة جميع المواد",null,null,null,null,null,null,null,null,"إحصاء نتيجة الراسبين"]
[null,null,"الرياضيات","الدراسات الاجتماعية","الحوسبة وتكنولوجيا المعلومات","الكيمياء","الفيزياء","الأحياء","التربية الإسلامية","اللغة العربية","اللغة الإنجليزية",null,"عدد الطلاب","حاضر","غائب","ناجح","راسب","نسبة الناجحين","نسبة الراسبين"]
[null,"عدد الطلاب",237,237,237,237,237,237,237,237,238,null,237,{"$f":"M4-O4","v":227},{"$f":"COUNTIF(شيت!M11:M247,\"غ\")","v":10},{"$f":"COUNTIF(شيت!N11:N247,\"ناجح\")","v":86},{"$f":"COUNTIF(شيت!N11:N247,\"دور ثانى\")","v":151},{"$f":"P4/M4*100/100","v":0.3628691983122363},{"$f":"Q4/M4*100/100","v":0.6371308016877637}]
[null,"حاضر",{"$f":"C4-C6","v":224},225,221,223,225,227,226,225,{"$f":"K4-K6","v":221}]
[null,"غائب",{"$f":"IF(شيت!B11=\"\",\"\",COUNTIF(شيت!D11:D247,\"غ\"))","v":13},{"$f":"IF(شيت!C11=\"\",\"\",COUNTIF(شيت!E11:E247,\"غ\"))","v":12},{"$f":"IF(شيت!D11=\"\",\"\",COUNTIF(شيت!F11:F247,\"غ\"))","v":16},{"$f":"IF(شيت!E11=\"\",\"\",COUNTIF(شيت!G11:G247,\"غ\"))","v":14},{"$f":"IF(شيت!F11=\"\",\"\",COUNTIF(شيت!H11:H247,\"غ\"))","v":12},{"$f":"IF(شيت!G11=\"\",\"\",COUNTIF(شيت!I11:I247,\"غ\"))","v":10},{"$f":"IF(شيت!H11=\"\",\"\",COUNTIF(شيت!J11:J247,\"غ\"))","v":11},{"$f":"IF(شيت!I11=\"\",\"\",COUNTIF(شيت!K11:K247,\"غ\"))","v":12},{"$f":"IF(شيت!J11=\"\",\"\",COUNTIF(شيت!L11:L247,\"غ\"))","v":17}]
[null,"ناجح",{"$f":"C4-C8","v":154},169,185,155,192,127,188,182,169]
[null,"دور ثان",{"$f":"شيت!T8","v":83},{"$f":"شيت!U8","v":68},{"$f":"شيت!V8","v":52},{"$f":"شيت!W8","v":82},{"$f":"شيت!X8","v":45},{"$f":"شيت!Y8","v":110},{"$f":"شيت!Z8","v":49},{"$f":"شيت!AA8","v":55},{"$f":"شيت!AB8","v":69}]
[null,"نسبة النجاح",{"$f":"C7/C4*100/100","v":0.64978902953586504},0.71308016877637126,0.78059071729957807,0.65400843881856541,0.81012658227848111,0.53586497890295359,0.7932489451476793,0.76793248945147663,0.7100840336134453]
[null,"نسبة الدور الثاني",{"$f":"C8/C4*100/100","v":0.35021097046413502},0.28691983122362869,0.21940928270042195,0.34599156118143459,0.189873417721519,0.46413502109704635,0.20675105485232068,0.23206751054852318,0.28991596638655465]

{"sheet":"الأوائل العشرة","index":7,"n_rows":13,"n_cols":7,"rows_kept":13,"cut":false,"hidden":false,"merged":[[13,1,13,2],[1,1,1,6]]}
[]
[null,"نتيجة العشرة الأوائل "]
[null,"م","رقم الجلوس","اسم الطالب","المجموع","الترتيب","المركـــز"]
[null,1,{"$f":"VLOOKUP(B4,شيت!AV11:BB20,2,0)","v":6},{"$f":"VLOOKUP(C4,شيت!AW11:BC20,2,0)","v":"خالد مصعب خضر عبدالله تايه"},{"$f":"VLOOKUP(D4,شيت!AX11:BD20,2,0)","v":267},{"$f":"VLOOKUP(E4,شيت!AY11:BE20,2,0)","v":1},{"$f":"IF(F4=1,\"الأول\",\" \")","v":"الأول"}]
[null,2,{"$f":"VLOOKUP(B5,شيت!AV12:BB21,2,0)","v":29},{"$f":"VLOOKUP(C5,شيت!AW12:BC21,2,0)","v":"محمود عادل عبدالمحسن محمد"},{"$f":"VLOOKUP(D5,شيت!AX12:BD21,2,0)","v":260},{"$f":"VLOOKUP(E5,شيت!AY12:BE21,2,0)","v":2},{"$f":"IF(F5=F4,G4&\" مكرر \",IF(F5=2,\" الثاني \",\" \"))","v":" الثاني "}]
[null,3,{"$f":"VLOOKUP(B6,شيت!AV13:BB22,2,0)","v":19},{"$f":"VLOOKUP(C6,شيت!AW13:BC22,2,0)","v":"عمر هشام على بحيرى ابوالخير"},{"$f":"VLOOKUP(D6,شيت!AX13:BD22,2,0)","v":259.5},{"$f":"VLOOKUP(E6,شيت!AY13:BE22,2,0)","v":3},{"$f":"IF(F6=F5,G5&\" مكرر  \",IF(F6=3,\" الثالث  \",\" \"))","v":" الثالث  "}]
[null,4,{"$f":"VLOOKUP(B7,شيت!AV14:BB23,2,0)","v":36},{"$f":"VLOOKUP(C7,شيت!AW14:BC23,2,0)","v":"أحمد اقبال ابواصبع"},{"$f":"VLOOKUP(D7,شيت!AX14:BD23,2,0)","v":258.5},{"$f":"VLOOKUP(E7,شيت!AY14:BE23,2,0)","v":4},{"$f":"IF(F7=F6,G6&\"   \"&\" مكرر\",IF(F7=4,\" الرابع  \",\" \"))","v":" الرابع  "}]
[null,5,{"$f":"VLOOKUP(B8,شيت!AV15:BB24,2,0)","v":229},{"$f":"VLOOKUP(C8,شيت!AW15:BC24,2,0)","v":"محمد راشد عبدالمحسن راشد الهميمى"},{"$f":"VLOOKUP(D8,شيت!AX15:BD24,2,0)","v":258},{"$f":"VLOOKUP(E8,شيت!AY15:BE24,2,0)","v":5},{"$f":"IF(F8=F7,G7&\"   \"&\" مكرر\",IF(F8=5,\" الخامس  \",\" \"))","v":" الخامس  "}]
[null,6,{"$f":"VLOOKUP(B9,شيت!AV16:BB25,2,0)","v":26},{"$f":"VLOOKUP(C9,شيت!AW16:BC25,2,0)","v":"محمد عمر عبدالرحيم على"},{"$f":"VLOOKUP(D9,شيت!AX16:BD25,2,0)","v":257.5},{"$f":"VLOOKUP(E9,شيت!AY16:BE25,2,0)","v":6},{"$f":"IF(F9=F8,G8&\"مكرر\",IF(F9=6,\" السادس  \",\" \"))","v":" السادس  "}]
[null,7,{"$f":"VLOOKUP(B10,شيت!AV17:BB26,2,0)","v":27},{"$f":"VLOOKUP(C10,شيت!AW17:BC26,2,0)","v":"محمد عمر فتحى عبدالتواب عبدالمقصود"},{"$f":"VLOOKUP(D10,شيت!AX17:BD26,2,0)","v":257.5},{"$f":"VLOOKUP(E10,شيت!AY17:BE26,2,0)","v":6},{"$f":"IF(F10=F9,G9&\"مكرر\",IF(F10=7,\" السابع  \",\" \"))","v":" السادس  مكرر"}]
[null,8,{"$f":"VLOOKUP(B11,شيت!AV18:BB27,2,0)","v":23},{"$f":"VLOOKUP(C11,شيت!AW18:BC27,2,0)","v":"محمد عبدالله السيد بيومي حسن"},{"$f":"VLOOKUP(D11,شيت!AX18:BD27,2,0)","v":256},{"$f":"VLOOKUP(E11,شيت!AY18:BE27,2,0)","v":8},{"$f":"IF(F11=F10,G10&\"مكرر\",IF(F11=8,\"الثامن\",\" \"))","v":"الثامن"}]
[null,9,{"$f":"VLOOKUP(B12,شيت!AV19:BB28,2,0)","v":20},{"$f":"VLOOKUP(C12,شيت!AW19:BC28,2,0)","v":"فادي عدنان احمد عبدالجليل"},{"$f":"VLOOKUP(D12,شيت!AX19:BD28,2,0)","v":255},{"$f":"VLOOKUP(E12,شيت!AY19:BE28,2,0)","v":9},{"$f":"IF(F12=F11,G11&\"  مكرر\",IF(F12=9,\"التاسع\",\" \"))","v":"التاسع"}]
[null,10,{"$f":"VLOOKUP(B13,شيت!AV20:BB29,2,0)","v":126},{"$f":"VLOOKUP(C13,شيت!AW20:BC29,2,0)","v":"عمر محمد محمود ابوزاهر"},{"$f":"VLOOKUP(D13,شيت!AX20:BD29,2,0)","v":254.5},{"$f":"VLOOKUP(E13,شيت!AY20:BE29,2,0)","v":10},{"$f":"IF(F13=F12,G12&\"  مكرر\",IF(F13=10,\"العاشر\",\" \"))","v":"العاشر"}]