{"text_format":"1","workbook":"xlsx","n_sheets":6,"sheets":["main","ورقة1","most","count","1","ورقة2"],"not_rendered":{"charts":0,"images":0,"macros":1,"external_links":0,"defined_names":2,"comments":0,"pivot_tables":0},"unopened":[],"bounds":{"document_bytes":16777216,"sheet_cells":100000,"rows_first":2000,"rows_last":500,"rows_between":2000,"halvings":0,"cell_chars":16384,"cell_head_chars":4096},"cells_cut":0,"cells_raw":0,"read":"whole","date_system":"1900"}

{"sheet":"main","index":0,"n_rows":256,"n_cols":11,"rows_kept":256,"cut":false,"hidden":false,"merged":[[0,0,1,0],[0,2,1,4],[0,9,1,10]]}
[null,null,"     نظام مخازن المعهد التقني الانبار                ",null,null,{"$f":"SUM(G4:G10003)","v":{"$error":"#REF!"}},{"$f":"TODAY()","v":"2021-11-11"},"المجموع الكلي ","نقطة الطلب","مصطفى جمال العجراوي"]
[null,null,null,null,null,{"$f":"SUM(F4:F10003)","v":{"$error":"#REF!"}},{"$f":"TEXT(G1,\"dddd\")&\" من شهر  \"&TEXT(G1,\"mmmm\")&TEXT(G1,\"yyyy\")","v":"Thursday من شهر  November2021"},{"$f":"SUM(F4:F256)","v":{"$error":"#REF!"}},4]
["الأساسي","الفرعي","نوع المادة","اسم المادة","رقم الورقة","الرصيد ","شراء","اخراج","السعر بالدولار","السعر بالدينار العراقي ","الملاحضات"]
[{"$f":"INDIRECT(\"'\"&E4&\"'!b3\")","v":"أساس"},{"$f":"INDIRECT(\"'\"&E4&\"'!E3\")","v":"فرع"},{"$f":"INDIRECT(\"'\"&E4&\"'!F1\")","v":"ذمم"},{"$f":"INDIRECT(\"'\"&E4&\"'!b1\")","v":"كرسي تجربة"},1,{"$f":"INDIRECT(\"'\"&E4&\"'!K1\")","v":28},{"$f":"INDIRECT(\"'\"&E4&\"'!F4\")","v":33},{"$f":"INDIRECT(\"'\"&E4&\"'!K4\")","v":5},{"$f":"INDIRECT(\"'\"&E4&\"'!d2\")","v":40},{"$f":"INDIRECT(\"'\"&E4&\"'!F2\")","v":50000}]
[{"$f":"INDIRECT(\"'\"&E5&\"'!b3\")","v":{"$error":"#REF!"}},{"$error":"#REF!"},{"$f":"INDIRECT(\"'\"&E5&\"'!F1\")","v":{"$error":"#REF!"}},{"$error":"#REF!"},"1 (2)",{"$error":"#REF!"},{"$error":"#REF!"},{"$error":"#REF!"},{"$error":"#REF!"},{"$error":"#REF!"}]
[{"$error":"#REF!"},{"$error":"#REF!"},{"$f":"INDIRECT(\"'\"&E6&\"'!F1\")","v":{"$error":"#REF!"}},{"$error":"#REF!"},"1 (3)",{"$error":"#REF!"},{"$error":"#REF!"},{"$error":"#REF!"},{"$error":"#REF!"},{"$error":"#REF!"}]
[{"$error":"#REF!"},{"$error":"#REF!"},{"$f":"INDIRECT(\"'\"&E7&\"'!F1\")","v":{"$error":"#REF!"}},{"$error":"#REF!"},"1 (4)",{"$error":"#REF!"},{"$error":"#REF!"},{"$error":"#REF!"},{"$error":"#REF!"},{"$error":"#REF!"}]
[{"$error":"#REF!"},{"$error":"#REF!"},{"$f":"INDIRECT(\"'\"&E8&\"'!F1\")","v":{"$error":"#REF!"}},{"$error":"#REF!"},"1 (5)",{"$error":"#REF!"},{"$error":"#REF!"},{"$error":"#REF!"},{"$error":"#REF!"},{"$error":"#REF!"}]
[{"$error":"#REF!"},{"$error":"#REF!"},{"$f":"INDIRECT(\"'\"&E9&\"'!F1\")","v":{"$error":"#REF!"}},{"$error":"#REF!"},"1 (6)",{"$error":"#REF!"},{"$error":"#REF!"},{"$error":"#REF!"},{"$error":"#REF!"},{"$error":"#REF!"}]
[{"$error":"#REF!"},{"$error":"#REF!"},{"$f":"INDIRECT(\"'\"&E10&\"'!F1\")","v":{"$error":"#REF!"}},{"$error":"#REF!"},"1 (7)",{"$error":"#REF!"},{"$error":"#REF!"},{"$error":"#REF!"},{"$error":"#REF!"},{"$error":"#REF!"}]
[{"$error":"#REF!"},{"$error":"#REF!"},{"$f":"INDIRECT(\"'\"&E11&\"'!F1\")","v":{"$error":"#REF!"}},{"$error":"#REF!"},"1 (8)",{"$error":"#REF!"},{"$error":"#REF!"},{"$error":"#REF!"},{"$error":"#REF!"},{"$error":"#REF!"}]
[{"$error":"#REF!"},{"$error":"#REF!"},{"$f":"INDIRECT(\"'\"&E12&\"'!F1\")","v":{"$error":"#REF!"}},{"$error":"#REF!"},"1 (9)",{"$error":"#REF!"},{"$error":"#REF!"},{"$error":"#REF!"},{"$error":"#REF!"},{"$error":"#REF!"}]
[{"$error":"#REF!"},{"$error":"#REF!"},{"$f":"INDIRECT(\"'\"&E13&\"'!F1\")","v":{"$error":"#REF!"}},{"$error":"#REF!"},"1 (10)",{"$error":"#REF!"},{"$error":"#REF!"},{"$error":"#REF!"},{"$error":"#REF!"},{"$error":"#REF!"}]
[{"$error":"#REF!"},{"$error":"#REF!"},{"$f":"INDIRECT(\"'\"&E14&\"'!F1\")","v":{"$error":"#REF!"}},{"$error":"#REF!"},"1 (11)",{"$error":"#REF!"},{"$error":"#REF!"},{"$error":"#REF!"},{"$error":"#REF!"},{"$error":"#REF!"}]
[{"$error":"#REF!"},{"$error":"#REF!"},{"$f":"INDIRECT(\"'\"&E15&\"'!F1\")","v":{"$error":"#REF!"}},{"$error":"#REF!"},"1 (12)",{"$error":"#REF!"},{"$error":"#REF!"},{"$error":"#REF!"},{"$error":"#REF!"},{"$error":"#REF!"}]
[{"$error":"#REF!"},{"$error":"#REF!"},{"$f":"INDIRECT(\"'\"&E16&\"'!F1\")","v":{"$error":"#REF!"}},{"$error":"#REF!"},"1 (13)",{"$error":"#REF!"},{"$error":"#REF!"},{"$error":"#REF!"},{"$error":"#REF!"},{"$error":"#REF!"}]
[{"$error":"#REF!"},{"$error":"#REF!"},{"$f":"INDIRECT(\"'\"&E17&\"'!F1\")","v":{"$error":"#REF!"}},{"$error":"#REF!"},"1 (14)",{"$error":"#REF!"},{"$error":"#REF!"},{"$error":"#REF!"},{"$error":"#REF!"},{"$error":"#REF!"}]
[{"$error":"#REF!"},{"$error":"#REF!"},{"$f":"INDIRECT(\"'\"&E18&\"'!F1\")","v":{"$error":"#REF!"}},{"$error":"#REF!"},"1 (15)",{"$error":"#REF!"},{"$error":"#REF!"},{"$error":"#REF!"},{"$error":"#REF!"},{"$error":"#REF!"}]
[{"$error":"#REF!"},{"$error":"#REF!"},{"$f":"INDIRECT(\"'\"&E19&\"'!F1\")","v":{"$error":"#REF!"}},{"$error":"#REF!"},"1 (16)",{"$error":"#REF!"},{"$error":"#REF!"},{"$error":"#REF!"},{"$error":"#REF!"},{"$error":"#REF!"}]
[{"$error":"#REF!"},{"$error":"#REF!"},{"$f":"INDIRECT(\"'\"&E20&\"'!F1\")","v":{"$error":"#REF!"}},{"$error":"#REF!"},"1 (17)",{"$error":"#REF!"},{"$error":"#REF!"},{"$error":"#REF!"},{"$error":"#REF!"},{"$error":"#REF!"}]
[{"$error":"#REF!"},{"$error":"#REF!"},{"$f":"INDIRECT(\"'\"&E21&\"'!F1\")","v":{"$error":"#REF!"}},{"$error":"#REF!"},"1 (18)",{"$error":"#REF!"},{"$error":"#REF!"},{"$error":"#REF!"},{"$error":"#REF!"},{"$error":"#REF!"}]
[{"$error":"#REF!"},{"$error":"#REF!"},{"$f":"INDIRECT(\"'\"&E22&\"'!F1\")","v":{"$error":"#REF!"}},{"$error":"#REF!"},"1 (19)",{"$error":"#REF!"},{"$error":"#REF!"},{"$error":"#REF!"},{"$error":"#REF!"},{"$error":"#REF!"}]
[{"$error":"#REF!"},{"$error":"#REF!"},{"$f":"INDIRECT(\"'\"&E23&\"'!F1\")","v":{"$error":"#REF!"}},{"$error":"#REF!"},"1 (20)",{"$error":"#REF!"},{"$error":"#REF!"},{"$error":"#REF!"},{"$error":"#REF!"},{"$error":"#REF!"}]
[{"$error":"#REF!"},{"$error":"#REF!"},{"$f":"INDIRECT(\"'\"&E24&\"'!F1\")","v":{"$error":"#REF!"}},{"$error":"#REF!"},"1 (21)",{"$error":"#REF!"},{"$error":"#REF!"},{"$error":"#REF!"},{"$error":"#REF!"},{"$error":"#REF!"}]
[{"$error":"#REF!"},{"$error":"#REF!"},{"$f":"INDIRECT(\"'\"&E25&\"'!F1\")","v":{"$error":"#REF!"}},{"$error":"#REF!"},"1 (22)",{"$error":"#REF!"},{"$error":"#REF!"},{"$error":"#REF!"},{"$error":"#REF!"},{"$error":"#REF!"}]
[{"$error":"#REF!"},{"$error":"#REF!"},{"$f":"INDIRECT(\"'\"&E26&\"'!F1\")","v":{"$error":"#REF!"}},{"$error":"#REF!"},"1 (23)",{"$error":"#REF!"},{"$error":"#REF!"},{"$error":"#REF!"},{"$error":"#REF!"},{"$error":"#REF!"}]
[{"$error":"#REF!"},{"$error":"#REF!"},{"$f":"INDIRECT(\"'\"&E27&\"'!F1\")","v":{"$error":"#REF!"}},{"$error":"#REF!"},"1 (24)",{"$error":"#REF!"},{"$error":"#REF!"},{"$error":"#REF!"},{"$error":"#REF!"},{"$error":"#REF!"}]
[{"$error":"#REF!"},{"$error":"#REF!"},{"$f":"INDIRECT(\"'\"&E28&\"'!F1\")","v":{"$error":"#REF!"}},{"$error":"#REF!"},"1 (25)",{"$error":"#REF!"},{"$error":"#REF!"},{"$error":"#REF!"},{"$error":"#REF!"},{"$error":"#REF!"}]
[{"$error":"#REF!"},{"$error":"#REF!"},{"$f":"INDIRECT(\"'\"&E29&\"'!F1\")","v":{"$error":"#REF!"}},{"$error":"#REF!"},"1 (26)",{"$error":"#REF!"},{"$error":"#REF!"},{"$error":"#REF!"},{"$error":"#REF!"},{"$error":"#REF!"}]
[{"$error":"#REF!"},{"$error":"#REF!"},{"$f":"INDIRECT(\"'\"&E30&\"'!F1\")","v":{"$error":"#REF!"}},{"$error":"#REF!"},"1 (27)",{"$error":"#REF!"},{"$error":"#REF!"},{"$error":"#REF!"},{"$error":"#REF!"},{"$error":"#REF!"}]
[{"$error":"#REF!"},{"$error":"#REF!"},{"$f":"INDIRECT(\"'\"&E31&\"'!F1\")","v":{"$error":"#REF!"}},{"$error":"#REF!"},"1 (28)",{"$error":"#REF!"},{"$error":"#REF!"},{"$error":"#REF!"},{"$error":"#REF!"},{"$error":"#REF!"}]
[{"$error":"#REF!"},{"$error":"#REF!"},{"$f":"INDIRECT(\"'\"&E32&\"'!F1\")","v":{"$error":"#REF!"}},{"$error":"#REF!"},"1 (29)",{"$error":"#REF!"},{"$error":"#REF!"},{"$error":"#REF!"},{"$error":"#REF!"},{"$error":"#REF!"}]
[{"$error":"#REF!"},{"$error":"#REF!"},{"$f":"INDIRECT(\"'\"&E33&\"'!F1\")","v":{"$error":"#REF!"}},{"$error":"#REF!"},"1 (30)",{"$error":"#REF!"},{"$error":"#REF!"},{"$error":"#REF!"},{"$error":"#REF!"},{"$error":"#REF!"}]
[{"$error":"#REF!"},{"$error":"#REF!"},{"$f":"INDIRECT(\"'\"&E34&\"'!F1\")","v":{"$error":"#REF!"}},{"$error":"#REF!"},"1 (31)",{"$error":"#REF!"},{"$error":"#REF!"},{"$error":"#REF!"},{"$error":"#REF!"},{"$error":"#REF!"}]
[{"$error":"#REF!"},{"$error":"#REF!"},{"$f":"INDIRECT(\"'\"&E35&\"'!F1\")","v":{"$error":"#REF!"}},{"$error":"#REF!"},"1 (32)",{"$error":"#REF!"},{"$error":"#REF!"},{"$error":"#REF!"},{"$error":"#REF!"},{"$error":"#REF!"}]
[{"$error":"#REF!"},{"$error":"#REF!"},{"$f":"INDIRECT(\"'\"&E36&\"'!F1\")","v":{"$error":"#REF!"}},{"$error":"#REF!"},"1 (33)",{"$error":"#REF!"},{"$error":"#REF!"},{"$error":"#REF!"},{"$error":"#REF!"},{"$error":"#REF!"}]
[{"$error":"#REF!"},{"$error":"#REF!"},{"$f":"INDIRECT(\"'\"&E37&\"'!F1\")","v":{"$error":"#REF!"}},{"$error":"#REF!"},"1 (34)",{"$error":"#REF!"},{"$error":"#REF!"},{"$error":"#REF!"},{"$error":"#REF!"},{"$error":"#REF!"}]
[{"$error":"#REF!"},{"$error":"#REF!"},{"$f":"INDIRECT(\"'\"&E38&\"'!F1\")","v":{"$error":"#REF!"}},{"$error":"#REF!"},"1 (35)",{"$error":"#REF!"},{"$error":"#REF!"},{"$error":"#REF!"},{"$error":"#REF!"},{"$error":"#REF!"}]
[{"$error":"#REF!"},{"$error":"#REF!"},{"$f":"INDIRECT(\"'\"&E39&\"'!F1\")","v":{"$error":"#REF!"}},{"$error":"#REF!"},"1 (36)",{"$error":"#REF!"},{"$error":"#REF!"},{"$error":"#REF!"},{"$error":"#REF!"},{"$error":"#REF!"}]
[{"$error":"#REF!"},{"$error":"#REF!"},{"$f":"INDIRECT(\"'\"&E40&\"'!F1\")","v":{"$error":"#REF!"}},{"$error":"#REF!"},"1 (37)",{"$error":"#REF!"},{"$error":"#REF!"},{"$error":"#REF!"},{"$error":"#REF!"},{"$error":"#REF!"}]
{"$rows_left_out":217}
{"sheet":"ورقة1","index":1,"n_rows":253,"n_cols":6,"rows_kept":253,"cut":false,"hidden":true,"merged":[]}
[{"$f":"B1&C1&D1&E1&F1","v":"1 (1)"},1," ","(",1,")"]
[{"$f":"B2&C2&D2&E2&F2","v":"1 (2)"},1," ","(",2,")"]
["1 (3)",1," ","(",3,")"]
["1 (4)",1," ","(",4,")"]
["1 (5)",1," ","(",5,")"]
["1 (6)",1," ","(",6,")"]
["1 (7)",1," ","(",7,")"]
["1 (8)",1," ","(",8,")"]
["1 (9)",1," ","(",9,")"]
["1 (10)",1," ","(",10,")"]
["1 (11)",1," ","(",11,")"]
["1 (12)",1," ","(",12,")"]
["1 (13)",1," ","(",13,")"]
["1 (14)",1," ","(",14,")"]
["1 (15)",1," ","(",15,")"]
["1 (16)",1," ","(",16,")"]
["1 (17)",1," ","(",17,")"]
["1 (18)",1," ","(",18,")"]
["1 (19)",1," ","(",19,")"]
["1 (20)",1," ","(",20,")"]
["1 (21)",1," ","(",21,")"]
["1 (22)",1," ","(",22,")"]
["1 (23)",1," ","(",23,")"]
["1 (24)",1," ","(",24,")"]
["1 (25)",1," ","(",25,")"]
["1 (26)",1," ","(",26,")"]
["1 (27)",1," ","(",27,")"]
["1 (28)",1," ","(",28,")"]
["1 (29)",1," ","(",29,")"]
["1 (30)",1," ","(",30,")"]
["1 (31)",1," ","(",31,")"]
["1 (32)",1," ","(",32,")"]
["1 (33)",1," ","(",33,")"]
["1 (34)",1," ","(",34,")"]
["1 (35)",1," ","(",35,")"]
["1 (36)",1," ","(",36,")"]
["1 (37)",1," ","(",37,")"]
["1 (38)",1," ","(",38,")"]
["1 (39)",1," ","(",39,")"]
["1 (40)",1," ","(",40,")"]
{"$rows_left_out":214}
{"sheet":"most","index":2,"n_rows":253,"n_cols":13,"rows_kept":253,"cut":false,"hidden":false,"merged":[[0,1,0,4],[1,1,1,4]]}
[null,"اكتب اسم المادة بالاسفل هنا للبحث السريع ",null,null,null,"رقم الورقة"]
[null,"كرسي تجربة",null,null,null,{"$f":"IF(B2<>\"\",HYPERLINK(\"#'\"&VLOOKUP($B$2,E4:F382,2,FALSE)&\"'!a1\",VLOOKUP($B$2,E4:F917,2,FALSE)),\"\")","v":1}]
[null,"نوع","الأساس","الفرعي","اسم الجهاز ","رقم الورقة"]
[null,{"$f":"INDIRECT(\"'\"&F4&\"'!f1\")","v":"ذمم"},{"$f":"INDIRECT(\"'\"&F4&\"'!b3\")","v":"أساس"},{"$f":"INDIRECT(\"'\"&F4&\"'!e3\")","v":"فرع"},{"$f":"INDIRECT(\"'\"&F4&\"'!b1\")","v":"كرسي تجربة"},1,null,null,null,null,null,"الأساسي","الفرعي"]
[null,{"$f":"INDIRECT(\"'\"&F5&\"'!f1\")","v":{"$error":"#REF!"}},{"$error":"#REF!"},{"$error":"#REF!"},{"$error":"#REF!"},"1 (2)",null,null,null,null,null,"أساس","فرع"]
[null,{"$error":"#REF!"},{"$error":"#REF!"},{"$error":"#REF!"},{"$error":"#REF!"},"1 (3)"]
[null,{"$error":"#REF!"},{"$error":"#REF!"},{"$error":"#REF!"},{"$error":"#REF!"},"1 (4)"]
[null,{"$error":"#REF!"},{"$error":"#REF!"},{"$error":"#REF!"},{"$error":"#REF!"},"1 (5)"]
[null,{"$error":"#REF!"},{"$error":"#REF!"},{"$error":"#REF!"},{"$error":"#REF!"},"1 (6)"]
[null,{"$error":"#REF!"},{"$error":"#REF!"},{"$error":"#REF!"},{"$error":"#REF!"},"1 (7)"]
[null,{"$error":"#REF!"},{"$error":"#REF!"},{"$error":"#REF!"},{"$error":"#REF!"},"1 (8)"]
[null,{"$error":"#REF!"},{"$error":"#REF!"},{"$error":"#REF!"},{"$error":"#REF!"},"1 (9)"]
[null,{"$error":"#REF!"},{"$error":"#REF!"},{"$error":"#REF!"},{"$error":"#REF!"},"1 (10)"]
[null,{"$error":"#REF!"},{"$error":"#REF!"},{"$error":"#REF!"},{"$error":"#REF!"},"1 (11)"]
[null,{"$error":"#REF!"},{"$error":"#REF!"},{"$error":"#REF!"},{"$error":"#REF!"},"1 (12)"]
[null,{"$error":"#REF!"},{"$error":"#REF!"},{"$error":"#REF!"},{"$error":"#REF!"},"1 (13)"]
[null,{"$error":"#REF!"},{"$error":"#REF!"},{"$error":"#REF!"},{"$error":"#REF!"},"1 (14)"]
[null,{"$error":"#REF!"},{"$error":"#REF!"},{"$error":"#REF!"},{"$error":"#REF!"},"1 (15)"]
[null,{"$error":"#REF!"},{"$error":"#REF!"},{"$error":"#REF!"},{"$error":"#REF!"},"1 (16)"]
[null,{"$error":"#REF!"},{"$error":"#REF!"},{"$error":"#REF!"},{"$error":"#REF!"},"1 (17)"]
[null,{"$error":"#REF!"},{"$error":"#REF!"},{"$error":"#REF!"},{"$error":"#REF!"},"1 (18)"]
[null,{"$error":"#REF!"},{"$error":"#REF!"},{"$error":"#REF!"},{"$error":"#REF!"},"1 (19)"]
[null,{"$error":"#REF!"},{"$error":"#REF!"},{"$error":"#REF!"},{"$error":"#REF!"},"1 (20)"]
[null,{"$error":"#REF!"},{"$error":"#REF!"},{"$error":"#REF!"},{"$error":"#REF!"},"1 (21)"]
[null,{"$error":"#REF!"},{"$error":"#REF!"},{"$error":"#REF!"},{"$error":"#REF!"},"1 (22)"]
[null,{"$error":"#REF!"},{"$error":"#REF!"},{"$error":"#REF!"},{"$error":"#REF!"},"1 (23)"]
[null,{"$error":"#REF!"},{"$error":"#REF!"},{"$error":"#REF!"},{"$error":"#REF!"},"1 (24)"]
[null,{"$error":"#REF!"},{"$error":"#REF!"},{"$error":"#REF!"},{"$error":"#REF!"},"1 (25)"]
[null,{"$error":"#REF!"},{"$error":"#REF!"},{"$error":"#REF!"},{"$error":"#REF!"},"1 (26)"]
[null,{"$error":"#REF!"},{"$error":"#REF!"},{"$error":"#REF!"},{"$error":"#REF!"},"1 (27)"]
[null,{"$error":"#REF!"},{"$error":"#REF!"},{"$error":"#REF!"},{"$error":"#REF!"},"1 (28)"]
[null,{"$error":"#REF!"},{"$error":"#REF!"},{"$error":"#REF!"},{"$error":"#REF!"},"1 (29)"]
[null,{"$error":"#REF!"},{"$error":"#REF!"},{"$error":"#REF!"},{"$error":"#REF!"},"1 (30)"]
[null,{"$error":"#REF!"},{"$error":"#REF!"},{"$error":"#REF!"},{"$error":"#REF!"},"1 (31)"]
[null,{"$error":"#REF!"},{"$error":"#REF!"},{"$error":"#REF!"},{"$error":"#REF!"},"1 (32)"]
[null,{"$error":"#REF!"},{"$error":"#REF!"},{"$error":"#REF!"},{"$error":"#REF!"},"1 (33)"]
[null,{"$error":"#REF!"},{"$error":"#REF!"},{"$error":"#REF!"},{"$error":"#REF!"},"1 (34)"]
[null,{"$error":"#REF!"},{"$error":"#REF!"},{"$error":"#REF!"},{"$error":"#REF!"},"1 (35)"]
[null,{"$error":"#REF!"},{"$error":"#REF!"},{"$error":"#REF!"},{"$error":"#REF!"},"1 (36)"]
[null,{"$error":"#REF!"},{"$error":"#REF!"},{"$error":"#REF!"},{"$error":"#REF!"},"1 (37)"]
{"$rows_left_out":214}
{"sheet":"count","index":3,"n_rows":251,"n_cols":7,"rows_kept":251,"cut":false,"hidden":false,"merged":[]}
["الأساس","الفرعي","نوع","اسم المادة","رقم الورقة","الرصيد ","التحقق"]
[{"$f":"INDIRECT(\"'\"&E2&\"'!b3\")","v":"أساس"},{"$f":"INDIRECT(\"'\"&E2&\"'!e3\")","v":"فرع"},{"$f":"INDIRECT(\"'\"&E2&\"'!f1\")","v":"ذمم"},{"$f":"INDIRECT(\"'\"&E2&\"'!b1\")","v":"كرسي تجربة"},1,{"$f":"INDIRECT(\"'\"&E2&\"'!K1\")","v":28}]
[{"$error":"#REF!"},{"$error":"#REF!"},{"$error":"#REF!"},{"$error":"#REF!"},"1 (2)",{"$error":"#REF!"}]
[{"$error":"#REF!"},{"$error":"#REF!"},{"$error":"#REF!"},{"$error":"#REF!"},"1 (3)",{"$error":"#REF!"}]
[{"$error":"#REF!"},{"$error":"#REF!"},{"$error":"#REF!"},{"$error":"#REF!"},"1 (4)",{"$error":"#REF!"}]
[{"$error":"#REF!"},{"$error":"#REF!"},{"$error":"#REF!"},{"$error":"#REF!"},"1 (5)",{"$error":"#REF!"}]
[{"$error":"#REF!"},{"$error":"#REF!"},{"$error":"#REF!"},{"$error":"#REF!"},"1 (6)",{"$error":"#REF!"}]
[{"$error":"#REF!"},{"$error":"#REF!"},{"$error":"#REF!"},{"$error":"#REF!"},"1 (7)",{"$error":"#REF!"}]
[{"$error":"#REF!"},{"$error":"#REF!"},{"$error":"#REF!"},{"$error":"#REF!"},"1 (8)",{"$error":"#REF!"}]
[{"$error":"#REF!"},{"$error":"#REF!"},{"$error":"#REF!"},{"$error":"#REF!"},"1 (9)",{"$error":"#REF!"}]
[{"$error":"#REF!"},{"$error":"#REF!"},{"$error":"#REF!"},{"$error":"#REF!"},"1 (10)",{"$error":"#REF!"}]
[{"$error":"#REF!"},{"$error":"#REF!"},{"$error":"#REF!"},{"$error":"#REF!"},"1 (11)",{"$error":"#REF!"}]
[{"$error":"#REF!"},{"$error":"#REF!"},{"$error":"#REF!"},{"$error":"#REF!"},"1 (12)",{"$error":"#REF!"}]
[{"$error":"#REF!"},{"$error":"#REF!"},{"$error":"#REF!"},{"$error":"#REF!"},"1 (13)",{"$error":"#REF!"}]
[{"$error":"#REF!"},{"$error":"#REF!"},{"$error":"#REF!"},{"$error":"#REF!"},"1 (14)",{"$error":"#REF!"}]
[{"$error":"#REF!"},{"$error":"#REF!"},{"$error":"#REF!"},{"$error":"#REF!"},"1 (15)",{"$error":"#REF!"}]
[{"$error":"#REF!"},{"$error":"#REF!"},{"$error":"#REF!"},{"$error":"#REF!"},"1 (16)",{"$error":"#REF!"}]
[{"$error":"#REF!"},{"$error":"#REF!"},{"$error":"#REF!"},{"$error":"#REF!"},"1 (17)",{"$error":"#REF!"}]
[{"$error":"#REF!"},{"$error":"#REF!"},{"$error":"#REF!"},{"$error":"#REF!"},"1 (18)",{"$error":"#REF!"}]
[{"$error":"#REF!"},{"$error":"#REF!"},{"$error":"#REF!"},{"$error":"#REF!"},"1 (19)",{"$error":"#REF!"}]
[{"$error":"#REF!"},{"$error":"#REF!"},{"$error":"#REF!"},{"$error":"#REF!"},"1 (20)",{"$error":"#REF!"}]
[{"$error":"#REF!"},{"$error":"#REF!"},{"$error":"#REF!"},{"$error":"#REF!"},"1 (21)",{"$error":"#REF!"}]
[{"$error":"#REF!"},{"$error":"#REF!"},{"$error":"#REF!"},{"$error":"#REF!"},"1 (22)",{"$error":"#REF!"}]
[{"$error":"#REF!"},{"$error":"#REF!"},{"$error":"#REF!"},{"$error":"#REF!"},"1 (23)",{"$error":"#REF!"}]
[{"$error":"#REF!"},{"$error":"#REF!"},{"$error":"#REF!"},{"$error":"#REF!"},"1 (24)",{"$error":"#REF!"}]
[{"$error":"#REF!"},{"$error":"#REF!"},{"$error":"#REF!"},{"$error":"#REF!"},"1 (25)",{"$error":"#REF!"}]
[{"$error":"#REF!"},{"$error":"#REF!"},{"$error":"#REF!"},{"$error":"#REF!"},"1 (26)",{"$error":"#REF!"}]
[{"$error":"#REF!"},{"$error":"#REF!"},{"$error":"#REF!"},{"$error":"#REF!"},"1 (27)",{"$error":"#REF!"}]
[{"$error":"#REF!"},{"$error":"#REF!"},{"$error":"#REF!"},{"$error":"#REF!"},"1 (28)",{"$error":"#REF!"}]
[{"$error":"#REF!"},{"$error":"#REF!"},{"$error":"#REF!"},{"$error":"#REF!"},"1 (29)",{"$error":"#REF!"}]
[{"$error":"#REF!"},{"$error":"#REF!"},{"$error":"#REF!"},{"$error":"#REF!"},"1 (30)",{"$error":"#REF!"}]
[{"$error":"#REF!"},{"$error":"#REF!"},{"$error":"#REF!"},{"$error":"#REF!"},"1 (31)",{"$error":"#REF!"}]
[{"$error":"#REF!"},{"$error":"#REF!"},{"$error":"#REF!"},{"$error":"#REF!"},"1 (32)",{"$error":"#REF!"}]
[{"$error":"#REF!"},{"$error":"#REF!"},{"$error":"#REF!"},{"$error":"#REF!"},"1 (33)",{"$error":"#REF!"}]
[{"$error":"#REF!"},{"$error":"#REF!"},{"$error":"#REF!"},{"$error":"#REF!"},"1 (34)",{"$error":"#REF!"}]
[{"$error":"#REF!"},{"$error":"#REF!"},{"$error":"#REF!"},{"$error":"#REF!"},"1 (35)",{"$error":"#REF!"}]
[{"$error":"#REF!"},{"$error":"#REF!"},{"$error":"#REF!"},{"$error":"#REF!"},"1 (36)",{"$error":"#REF!"}]
[{"$error":"#REF!"},{"$error":"#REF!"},{"$error":"#REF!"},{"$error":"#REF!"},"1 (37)",{"$error":"#REF!"}]
[{"$error":"#REF!"},{"$error":"#REF!"},{"$error":"#REF!"},{"$error":"#REF!"},"1 (38)",{"$error":"#REF!"}]
[{"$error":"#REF!"},{"$error":"#REF!"},{"$error":"#REF!"},{"$error":"#REF!"},"1 (39)",{"$error":"#REF!"}]
{"$rows_left_out":212}
{"sheet":"1","index":4,"n_rows":7,"n_cols":12,"rows_kept":7,"cut":false,"hidden":false,"merged":[[0,11,0,12],[3,7,3,8],[3,0,3,2],[3,3,3,4],[0,1,0,3],[2,1,2,2],[2,4,2,5],[0,9,1,9],[0,10,1,10]]}
["اسم المادة ","كرسي تجربة",null,null,"نوع المادة","ذمم",null,null,null,"الرصيد المتوفر داخل المخزن",{"$f":"F4-K4","v":28},{"$f":"CELL(\"filename\",A1)","v":"C:\\Users\\Mostafa J. Alajrawi\\Desktop\\[مخزن المعهد معدل.xlsm]1"}]
["رمز المادة",{"$f":"RIGHT(L1,L2-L3)","v":"1"},"سعر الدولار",40,"سعر العراقي",50000,null,null,null,null,null,{"$f":"LEN(L1)","v":61}]
["الأساسي","أساس",null,"الفرعي","فرع",null,null,null,null,null,null,{"$f":"FIND(\"]\",L1,1)","v":60}]
["الشــــــــــــــــــــــراء ",null,null,"مجموع الشراء",null,{"$f":"SUM(E6:E10000)","v":33},null,"الإخراج",null,"مجموع الإخراج",{"$f":"SUM(I6:I9)","v":5}]
["رقم قائمة الشراء","تأريخ قائمة الشراء","رقم سند الادخال","تأريخ سند الادخال","الكمية","الملاحضات",null,"رقم الامر","الكمية ","التأريخ ","قسم"]
[null,null,null,null,33,null,null,null,3,null,"ميكانيك"]
[null,null,null,null,null,null,null,null,2]

{"sheet":"ورقة2","index":5,"n_rows":4,"n_cols":5,"rows_kept":4,"cut":false,"hidden":false,"merged":[[0,0,1,3],[0,4,1,7]]}
["القسم المراد البحث عنه",null,null,null,"ميكانيك"]
[]
[]
["المادة","عددها","تأريخ"]