{"text_format":"1","workbook":"xlsx","n_sheets":7,"sheets":["كشاف","فصول","الجدول","T2","استمارة الحصص","ورقة1","ورقة2"],"not_rendered":{"charts":0,"images":0,"macros":1,"external_links":1,"defined_names":9,"comments":0,"pivot_tables":0},"unopened":[],"bounds":{"document_bytes":16777216,"sheet_cells":100000,"rows_first":2000,"rows_last":500,"rows_between":2000,"halvings":0,"cell_chars":16384,"cell_head_chars":4096},"cells_cut":0,"cells_raw":0,"read":"whole","date_system":"1900"}

{"sheet":"كشاف","index":0,"n_rows":75,"n_cols":167,"rows_kept":75,"cut":false,"hidden":false,"merged":[[0,21,0,29],[1,38,2,38],[0,30,0,38],[1,47,2,47],[0,39,0,47],[1,56,2,56],[0,48,0,56],[1,11,2,11],[0,3,0,11],[1,17,2,17],[1,18,2,18],[1,19,2,19],[1,51,2,51],[1,52,2,52],[1,44,2,44],[1,45,2,45],[1,46,2,46],[1,30,2,30],[1,31,2,31],[1,32,2,32],[1,33,2,33],[1,34,2,34],[1,35,2,35],[1,10,2,10],[1,2,2,2],[27,2,28,2],[31,2,32,2],[29,2,30,2],[35,2,36,2],[1,36,2,36],[1,48,2,48],[1,49,2,49],[1,50,2,50],[1,21,2,21],[1,22,2,22],[1,23,2,23],[1,24,2,24],[1,25,2,25],[1,26,2,26],[1,8,2,8],[1,9,2,9],[25,2,26,2],[1,37,2,37],[1,39,2,39],[1,40,2,40],[1,41,2,41],[1,42,2,42],[1,43,2,43],[1,27,2,27],[1,28,2,28],[1,20,2,20],[1,29,2,29],[1,12,2,12],[1,13,2,13],[1,14,2,14],[1,15,2,15],[1,16,2,16],[1,3,2,3],[1,4,2,4],[1,5,2,5],[1,6,2,6],[1,7,2,7],[0,12,0,20],[324,1,325,1],[324,2,325,2],[326,1,327,1],[326,2,327,2],[318,1,319,1],[318,2,319,2],[320,1,321,1],[320,2,321,2],[322,1,323,1],[322,2,323,2],[312,1,313,1],[312,2,313,2],[314,1,315,1],[314,2,315,2],[316,1,317,1],[316,2,317,2],[306,1,307,1],[306,2,307,2],[308,1,309,1],[308,2,309,2],[310,1,311,1],[310,2,311,2],[300,1,301,1],[300,2,301,2],[302,1,303,1],[302,2,303,2],[304,1,305,1],[304,2,305,2],[294,1,295,1],[294,2,295,2],[296,1,297,1],[296,2,297,2],[298,1,299,1],[298,2,299,2],[288,1,289,1],[288,2,289,2],[290,1,291,1],[290,2,291,2],[292,1,293,1],[292,2,293,2],[280,10,281,10],[282,1,283,1],[282,2,283,2],[284,1,285,1],[284,2,285,2],[286,1,287,1],[286,2,287,2],[280,4,281,4],[280,5,281,5],[280,6,281,6],[280,7,281,7],[280,8,281,8],[280,9,281,9],[268,1,269,1],[268,2,269,2],[270,1,271,1],[270,2,271,2],[280,2,281,2],[280,3,281,3],[262,1,263,1],[262,2,263,2],[264,1,265,1],[264,2,265,2],[266,1,267,1],[266,2,267,2],[256,1,257,1],[256,2,257,2],[258,1,259,1],[258,2,259,2],[260,1,261,1],[260,2,261,2],[250,1,251,1],[250,2,251,2],[252,1,253,1],[252,2,253,2],[254,1,255,1],[254,2,255,2],[244,1,245,1],[244,2,245,2],[246,1,247,1],[246,2,247,2],[248,1,249,1],[248,2,249,2],[238,1,239,1],[238,2,239,2],[240,1,241,1],[240,2,241,2],[242,1,243,1],[242,2,243,2],[232,1,233,1],[232,2,233,2],[234,1,235,1],[234,2,235,2],[236,1,237,1],[236,2,237,2],[224,10,225,10],[226,1,227,1],[226,2,227,2],[228,1,229,1],[228,2,229,2],[230,1,231,1],[230,2,231,2],[224,4,225,4],[224,5,225,5],[224,6,225,6],[224,7,225,7],[224,8,225,8],[224,9,225,9],[212,1,213,1],[212,2,213,2],[214,1,215,1],[214,2,215,2],[224,2,225,2],[224,3,225,3],[206,1,207,1],[206,2,207,2],[208,1,209,1],[208,2,209,2],[210,1,211,1],[210,2,211,2],[200,1,201,1],[200,2,201,2],[202,1,203,1],[202,2,203,2],[204,1,205,1],[204,2,205,2],[194,1,195,1],[194,2,195,2],[196,1,197,1],[196,2,197,2],[198,1,199,1],[198,2,199,2],[188,1,189,1],[188,2,189,2],[190,1,191,1],[190,2,191,2],[192,1,193,1],[192,2,193,2],[182,2,183,2],[184,2,185,2],[186,2,187,2],[168,10,169,10],[170,2,171,2],[172,2,173,2],[174,2,175,2],[168,4,169,4],[168,5,169,5],[168,6,169,6],[168,9,169,9],[168,7,169,7],[168,8,169,8],[156,2,157,2],[158,2,159,2],[168,2,169,2],[168,3,169,3],[152,2,153,2],[154,2,155,2],[176,2,177,2],[178,2,179,2],[180,2,181,2],[138,2,139,2],[128,2,129,2],[130,2,131,2],[132,2,133,2],[146,2,147,2],[148,2,149,2],[150,2,151,2],[140,2,141,2],[142,2,143,2],[144,2,145,2],[124,2,125,2],[126,2,127,2],[118,2,119,2],[112,4,113,4],[120,2,121,2],[114,2,115,2],[116,2,117,2],[134,2,135,2],[136,2,137,2],[122,2,123,2],[98,2,99,2],[112,9,113,9],[112,2,113,2],[112,3,113,3],[112,10,113,10],[92,2,93,2],[102,2,103,2],[100,2,101,2],[94,2,95,2],[96,2,97,2],[112,5,113,5],[112,6,113,6],[112,7,113,7],[112,8,113,8],[74,2,75,2],[76,2,77,2],[78,2,79,2],[68,2,69,2],[70,2,71,2],[72,2,73,2],[86,2,87,2],[88,2,89,2],[90,2,91,2],[80,2,81,2],[82,2,83,2],[84,2,85,2],[7,1,8,1],[9,1,10,1],[11,1,12,1],[13,1,14,1],[15,1,16,1],[66,2,67,2],[56,7,57,7],[58,2,59,2],[64,2,65,2],[19,1,20,1],[21,1,22,1],[23,1,24,1],[25,1,26,1],[27,1,28,1],[29,1,30,1],[31,1,32,1],[33,1,34,1],[17,1,18,1],[37,2,38,2],[15,2,16,2],[17,2,18,2],[19,2,20,2],[21,2,22,2],[23,2,24,2],[56,9,57,9],[56,10,57,10],[56,2,57,2],[56,3,57,3],[56,6,57,6],[0,1,0,2],[60,2,61,2],[62,2,63,2],[47,2,48,2],[41,2,42,2],[43,2,44,2],[45,2,46,2],[56,4,57,4],[56,5,57,5],[3,2,4,2],[5,2,6,2],[7,2,8,2],[9,2,10,2],[11,2,12,2],[13,2,14,2],[33,2,34,2],[39,2,40,2],[3,1,4,1],[5,1,6,1],[56,8,57,8],[1,53,2,53],[1,54,2,54],[1,55,2,55],[71,1,72,1],[73,1,74,1],[53,1,54,1],[55,1,56,1],[57,1,58,1],[59,1,60,1],[61,1,62,1],[63,1,64,1],[65,1,66,1],[67,1,68,1],[69,1,70,1],[35,1,36,1],[37,1,38,1],[39,1,40,1],[41,1,42,1],[43,1,44,1],[45,1,46,1],[47,1,48,1],[49,1,50,1],[51,1,52,1]]}
[null,"اليوم",null,"السبت",null,null,null,null,null,null,null,null,"الأحد",null,null,null,null,null,null,null,null,"الأثنين",null,null,null,null,null,null,null,null,"الثلاثاء",null,null,null,null,null,null,null,null,"الأربعاء",null,null,null,null,null,null,null,null,"الخميس"]
[null,"الحصة","رقم الفصل","الأولى","الثانية","الثالثة","الرابعة","الخامسة","السادسة","السابعة","الثامنة","التاسعة","الأولى","الثانية","الثالثة","الرابعة","الخامسة","السادسة","السابعة","الثامنة","التاسعة","الأولى","الثانية","الثالثة","الرابعة","الخامسة","السادسة","السابعة","الثامنة","التاسعة","الأولى","الثانية","الثالثة","الرابعة","الخامسة","السادسة","السابعة","الثامنة","التاسعة","الأولى","الثانية","الثالثة","الرابعة","الخامسة","السادسة","السابعة","الثامنة","التاسعة","الأولى","الثانية","الثالثة","الرابعة","الخامسة","السادسة","السابعة","الثامنة","التاسعة"]
[null,"الفصل",null,null,null,null,null,null,null,null,null,null,null,null,null,null,null,null,null,null,null,null,null,null,null,null,null,null,null,null,null,null,null,null,null,null,null,null,null,null,null,null,null,null,null,null,null,null,null,null,null,null,null,null,null,null,null,null,null,null,"م","الاسم","الوظيفة","المادة","التخصص","النصاب"]
[null,"1/1",null,null,null,null,null,null,null,null,null,null,"حساب","حساب","عربي","عربي","متعدد","متعدد","عربي","عربي",null,"E","متعدد","دين","عربي","عربي","حساب","حساب","متعدد",null,"متعدد","متعدد","عربي","عربي","حساب","حساب","متعدد","E",null,"العاب","توكاتسو","متعدد","عربي","عربي","E","دين","متعدد",null,"متعدد","العاب","حساب","حساب","عربي","عربي","متعدد","E",null,null,{"$f":"B4","v":"1/1"},null,1,"محمد ناجى","خبير","رياضيات","فصل",18]
[null,null,null,null,null,null,null,null,null,null,null,null,"منال جمعه","منال جمعه","منال جمعه","منال جمعه","منال جمعه","منال جمعه","منال جمعه","منال جمعه",null,"احمد ابراهيم","منال جمعه","منال جمعه","منال جمعه","منال جمعه","منال جمعه","منال جمعه","منال جمعه",null,"منال جمعه","منال جمعه","منال جمعه","منال جمعه","منال جمعه","منال جمعه","منال جمعه","احمد ابراهيم",null,"منال جمعه","منال جمعه","منال جمعه","منال جمعه","منال جمعه","احمد ابراهيم","منال جمعه","منال جمعه",null,"منال جمعه","منال جمعه","منال جمعه","منال جمعه","منال جمعه","منال جمعه","منال جمعه","احمد ابراهيم",null,null,{"$f":"B5","v":0},null,2,"عطيه عبدالغفار","معلم اول أ","رياضيات","فصل",20,null,"اليوم","التاريخ","إجازة","التاريخ","إجازة","التاريخ","إجازة","التاريخ","اجازة","التاريخ","التاريخ",null,null,null,null,null,null,null,null,null,null,null,null,null,null,null,null,null,null,null,null,null,null,null,null,null,null,null,null,null,null,null,null,null,null,null,null,null,"mawad1","fosol1"]
[null,"2/1",null,null,null,null,null,null,null,null,null,null,"متعدد","العاب","حساب","حساب","عربي","عربي","E","دين",null,"متعدد","متعدد","عربي","عربي","متعدد","E","عربي","عربي",null,"عربي","عربي","متعدد","متعدد","حساب","حساب","E","العاب",null,"حساب","حساب","متعدد","متعدد","توكاتسو","عربي","عربي","دين",null,"E","عربي","عربي","متعدد","متعدد","متعدد","حساب","حساب",null,null,"2/1",null,3,"صابر صالح","معلم اول","عربي ودين","عربي ودين",22,null,"الاحد","ـــــ","ــــــــ","11/7",null,"11/14",null,"11/21",null,"11/28",null,null,null,null,null,null,null,null,null,null,null,null,null,null,null,null,null,null,null,null,null,null,null,null,null,null,null,null,null,null,null,null,null,null,null,null,null,null,"اتصالات ",null,"2 / 1","2 / 2","2 / 3","2 / 4","2 / 5","2 / 6","2 / 7","2 / 8","2 / 9","2 / 10","2 / 11","2 / 12","2 / 13","2 / 14"," 2 / 15","2 / 16","2 / 17","2 / 18","2 / 19","2 / 20","2 / 21"," 2 / 22","3 / 1","3 / 2","3 / 3","3 / 4","3 / 5","3 / 6","3 / 7","3 / 8","3 / 9","3 / 10","3 / 11","3 / 12","3 / 13","3 / 14"," 3 / 15","3 / 16","3 / 17","3 / 18","3 / 19","3 / 20","3 / 21"," 3 / 22","3 / 23","3 / 24","3 / 25","3 / 26"," 3 / 27","3 / 28"]
{"$rows_left_out":70}
{"sheet":"فصول","index":1,"n_rows":113,"n_cols":40,"rows_kept":113,"cut":false,"hidden":false,"merged":[[109,31,110,31],[111,31,112,31],[90,31,91,31],[92,31,93,31],[94,31,95,31],[96,31,97,31],[99,36,99,37],[101,31,102,31],[103,31,104,31],[105,31,106,31],[107,31,108,31],[72,31,73,31],[74,31,75,31],[76,31,77,31],[78,31,79,31],[80,31,81,31],[82,31,83,31],[84,36,84,37],[86,31,87,31],[88,31,89,31],[54,31,55,31],[56,36,56,37],[58,31,59,31],[60,31,61,31],[62,31,63,31],[64,31,65,31],[66,31,67,31],[68,31,69,31],[70,36,70,37],[36,31,37,31],[38,31,39,31],[40,31,41,31],[42,36,42,37],[44,31,45,31],[46,31,47,31],[48,31,49,31],[50,31,51,31],[52,31,53,31],[18,31,19,31],[20,31,21,31],[22,31,23,31],[24,31,25,31],[26,31,27,31],[28,36,28,37],[30,31,31,31],[32,31,33,31],[34,31,35,31],[0,36,0,37],[2,31,3,31],[4,31,5,31],[6,31,7,31],[8,31,9,31],[10,31,11,31],[12,31,13,31],[14,36,14,37],[16,31,17,31],[101,21,102,21],[103,21,104,21],[105,21,106,21],[107,21,108,21],[109,21,110,21],[111,21,112,21],[0,6,0,7],[36,1,37,1],[38,1,39,1],[16,1,17,1],[18,1,19,1],[20,1,21,1],[22,1,23,1],[34,1,35,1],[24,1,25,1],[26,1,27,1],[2,1,3,1],[4,1,5,1],[6,1,7,1],[8,1,9,1],[30,1,31,1],[10,1,11,1],[12,1,13,1],[2,11,3,11],[4,11,5,11],[6,11,7,11],[8,11,9,11],[10,11,11,11],[12,11,13,11],[34,11,35,11],[40,1,41,1],[99,26,99,27],[58,1,59,1],[18,11,19,11],[20,11,21,11],[22,11,23,11],[24,11,25,11],[26,11,27,11],[30,11,31,11],[32,11,33,11],[44,1,45,1],[46,1,47,1],[32,1,33,1],[88,21,89,21],[90,21,91,21],[92,21,93,21],[50,11,51,11],[52,11,53,11],[0,26,0,27],[28,6,28,7],[42,6,42,7],[0,16,0,17],[14,16,14,17],[28,16,28,17],[42,16,42,17],[42,26,42,27],[28,26,28,27],[14,26,14,27],[12,21,13,21],[2,21,3,21],[4,21,5,21],[6,21,7,21],[8,21,9,21],[10,21,11,21],[40,21,41,21],[16,21,17,21],[18,21,19,21],[20,21,21,21],[22,21,23,21],[24,21,25,21],[26,21,27,21],[30,21,31,21],[54,11,55,11],[44,11,45,11],[46,11,47,11],[48,11,49,11],[36,11,37,11],[38,11,39,11],[40,11,41,11],[16,11,17,11],[14,6,14,7],[66,1,67,1],[68,1,69,1],[58,11,59,11],[60,11,61,11],[62,11,63,11],[64,11,65,11],[66,11,67,11],[68,11,69,11],[88,1,89,1],[86,11,87,11],[88,11,89,11],[82,1,83,1],[72,11,73,11],[74,11,75,11],[76,11,77,11],[78,11,79,11],[80,11,81,11],[82,11,83,11],[86,1,87,1],[32,21,33,21],[34,21,35,21],[36,21,37,21],[38,21,39,21],[72,1,73,1],[74,1,75,1],[76,1,77,1],[78,1,79,1],[80,1,81,1],[62,21,63,21],[64,21,65,21],[44,21,45,21],[46,21,47,21],[48,21,49,21],[50,21,51,21],[52,21,53,21],[54,21,55,21],[48,1,49,1],[50,1,51,1],[52,1,53,1],[54,1,55,1],[60,1,61,1],[62,1,63,1],[64,1,65,1],[90,1,91,1],[92,1,93,1],[94,1,95,1],[96,1,97,1],[90,11,91,11],[92,11,93,11],[94,11,95,11],[96,11,97,11],[104,1,105,1],[106,1,107,1],[108,1,109,1],[110,1,111,1],[100,11,101,11],[102,11,103,11],[104,11,105,11],[106,11,107,11],[108,11,109,11],[110,11,111,11],[100,1,101,1],[102,1,103,1],[56,26,56,27],[70,26,70,27],[84,26,84,27],[94,21,95,21],[96,21,97,21],[56,6,56,7],[70,6,70,7],[84,6,84,7],[98,6,98,7],[56,16,56,17],[70,16,70,17],[84,16,84,17],[98,16,98,17],[66,21,67,21],[68,21,69,21],[72,21,73,21],[74,21,75,21],[76,21,77,21],[78,21,79,21],[80,21,81,21],[82,21,83,21],[86,21,87,21],[58,21,59,21],[60,21,61,21]]}
[{"$f":"كشاف!BG4","v":"1/1"},null,null,null,"جدول فصل",{"$f":"A1","v":"1/1"},{"$f":"A2","v":0},null,null,null,null,null,null,null,"جدول فصل",{"$f":"A17","v":"4/2"},{"$f":"A18","v":0},null,null,null,null,null,null,null,"جدول فصل",{"$f":"A33","v":"6/3"},{"$f":"A34","v":0},null,null,null,null,null,null,null,"جدول فصل",{"$f":"A45","v":"5/4"},{"$f":"J34","v":"احمد ابراهيم"}]
[{"$f":"كشاف!BG5","v":0},"اليوم",1,2,3,4,5,6,7,8,null,"اليوم",1,2,3,4,5,6,7,8,null,"اليوم",1,2,3,4,5,6,7,8,null,"اليوم",1,2,3,4,5,6,7,8]
[{"$f":"كشاف!BG6","v":"2/1"},"السبت",{"$f":"كشاف!D4","v":0},{"$f":"كشاف!E4","v":0},{"$f":"كشاف!F4","v":0},{"$f":"كشاف!G4","v":0},{"$f":"كشاف!H4","v":0},{"$f":"كشاف!I4","v":0},{"$f":"كشاف!J4","v":0},{"$f":"كشاف!K4","v":0},null,"السبت",{"$f":"كشاف!D20","v":0},{"$f":"كشاف!E20","v":0},{"$f":"كشاف!F20","v":0},{"$f":"كشاف!G20","v":0},{"$f":"كشاف!H20","v":0},{"$f":"كشاف!I20","v":0},{"$f":"كشاف!J20","v":0},{"$f":"كشاف!K20","v":0},null,"السبت",{"$f":"كشاف!D36","v":0},{"$f":"كشاف!E36","v":0},{"$f":"كشاف!F36","v":0},{"$f":"كشاف!G36","v":0},{"$f":"كشاف!H36","v":0},{"$f":"كشاف!I36","v":0},{"$f":"كشاف!J36","v":0},{"$f":"كشاف!K36","v":0},null,"السبت",{"$f":"كشاف!N36","v":"E"},{"$f":"كشاف!O36","v":"توكاتسو"},{"$f":"كشاف!P36","v":"متعدد"},{"$f":"كشاف!Q36","v":"متعدد"},{"$f":"كشاف!R36","v":"متعدد"},{"$f":"كشاف!S36","v":"عربي"},{"$f":"كشاف!T36","v":"عربي"},{"$f":"كشاف!V36","v":"حساب"}]
[{"$f":"كشاف!BG7","v":0},null,{"$f":"كشاف!D5","v":0},{"$f":"كشاف!E5","v":0},{"$f":"كشاف!F5","v":0},{"$f":"كشاف!G5","v":0},{"$f":"كشاف!H5","v":0},{"$f":"كشاف!I5","v":0},{"$f":"كشاف!J5","v":0},{"$f":"كشاف!K5","v":0},null,null,{"$f":"كشاف!D21","v":0},{"$f":"كشاف!E21","v":0},{"$f":"كشاف!F21","v":0},{"$f":"كشاف!G21","v":0},{"$f":"كشاف!H21","v":0},{"$f":"كشاف!I21","v":0},{"$f":"كشاف!J21","v":0},{"$f":"كشاف!K21","v":0},null,null,{"$f":"كشاف!D37","v":0},{"$f":"كشاف!E37","v":0},{"$f":"كشاف!F37","v":0},{"$f":"كشاف!G37","v":0},{"$f":"كشاف!H37","v":0},{"$f":"كشاف!I37","v":0},{"$f":"كشاف!J37","v":0},{"$f":"كشاف!K37","v":0},null,null,{"$f":"كشاف!N37","v":"ايمان عبدالناصر"},{"$f":"كشاف!O37","v":"رضا ناجى"},{"$f":"كشاف!P37","v":"رضا ناجى"},{"$f":"كشاف!Q37","v":"رضا ناجى"},{"$f":"كشاف!R37","v":"رضا ناجى"},{"$f":"كشاف!S37","v":"رضا ناجى"},{"$f":"كشاف!T37","v":"رضا ناجى"},{"$f":"كشاف!V37","v":"رضا ناجى"}]
[{"$f":"كشاف!BG8","v":"3/1"},"الأحد",{"$f":"كشاف!$M4","v":"حساب"},{"$f":"كشاف!$N4","v":"حساب"},{"$f":"كشاف!O4","v":"عربي"},{"$f":"كشاف!P4","v":"عربي"},{"$f":"كشاف!Q4","v":"متعدد"},{"$f":"كشاف!R4","v":"متعدد"},{"$f":"كشاف!S4","v":"عربي"},{"$f":"كشاف!T4","v":"عربي"},null,"الأحد",{"$f":"كشاف!M10","v":"عربي"},{"$f":"كشاف!N10","v":"عربي"},{"$f":"كشاف!O10","v":"حساب"},{"$f":"كشاف!P10","v":"حساب"},{"$f":"كشاف!Q10","v":"متعدد"},{"$f":"كشاف!R10","v":"E"},{"$f":"كشاف!S10","v":"دين"},{"$f":"كشاف!T10","v":"متعدد"},null,"الأحد",{"$f":"كشاف!M26","v":"العاب"},{"$f":"كشاف!N26","v":"متعدد"},{"$f":"كشاف!O26","v":"توكاتسو"},{"$f":"كشاف!P26","v":"عربي"},{"$f":"كشاف!Q26","v":"عربي"},{"$f":"كشاف!R26","v":"حساب"},{"$f":"كشاف!S26","v":"حساب"},{"$f":"كشاف!T26","v":"E"},null,"الأحد",{"$f":"كشاف!W26","v":"حساب"},{"$f":"كشاف!X26","v":"عربي"},{"$f":"كشاف!Y26","v":"عربي"},{"$f":"كشاف!Z26","v":"متعدد"},{"$f":"كشاف!AA26","v":"E"},{"$f":"كشاف!AB26","v":"متعدد"},{"$f":"كشاف!AC26","v":"متعدد"},{"$f":"كشاف!AE26","v":"دين"}]
[{"$f":"كشاف!BG9","v":0},null,{"$f":"كشاف!$M5","v":"منال جمعه"},{"$f":"كشاف!$N5","v":"منال جمعه"},{"$f":"كشاف!O5","v":"منال جمعه"},{"$f":"كشاف!P5","v":"منال جمعه"},{"$f":"كشاف!Q5","v":"منال جمعه"},{"$f":"كشاف!R5","v":"منال جمعه"},{"$f":"كشاف!S5","v":"منال جمعه"},{"$f":"كشاف!T5","v":"منال جمعه"},null,null,{"$f":"كشاف!M11","v":"احمد سليمان"},{"$f":"كشاف!N11","v":"احمد سليمان"},{"$f":"كشاف!O11","v":"احمد سليمان"},{"$f":"كشاف!P11","v":"احمد سليمان"},{"$f":"كشاف!Q11","v":"احمد سليمان"},{"$f":"كشاف!R11","v":"احمد ابراهيم"},{"$f":"كشاف!S11","v":"احمد سليمان"},{"$f":"كشاف!T11","v":"احمد سليمان"},null,null,{"$f":"كشاف!M37","v":"رضا ناجى"},{"$f":"كشاف!N37","v":"ايمان عبدالناصر"},{"$f":"كشاف!O37","v":"رضا ناجى"},{"$f":"كشاف!P37","v":"رضا ناجى"},{"$f":"كشاف!Q37","v":"رضا ناجى"},{"$f":"كشاف!R37","v":"رضا ناجى"},{"$f":"كشاف!S37","v":"رضا ناجى"},{"$f":"كشاف!T37","v":"رضا ناجى"},null,null,{"$f":"كشاف!W37","v":"رضا ناجى"},{"$f":"كشاف!X37","v":"رضا ناجى"},{"$f":"كشاف!Y37","v":"ايمان عبدالناصر"},{"$f":"كشاف!Z37","v":"رضا ناجى"},{"$f":"كشاف!AA37","v":"رضا ناجى"},{"$f":"كشاف!AB37","v":"رضا ناجى"},{"$f":"كشاف!AC37","v":"رضا ناجى"},{"$f":"كشاف!AE37","v":"رضا ناجى"}]
{"$rows_left_out":108}
{"sheet":"الجدول","index":2,"n_rows":53,"n_cols":16,"rows_kept":53,"cut":false,"hidden":false,"merged":[[4,7,4,8],[21,7,21,8],[38,7,38,8],[17,2,18,2],[7,2,8,2],[9,2,10,2],[11,2,12,2],[13,2,14,2],[15,2,16,2],[49,2,50,2],[51,2,52,2],[24,2,25,2],[41,2,42,2],[43,2,44,2],[45,2,46,2],[47,2,48,2],[34,2,35,2],[32,2,33,2],[30,2,31,2],[28,2,29,2],[26,2,27,2]]}
[null,null,null,null,null,null,null,null,null,null,null,null,null,null,null,10]
[]
[]
[]
[null,null,null,null,null,"جدول الاستاذ/",{"$f":"IFERROR(VLOOKUP($P$1,كشاف!$BI$4:$BJ$150,2,0),\"\")","v":"سعيد عبدالباسط"},"عدد الحصص",null,{"$f":"SUM($M$11:$M$19)","v":36}]
[]
{"$rows_left_out":48}
{"sheet":"T2","index":3,"n_rows":53,"n_cols":16,"rows_kept":53,"cut":false,"hidden":false,"merged":[[47,2,48,2],[49,2,50,2],[51,2,52,2],[32,2,33,2],[34,2,35,2],[38,7,38,8],[41,2,42,2],[43,2,44,2],[45,2,46,2],[17,2,18,2],[21,7,21,8],[24,2,25,2],[26,2,27,2],[28,2,29,2],[30,2,31,2],[15,2,16,2],[4,7,4,8],[7,2,8,2],[9,2,10,2],[11,2,12,2],[13,2,14,2]]}
[null,null,null,null,null,null,null,null,null,null,null,null,null,null,null,10]
[]
[]
[]
[null,null,null,null,null,"جدول الاستاذ/",{"$f":"IFERROR(VLOOKUP($P$1,كشاف!$BI$4:$BJ$150,2,0),\"\")","v":"سعيد عبدالباسط"},"عدد الحصص",null,{"$f":"SUM($M$11:$M$19)","v":33}]
[]
{"$rows_left_out":48}
{"sheet":"استمارة الحصص","index":4,"n_rows":99,"n_cols":25,"rows_kept":99,"cut":false,"hidden":false,"merged":[[94,1,94,6],[61,1,61,6],[35,13,35,17],[52,12,53,12],[52,11,53,11],[52,8,53,8],[52,1,53,1],[98,0,98,2],[98,3,98,6],[50,0,51,10],[68,0,68,1],[68,2,68,8],[68,11,68,12],[68,13,68,19],[69,11,69,12],[69,0,69,2],[67,13,67,17],[56,9,56,10],[92,14,92,15],[38,14,38,18],[71,14,71,18],[95,2,95,3],[98,17,98,19],[69,13,69,17],[32,3,32,6],[30,15,30,19],[63,15,63,19],[96,15,96,19],[52,5,53,5],[52,6,53,6],[37,0,37,19],[38,0,39,0],[38,19,49,19],[40,0,41,0],[42,0,43,0],[36,0,36,2],[44,0,45,0],[30,12,30,14],[52,16,53,19],[54,9,54,10],[52,14,53,15],[50,13,51,14],[52,0,53,0],[54,16,54,19],[55,9,55,10],[55,16,55,19],[48,0,49,0],[54,14,54,15],[69,3,69,6],[36,13,36,17],[36,3,36,7],[3,3,3,7],[3,13,3,17],[19,2,20,2],[19,4,20,4],[19,6,20,6],[19,8,20,8],[19,11,20,11],[19,13,20,13],[29,2,29,3],[27,0,27,19],[32,8,32,11],[26,16,26,19],[17,15,18,19],[50,15,51,19],[52,3,53,3],[52,7,53,7],[52,2,53,2],[52,4,53,4],[55,14,55,15],[32,0,32,2],[21,9,21,10],[22,9,22,10],[23,9,23,10],[24,9,24,10],[23,16,23,19],[24,16,24,19],[19,0,20,0],[19,1,20,1],[52,13,53,13],[19,3,20,3],[19,7,20,7],[19,9,20,10],[46,0,47,0],[50,11,51,12],[52,9,53,10],[38,1,38,3],[38,5,38,8],[34,0,34,6],[28,1,28,6],[25,9,25,10],[36,11,36,12],[35,0,35,1],[35,2,35,8],[35,11,35,12],[25,16,25,19],[34,13,34,17],[21,16,21,19],[32,12,32,14],[32,17,32,19],[24,14,24,15],[25,14,25,15],[26,14,26,15],[0,11,0,19],[1,13,1,17],[33,11,33,19],[19,14,20,15],[21,14,21,15],[22,14,22,15],[23,14,23,15],[22,16,22,19],[2,13,2,17],[2,0,2,1],[2,11,2,12],[3,11,3,12],[19,5,20,5],[19,12,20,12],[4,0,4,19],[5,0,6,0],[5,19,16,19],[17,0,18,10],[17,11,18,12],[17,13,18,14],[7,0,8,0],[9,0,10,0],[3,0,3,2],[19,16,20,19],[11,0,12,0],[13,0,14,0],[15,0,16,0],[5,1,5,3],[5,10,5,12],[5,5,5,8],[5,14,5,18],[1,0,1,8],[92,16,92,19],[79,0,80,0],[71,0,72,0],[60,0,60,19],[63,12,63,14],[65,8,65,11],[65,12,65,14],[65,17,65,19],[81,0,82,0],[83,0,84,10],[83,15,84,19],[65,0,65,2],[73,0,74,0],[75,0,76,0],[77,0,78,0],[70,0,70,19],[85,14,86,15],[67,0,67,6],[65,3,65,6],[56,14,56,15],[57,14,57,15],[58,14,58,15],[59,14,59,15],[96,12,96,14],[90,9,90,10],[85,16,86,19],[87,9,87,10],[98,8,98,11],[98,12,98,14],[83,13,84,14],[58,9,58,10],[58,16,58,19],[59,16,59,19],[85,9,86,10],[83,11,84,12],[93,0,93,19],[85,0,86,0],[85,1,86,1],[85,3,86,3],[85,5,86,5],[85,12,86,12],[90,16,90,19],[91,9,91,10],[85,4,86,4],[85,6,86,6],[85,8,86,8],[85,11,86,11],[62,2,62,3],[85,7,86,7],[71,1,71,3],[90,14,90,15],[91,14,91,15],[91,16,91,19],[71,5,71,8],[38,10,38,12],[71,10,71,12],[89,9,89,10],[89,16,89,19],[85,2,86,2],[56,16,56,19],[57,9,57,10],[57,16,57,19],[71,19,82,19],[85,13,86,13],[66,11,66,19],[87,14,87,15],[88,14,88,15],[89,14,89,15],[87,16,87,19],[88,9,88,10],[88,16,88,19]]}
["إدارة منشاة القناطر التعليمية",null,null,null,null,null,null,null,null,null,null,"طلب مكافاة الحصص الزائدة عن النصاب",null,null,null,null,null,null,null,null,null,"نوفمبر","محمد ناجى","1/6","ريادة"]
["مدرسة المنصورية الابتدائية المشتركة",null,null,null,null,null,null,null,null,null,null,null,null,"نصاب المعلم",null,null,null,null,null,{"$f":"VLOOKUP(الجدول!$P$1,ورقة2!$A$2:$F$30,6,0)","v":22},null,2021,"عطيه عبدالغفار","6/6","ريادة"]
["اسم المدرس /",null,{"$f":"VLOOKUP(الجدول!$P$1,ورقة2!$A$2:$F$30,2,0)","v":"سعيد عبدالباسط حسين محمد"},null,null,null,null,null,null,null,null,"المادة /",null,{"$f":"VLOOKUP(الجدول!$P$1,ورقة2!$A$2:$F$30,4,0)","v":"فصل / رياضيات"},null,null,null,null,null,null,null,null,"صابر صالح","3/6","ريادة"]
["الوظيفة على الكادر  /",null,null,{"$f":"VLOOKUP(الجدول!$P$1,ورقة2!$A$2:$F$30,3,0)","v":"معلم اول  "},null,null,null,null,null,null,null,"التخصص  /",null,{"$f":"VLOOKUP(الجدول!$P$1,ورقة2!$A$2:$F$30,5,0)","v":"فصل"},null,null,null,null,null,null,null,null,"نورا كامل","2/6","ريادة"]
["صورة من الجدول الاسبوعى للمدرس",null,null,null,null,null,null,null,null,null,null,null,null,null,null,null,null,null,null,null,null,null,"فاطمه كامل","4/5","ريادة"]
["اليوم","فترة صباحية ",null,null,{"$f":"VLOOKUP(الجدول!$P$1,ورقة2!$A$2:$J$30,7,0)","v":36},"حصة",null,null,null,null,"فترة مسائية ",null,null,{"$f":"'T2'!$J$5","v":33},"حصة",null,null,null,null,"تحاط الحصص\nالزائدة عن النصاب\nبدائرة حمراء",null,null,"زكيه سيد","4/6","ريادة"]
{"$rows_left_out":94}
{"sheet":"ورقة1","index":5,"n_rows":36,"n_cols":23,"rows_kept":36,"cut":false,"hidden":false,"merged":[[3,0,3,17],[4,0,5,0],[4,1,5,1],[4,2,5,2],[4,3,4,7],[4,8,4,12],[4,13,5,13],[4,14,5,14],[4,15,5,15],[4,16,5,16],[35,14,35,17],[4,17,5,17],[23,14,23,17],[27,14,27,17],[28,14,28,17],[29,14,29,17],[30,14,30,17],[26,14,26,17],[32,0,32,1],[34,4,34,6],[34,7,34,12],[34,14,34,17],[33,12,33,13],[33,5,33,11]]}
["محافظة الجيزة"]
["إدارة منشاة القناطر التعليمية"]
["مدرسة المنصورية الابتدائية المشتركة"]
["كشف تفريغ الحصص الزائدة عن النصاب عن شهر نوفمبر 2021"]
["م","الاســـــــــــــــــــــــــم","الوظيفة","حصص زائدة فترة صباحية",null,null,null,null,"حصص زائدة فترة مسائية",null,null,null,null,"اجمالى الحصص الزائدة","الصف","عدد الفصول","عدد الحصص","الجملة"]
[null,null,null,"النصاب","المنفذ","الزيادة في أسبوع","حصص بدون اجر","جملة الحصص الزائدة","النصاب","المنفذ","الزيادة في أسبوع","حصص بدون اجر","جملة الحصص الزائدة",null,null,null,null,null,null,null,null,null,159]
{"$rows_left_out":31}
{"sheet":"ورقة2","index":6,"n_rows":28,"n_cols":10,"rows_kept":28,"cut":false,"hidden":false,"merged":[]}
["م","الاسم","الوظيفة","المادة","التخصص","النصاب","المنفذ صباحى","منفذ مسائي","زيادة صباحى","زيادة مسائى"]
[1,"محمد ناجي محمد عويضة","خبير","فصل / رياضيات","فصل ",18,36,37,{"$f":"30-F2","v":12},30]
[2,"عطيه عبدالغفار احمد محمد","معلم اول أ","فصل / رياضيات","فصل",20,36,37,{"$f":"30-F3","v":10},30]
[3,"صابر صالح عبدالحميدسالم","معلم اول","فصل / عربي ودين","عربي ودين",22,36,35,8,30]
[4,"نورا كامل محمد الاطروش","معلم اول","فصل / عربي ودين","فصل",22,36,34,8,30]
[5,"فاطمه كامل عامر عبدالهادى","معلم اول  ","فصل / عربي ودين","عربي ودين",22,36,34,8,30]
{"$rows_left_out":22}