{"text_format":"1","workbook":"xlsx","n_sheets":4,"sheets":["ورقة1","رصد الدرجات","مسودة الدرجات","الشهادة"],"not_rendered":{"charts":0,"images":11,"macros":1,"external_links":0,"defined_names":4,"comments":0,"pivot_tables":0},"unopened":[],"bounds":{"document_bytes":16777216,"sheet_cells":100000,"rows_first":2000,"rows_last":500,"rows_between":2000,"halvings":0,"cell_chars":16384,"cell_head_chars":4096},"cells_cut":0,"cells_raw":0,"read":"whole","date_system":"1900"}

{"sheet":"ورقة1","index":0,"n_rows":4,"n_cols":3,"rows_kept":4,"cut":false,"hidden":false,"merged":[[3,2,3,17]]}
[]
[]
[]
[null,null,"فضلا قم بتمكين وحدات الماكرو لكي تتمكن من فتح هذا المصنف وذلك باتباع الخطوات المصورة أدناه "]

{"sheet":"رصد الدرجات","index":1,"n_rows":36,"n_cols":35,"rows_kept":36,"cut":false,"hidden":true,"merged":[[1,5,1,22],[1,23,1,26],[1,27,1,33],[3,29,3,34],[3,0,5,0],[3,1,5,1],[3,5,3,10],[3,11,3,16],[3,17,3,22],[3,23,3,28],[3,2,5,2],[3,4,5,4]]}
[]
[null,null,null,null,null,"مسودة رصد الاختبارات الشهرية والنهائية للفصلين للعام الدراسي ",null,null,null,null,null,null,null,null,null,null,null,null,null,null,null,null,null,null,null,null,null,"للصف ( الأول )"]
[]
["م","اسم الطالب","اللقب",null,"الجنسية ","القرآن الكريم ",null,null,null,null,null,"التربية الإسلامية ",null,null,null,null,null,"اللغة العربية ",null,null,null,null,null,"الرياضيات ",null,null,null,null,null,"العلوم"]
[null,null,null,"النوع",null,"اكتوبر","نوفمبر","نهائي الفصل","يناير","فبراير","نهائي العام","اكتوبر","نوفمبر","نهائي الفصل","يناير","فبراير","نهائي العام","اكتوبر","نوفمبر","نهائي الفصل","يناير","فبراير","نهائي العام","اكتوبر","نوفمبر","نهائي الفصل","يناير","فبراير","نهائي العام","اكتوبر","نوفمبر","نهائي الفصل","يناير","فبراير","نهائي العام"]
[null,null,null,null,null,100,100,30,100,100,30,100,100,30,100,100,30,100,100,30,100,100,30,100,100,30,100,100,30,100,100,30,100,100,30]
[1,"أحمد ناصر أحمد صالح حيدره","حيدره","ذكر","يمني",90,100,30,null,null,null,100,93,28,null,null,null,92,91,29,null,null,null,100,94,30,null,null,null,100,100,30]
[2,"الخضر عبدالله الخضر عبدالله عمر","عمر","ذكر ","يمني",90,100,30,null,null,null,100,100,30,null,null,null,100,98,30,null,null,null,100,100,30,null,null,null,100,100,30]
[3,"بيان حسين سعيد علي حقروص","حقروص","أنثى","يمنية",100,100,30,null,null,null,100,100,30,null,null,null,100,100,30,null,null,null,100,100,30,null,null,null,100,100,30]
[4,"جود أحمد صالح طالب معيض","معيض","أنثى","يمنية",100,100,30,null,null,null,100,100,30,null,null,null,100,100,30,null,null,null,100,100,30,null,null,null,100,100,30]
[5,"دانه صالح حسين ناصر دوح","دوح","أنثى","يمنية",90,100,28,null,null,null,100,100,30,null,null,null,94,100,30,null,null,null,100,96,30,null,null,null,100,100,30]
[6,"راكان محمد أحمد ناصر معيض","معيض","ذكر","يمني",100,100,30,null,null,null,100,100,30,null,null,null,100,100,30,null,null,null,100,100,30,null,null,null,100,100,30]
[7,"رحاب ماجد عمر علي حقروص","حقروص","أنثى","يمنية",100,100,30,null,null,null,100,100,30,null,null,null,98,98,30,null,null,null,100,98,30,null,null,null,97,98,30]
[8,"رسيل نايف صالح عيدروس دوح","دوح","أنثى","يمنية",100,100,30,null,null,null,100,100,30,null,null,null,100,100,30,null,null,null,100,100,30,null,null,null,100,100,30]
[9,"رندى أحمد سعيد منصور السمع","السمع","أنثى","يمنية",98,95,30,null,null,null,100,100,30,null,null,null,100,100,30,null,null,null,100,100,30,null,null,null,100,100,30]
[10,"سلمان محمد رويس محمد لحنف","لحنف","ذكر","يمني",100,100,30,null,null,null,100,100,30,null,null,null,96,91,30,null,null,null,100,100,30,null,null,null,95,100,30]
[11,"علي أحمد عبدالله علي حقروص","حقروص","ذكر","يمني",90,100,30,null,null,null,100,100,30,null,null,null,95,92,29,null,null,null,100,100,30,null,null,null,100,100,30]
[12,"فاطمة عبدالله رويس محمد لحنف","لحنف","أنثى","يمنية",90,100,26,null,null,null,93,100,30,null,null,null,68,88,28,null,null,null,94,96,28,null,null,null,93,100,30]
[13,"لمى ناظم أحمد صالح حقروص","حقروص","أنثى","يمنية",100,100,30,null,null,null,100,100,30,null,null,null,100,100,30,null,null,null,100,100,30,null,null,null,100,100,30]
[14,"محمد سالم صالح عيدروس دوح","دوح","ذكر","يمني",100,100,30,null,null,null,100,100,30,null,null,null,100,100,30,null,null,null,100,100,30,null,null,null,100,100,30]
[15,"محمد علي سعيد حسين يوس","يوس","ذكر","يمني",100,100,30,null,null,null,100,98,30,null,null,null,96,92,30,null,null,null,100,100,30,null,null,null,100,100,30]
[16,"منه أحمد سالم أحمد معيض","معيض","أنثى","يمنية",100,100,30,null,null,null,100,100,30,null,null,null,98,97,29,null,null,null,100,100,30,null,null,null,100,100,30]
[17,"هيفاء عيضة عمر علي حقروص","حقروص","أنثى","يمنية",90,100,30,null,null,null,100,100,30,null,null,null,100,96,30,null,null,null,100,98,30,null,null,null,100,98,30]
[18,"نواف أحمد محسن عبدالله البريكي","البريكي","ذكر","يمني",90,100,30,null,null,null,100,100,30,null,null,null,100,100,29,null,null,null,100,100,30,null,null,null,100,100,30]
[19]
[20]
[21]
[22]
[23]
[24]
{"$rows_left_out":7}
{"sheet":"مسودة الدرجات","index":2,"n_rows":42,"n_cols":20,"rows_kept":42,"cut":false,"hidden":true,"merged":[[0,16,0,19],[0,14,0,15],[1,16,1,17],[3,2,4,15],[4,16,4,18],[2,16,2,17],[40,8,40,11],[40,16,40,18],[5,19,7,19],[5,17,6,17],[5,18,7,18],[5,0,7,0],[5,2,5,4],[5,5,5,7],[5,8,5,10],[5,14,5,16],[5,11,5,13],[5,1,7,1]]}
[null,null,null,null,null,null,null,null,null,null,null,null,null,null,"مدرسة /"]
[null,null,null,null,null,null,null,null,null,null,null,null,null,null,null,"الصف /","الأول"]
[null,null,null,null,null,null,null,null,null,null,null,null,null,null,null,"الشعبة /"]
[null,null,"كشوفات رصد درجات أعمال وامتحانات الفصل الدراسي الأول في المرحلة الأساسية للعام الدراسي "]
[]
["رقم مسلسل","اســـــــم الطالـــب ","القرآن الكريم ",null,null,"التربية الإسلامية ",null,null,"اللغة العربية ",null,null,"الرياضيات ",null,null,"العلوم ",null,null,"المجموع الكلي","نتيجة الفصل الأول","الملاحظات "]
[null,null,"محصلة الفصل الأول","امتحان الفصل الأول","المجموع","محصلة الفصل الأول","امتحان الفصل الأول","المجموع","محصلة الفصل الأول","امتحان الفصل الأول","المجموع","محصلة الفصل الأول","امتحان الفصل الأول","المجموع","محصلة الفصل الأول","امتحان الفصل الأول","المجموع"]
[null,null,20,30,50,20,30,50,20,30,50,20,30,50,20,30,50,250]
[1,{"$f":"'رصد الدرجات'!B7","v":"أحمد ناصر أحمد صالح حيدره"},{"$f":"('رصد الدرجات'!F7+'رصد الدرجات'!G7)/10","v":19},{"$f":"'رصد الدرجات'!H7","v":30},{"$f":"ROUND((C9+D9),0)","v":49},{"$f":"('رصد الدرجات'!L7+'رصد الدرجات'!M7)/10","v":19.3},{"$f":"'رصد الدرجات'!N7","v":28},{"$f":"ROUND((F9+G9),0)","v":47},{"$f":"('رصد الدرجات'!R7+'رصد الدرجات'!S7)/10","v":18.3},{"$f":"'رصد الدرجات'!T7","v":29},{"$f":"ROUND((I9+J9),0)","v":47},{"$f":"('رصد الدرجات'!X7+'رصد الدرجات'!Y7)/10","v":19.399999999999999},{"$f":"'رصد الدرجات'!Z7","v":30},{"$f":"ROUND((L9+M9),0)","v":49},{"$f":"('رصد الدرجات'!AD7+'رصد الدرجات'!AE7)/10","v":20},{"$f":"'رصد الدرجات'!AF7","v":30},{"$f":"ROUND((O9+P9),0)","v":50},{"$f":"ROUND((Q9+N9+K9+H9+E9),0)","v":242},{"$f":"IF(R9=0,\"\",(IF(AND(Q9>=25,N9>=25,K9>=25,H9>=25,E9>=25),\"ناجح\",\"راسب\")))","v":"ناجح"},{"$f":"SUM(IF(R9<$R$9:$R$38,1/COUNTIF($R$9:$R$38,$R$9:$R$38)))+1","v":5.9999999999999991}]
[2,{"$f":"'رصد الدرجات'!B8","v":"الخضر عبدالله الخضر عبدالله عمر"},{"$f":"('رصد الدرجات'!F8+'رصد الدرجات'!G8)/10","v":19},{"$f":"'رصد الدرجات'!H8","v":30},{"$f":"ROUND((C10+D10),0)","v":49},{"$f":"('رصد الدرجات'!L8+'رصد الدرجات'!M8)/10","v":20},{"$f":"'رصد الدرجات'!N8","v":30},{"$f":"ROUND((F10+G10),0)","v":50},{"$f":"('رصد الدرجات'!R8+'رصد الدرجات'!S8)/10","v":19.8},{"$f":"'رصد الدرجات'!T8","v":30},{"$f":"ROUND((I10+J10),0)","v":50},{"$f":"('رصد الدرجات'!X8+'رصد الدرجات'!Y8)/10","v":20},{"$f":"'رصد الدرجات'!Z8","v":30},{"$f":"ROUND((L10+M10),0)","v":50},{"$f":"('رصد الدرجات'!AD8+'رصد الدرجات'!AE8)/10","v":20},{"$f":"'رصد الدرجات'!AF8","v":30},{"$f":"ROUND((O10+P10),0)","v":50},{"$f":"ROUND((Q10+N10+K10+H10+E10),0)","v":249},{"$f":"IF(R10=0,\"\",(IF(AND(Q10>=25,N10>=25,K10>=25,H10>=25,E10>=25),\"ناجح\",\"راسب\")))","v":"ناجح"},{"$f":"SUM(IF(R10<$R$9:$R$38,1/COUNTIF($R$9:$R$38,$R$9:$R$38)))+1","v":1.9999999999999998}]
[3,{"$f":"'رصد الدرجات'!B9","v":"بيان حسين سعيد علي حقروص"},{"$f":"('رصد الدرجات'!F9+'رصد الدرجات'!G9)/10","v":20},{"$f":"'رصد الدرجات'!H9","v":30},50,{"$f":"('رصد الدرجات'!L9+'رصد الدرجات'!M9)/10","v":20},{"$f":"'رصد الدرجات'!N9","v":30},50,{"$f":"('رصد الدرجات'!R9+'رصد الدرجات'!S9)/10","v":20},{"$f":"'رصد الدرجات'!T9","v":30},50,{"$f":"('رصد الدرجات'!X9+'رصد الدرجات'!Y9)/10","v":20},{"$f":"'رصد الدرجات'!Z9","v":30},50,{"$f":"('رصد الدرجات'!AD9+'رصد الدرجات'!AE9)/10","v":20},{"$f":"'رصد الدرجات'!AF9","v":30},50,250,"ناجح",{"$f":"SUM(IF(R11<$R$9:$R$38,1/COUNTIF($R$9:$R$38,$R$9:$R$38)))+1","v":1}]
[4,{"$f":"'رصد الدرجات'!B10","v":"جود أحمد صالح طالب معيض"},{"$f":"('رصد الدرجات'!F10+'رصد الدرجات'!G10)/10","v":20},{"$f":"'رصد الدرجات'!H10","v":30},50,{"$f":"('رصد الدرجات'!L10+'رصد الدرجات'!M10)/10","v":20},{"$f":"'رصد الدرجات'!N10","v":30},50,{"$f":"('رصد الدرجات'!R10+'رصد الدرجات'!S10)/10","v":20},{"$f":"'رصد الدرجات'!T10","v":30},50,{"$f":"('رصد الدرجات'!X10+'رصد الدرجات'!Y10)/10","v":20},{"$f":"'رصد الدرجات'!Z10","v":30},50,{"$f":"('رصد الدرجات'!AD10+'رصد الدرجات'!AE10)/10","v":20},{"$f":"'رصد الدرجات'!AF10","v":30},50,250,"ناجح",{"$f":"SUM(IF(R12<$R$9:$R$38,1/COUNTIF($R$9:$R$38,$R$9:$R$38)))+1","v":1}]
[5,{"$f":"'رصد الدرجات'!B11","v":"دانه صالح حسين ناصر دوح"},{"$f":"('رصد الدرجات'!F11+'رصد الدرجات'!G11)/10","v":19},{"$f":"'رصد الدرجات'!H11","v":28},47,{"$f":"('رصد الدرجات'!L11+'رصد الدرجات'!M11)/10","v":20},{"$f":"'رصد الدرجات'!N11","v":30},50,{"$f":"('رصد الدرجات'!R11+'رصد الدرجات'!S11)/10","v":19.399999999999999},{"$f":"'رصد الدرجات'!T11","v":30},49,{"$f":"('رصد الدرجات'!X11+'رصد الدرجات'!Y11)/10","v":19.600000000000001},{"$f":"'رصد الدرجات'!Z11","v":30},50,{"$f":"('رصد الدرجات'!AD11+'رصد الدرجات'!AE11)/10","v":20},{"$f":"'رصد الدرجات'!AF11","v":30},50,246,"ناجح",{"$f":"SUM(IF(R13<$R$9:$R$38,1/COUNTIF($R$9:$R$38,$R$9:$R$38)))+1","v":5}]
[6,{"$f":"'رصد الدرجات'!B12","v":"راكان محمد أحمد ناصر معيض"},{"$f":"('رصد الدرجات'!F12+'رصد الدرجات'!G12)/10","v":20},{"$f":"'رصد الدرجات'!H12","v":30},50,{"$f":"('رصد الدرجات'!L12+'رصد الدرجات'!M12)/10","v":20},{"$f":"'رصد الدرجات'!N12","v":30},50,{"$f":"('رصد الدرجات'!R12+'رصد الدرجات'!S12)/10","v":20},{"$f":"'رصد الدرجات'!T12","v":30},50,{"$f":"('رصد الدرجات'!X12+'رصد الدرجات'!Y12)/10","v":20},{"$f":"'رصد الدرجات'!Z12","v":30},50,{"$f":"('رصد الدرجات'!AD12+'رصد الدرجات'!AE12)/10","v":20},{"$f":"'رصد الدرجات'!AF12","v":30},50,250,"ناجح",{"$f":"SUM(IF(R14<$R$9:$R$38,1/COUNTIF($R$9:$R$38,$R$9:$R$38)))+1","v":1}]
[7,{"$f":"'رصد الدرجات'!B13","v":"رحاب ماجد عمر علي حقروص"},{"$f":"('رصد الدرجات'!F13+'رصد الدرجات'!G13)/10","v":20},{"$f":"'رصد الدرجات'!H13","v":30},50,{"$f":"('رصد الدرجات'!L13+'رصد الدرجات'!M13)/10","v":20},{"$f":"'رصد الدرجات'!N13","v":30},50,{"$f":"('رصد الدرجات'!R13+'رصد الدرجات'!S13)/10","v":19.600000000000001},{"$f":"'رصد الدرجات'!T13","v":30},50,{"$f":"('رصد الدرجات'!X13+'رصد الدرجات'!Y13)/10","v":19.8},{"$f":"'رصد الدرجات'!Z13","v":30},50,{"$f":"('رصد الدرجات'!AD13+'رصد الدرجات'!AE13)/10","v":19.5},{"$f":"'رصد الدرجات'!AF13","v":30},50,250,"ناجح",{"$f":"SUM(IF(R15<$R$9:$R$38,1/COUNTIF($R$9:$R$38,$R$9:$R$38)))+1","v":1}]
[8,{"$f":"'رصد الدرجات'!B14","v":"رسيل نايف صالح عيدروس دوح"},{"$f":"('رصد الدرجات'!F14+'رصد الدرجات'!G14)/10","v":20},{"$f":"'رصد الدرجات'!H14","v":30},50,{"$f":"('رصد الدرجات'!L14+'رصد الدرجات'!M14)/10","v":20},{"$f":"'رصد الدرجات'!N14","v":30},50,{"$f":"('رصد الدرجات'!R14+'رصد الدرجات'!S14)/10","v":20},{"$f":"'رصد الدرجات'!T14","v":30},50,{"$f":"('رصد الدرجات'!X14+'رصد الدرجات'!Y14)/10","v":20},{"$f":"'رصد الدرجات'!Z14","v":30},50,{"$f":"('رصد الدرجات'!AD14+'رصد الدرجات'!AE14)/10","v":20},{"$f":"'رصد الدرجات'!AF14","v":30},50,250,"ناجح",{"$f":"SUM(IF(R16<$R$9:$R$38,1/COUNTIF($R$9:$R$38,$R$9:$R$38)))+1","v":1}]
[9,{"$f":"'رصد الدرجات'!B15","v":"رندى أحمد سعيد منصور السمع"},{"$f":"('رصد الدرجات'!F15+'رصد الدرجات'!G15)/10","v":19.3},{"$f":"'رصد الدرجات'!H15","v":30},49,{"$f":"('رصد الدرجات'!L15+'رصد الدرجات'!M15)/10","v":20},{"$f":"'رصد الدرجات'!N15","v":30},50,{"$f":"('رصد الدرجات'!R15+'رصد الدرجات'!S15)/10","v":20},{"$f":"'رصد الدرجات'!T15","v":30},50,{"$f":"('رصد الدرجات'!X15+'رصد الدرجات'!Y15)/10","v":20},{"$f":"'رصد الدرجات'!Z15","v":30},50,{"$f":"('رصد الدرجات'!AD15+'رصد الدرجات'!AE15)/10","v":20},{"$f":"'رصد الدرجات'!AF15","v":30},50,249,"ناجح",{"$f":"SUM(IF(R17<$R$9:$R$38,1/COUNTIF($R$9:$R$38,$R$9:$R$38)))+1","v":1.9999999999999998}]
[10,{"$f":"'رصد الدرجات'!B16","v":"سلمان محمد رويس محمد لحنف"},{"$f":"('رصد الدرجات'!F16+'رصد الدرجات'!G16)/10","v":20},{"$f":"'رصد الدرجات'!H16","v":30},50,{"$f":"('رصد الدرجات'!L16+'رصد الدرجات'!M16)/10","v":20},{"$f":"'رصد الدرجات'!N16","v":30},50,{"$f":"('رصد الدرجات'!R16+'رصد الدرجات'!S16)/10","v":18.7},{"$f":"'رصد الدرجات'!T16","v":30},49,{"$f":"('رصد الدرجات'!X16+'رصد الدرجات'!Y16)/10","v":20},{"$f":"'رصد الدرجات'!Z16","v":30},50,{"$f":"('رصد الدرجات'!AD16+'رصد الدرجات'!AE16)/10","v":19.5},{"$f":"'رصد الدرجات'!AF16","v":30},50,249,"ناجح",{"$f":"SUM(IF(R18<$R$9:$R$38,1/COUNTIF($R$9:$R$38,$R$9:$R$38)))+1","v":1.9999999999999998}]
[11,{"$f":"'رصد الدرجات'!B17","v":"علي أحمد عبدالله علي حقروص"},{"$f":"('رصد الدرجات'!F17+'رصد الدرجات'!G17)/10","v":19},{"$f":"'رصد الدرجات'!H17","v":30},49,{"$f":"('رصد الدرجات'!L17+'رصد الدرجات'!M17)/10","v":20},{"$f":"'رصد الدرجات'!N17","v":30},50,{"$f":"('رصد الدرجات'!R17+'رصد الدرجات'!S17)/10","v":18.7},{"$f":"'رصد الدرجات'!T17","v":29},48,{"$f":"('رصد الدرجات'!X17+'رصد الدرجات'!Y17)/10","v":20},{"$f":"'رصد الدرجات'!Z17","v":30},50,{"$f":"('رصد الدرجات'!AD17+'رصد الدرجات'!AE17)/10","v":20},{"$f":"'رصد الدرجات'!AF17","v":30},50,247,"ناجح",{"$f":"SUM(IF(R19<$R$9:$R$38,1/COUNTIF($R$9:$R$38,$R$9:$R$38)))+1","v":4}]
[12,{"$f":"'رصد الدرجات'!B18","v":"فاطمة عبدالله رويس محمد لحنف"},{"$f":"('رصد الدرجات'!F18+'رصد الدرجات'!G18)/10","v":19},{"$f":"'رصد الدرجات'!H18","v":26},45,{"$f":"('رصد الدرجات'!L18+'رصد الدرجات'!M18)/10","v":19.3},{"$f":"'رصد الدرجات'!N18","v":30},49,{"$f":"('رصد الدرجات'!R18+'رصد الدرجات'!S18)/10","v":15.6},{"$f":"'رصد الدرجات'!T18","v":28},44,{"$f":"('رصد الدرجات'!X18+'رصد الدرجات'!Y18)/10","v":19},{"$f":"'رصد الدرجات'!Z18","v":28},47,{"$f":"('رصد الدرجات'!AD18+'رصد الدرجات'!AE18)/10","v":19.3},{"$f":"'رصد الدرجات'!AF18","v":30},49,234,"ناجح",{"$f":"SUM(IF(R20<$R$9:$R$38,1/COUNTIF($R$9:$R$38,$R$9:$R$38)))+1","v":7.0000000000000009}]
[13,{"$f":"'رصد الدرجات'!B19","v":"لمى ناظم أحمد صالح حقروص"},{"$f":"('رصد الدرجات'!F19+'رصد الدرجات'!G19)/10","v":20},{"$f":"'رصد الدرجات'!H19","v":30},50,{"$f":"('رصد الدرجات'!L19+'رصد الدرجات'!M19)/10","v":20},{"$f":"'رصد الدرجات'!N19","v":30},50,{"$f":"('رصد الدرجات'!R19+'رصد الدرجات'!S19)/10","v":20},{"$f":"'رصد الدرجات'!T19","v":30},50,{"$f":"('رصد الدرجات'!X19+'رصد الدرجات'!Y19)/10","v":20},{"$f":"'رصد الدرجات'!Z19","v":30},50,{"$f":"('رصد الدرجات'!AD19+'رصد الدرجات'!AE19)/10","v":20},{"$f":"'رصد الدرجات'!AF19","v":30},50,250,"ناجح",{"$f":"SUM(IF(R21<$R$9:$R$38,1/COUNTIF($R$9:$R$38,$R$9:$R$38)))+1","v":1}]
[14,{"$f":"'رصد الدرجات'!B20","v":"محمد سالم صالح عيدروس دوح"},{"$f":"('رصد الدرجات'!F20+'رصد الدرجات'!G20)/10","v":20},{"$f":"'رصد الدرجات'!H20","v":30},50,{"$f":"('رصد الدرجات'!L20+'رصد الدرجات'!M20)/10","v":20},{"$f":"'رصد الدرجات'!N20","v":30},50,{"$f":"('رصد الدرجات'!R20+'رصد الدرجات'!S20)/10","v":20},{"$f":"'رصد الدرجات'!T20","v":30},50,{"$f":"('رصد الدرجات'!X20+'رصد الدرجات'!Y20)/10","v":20},{"$f":"'رصد الدرجات'!Z20","v":30},50,{"$f":"('رصد الدرجات'!AD20+'رصد الدرجات'!AE20)/10","v":20},{"$f":"'رصد الدرجات'!AF20","v":30},50,250,"ناجح",{"$f":"SUM(IF(R22<$R$9:$R$38,1/COUNTIF($R$9:$R$38,$R$9:$R$38)))+1","v":1}]
[15,{"$f":"'رصد الدرجات'!B21","v":"محمد علي سعيد حسين يوس"},{"$f":"('رصد الدرجات'!F21+'رصد الدرجات'!G21)/10","v":20},{"$f":"'رصد الدرجات'!H21","v":30},50,{"$f":"('رصد الدرجات'!L21+'رصد الدرجات'!M21)/10","v":19.8},{"$f":"'رصد الدرجات'!N21","v":30},50,{"$f":"('رصد الدرجات'!R21+'رصد الدرجات'!S21)/10","v":18.8},{"$f":"'رصد الدرجات'!T21","v":30},49,{"$f":"('رصد الدرجات'!X21+'رصد الدرجات'!Y21)/10","v":20},{"$f":"'رصد الدرجات'!Z21","v":30},50,{"$f":"('رصد الدرجات'!AD21+'رصد الدرجات'!AE21)/10","v":20},{"$f":"'رصد الدرجات'!AF21","v":30},50,249,"ناجح",{"$f":"SUM(IF(R23<$R$9:$R$38,1/COUNTIF($R$9:$R$38,$R$9:$R$38)))+1","v":1.9999999999999998}]
[16,{"$f":"'رصد الدرجات'!B22","v":"منه أحمد سالم أحمد معيض"},{"$f":"('رصد الدرجات'!F22+'رصد الدرجات'!G22)/10","v":20},{"$f":"'رصد الدرجات'!H22","v":30},50,{"$f":"('رصد الدرجات'!L22+'رصد الدرجات'!M22)/10","v":20},{"$f":"'رصد الدرجات'!N22","v":30},50,{"$f":"('رصد الدرجات'!R22+'رصد الدرجات'!S22)/10","v":19.5},{"$f":"'رصد الدرجات'!T22","v":29},49,{"$f":"('رصد الدرجات'!X22+'رصد الدرجات'!Y22)/10","v":20},{"$f":"'رصد الدرجات'!Z22","v":30},50,{"$f":"('رصد الدرجات'!AD22+'رصد الدرجات'!AE22)/10","v":20},{"$f":"'رصد الدرجات'!AF22","v":30},50,249,"ناجح",{"$f":"SUM(IF(R24<$R$9:$R$38,1/COUNTIF($R$9:$R$38,$R$9:$R$38)))+1","v":1.9999999999999998}]
[17,{"$f":"'رصد الدرجات'!B23","v":"هيفاء عيضة عمر علي حقروص"},{"$f":"('رصد الدرجات'!F23+'رصد الدرجات'!G23)/10","v":19},{"$f":"'رصد الدرجات'!H23","v":30},49,{"$f":"('رصد الدرجات'!L23+'رصد الدرجات'!M23)/10","v":20},{"$f":"'رصد الدرجات'!N23","v":30},50,{"$f":"('رصد الدرجات'!R23+'رصد الدرجات'!S23)/10","v":19.600000000000001},{"$f":"'رصد الدرجات'!T23","v":30},50,{"$f":"('رصد الدرجات'!X23+'رصد الدرجات'!Y23)/10","v":19.8},{"$f":"'رصد الدرجات'!Z23","v":30},50,{"$f":"('رصد الدرجات'!AD23+'رصد الدرجات'!AE23)/10","v":19.8},{"$f":"'رصد الدرجات'!AF23","v":30},50,249,"ناجح",{"$f":"SUM(IF(R25<$R$9:$R$38,1/COUNTIF($R$9:$R$38,$R$9:$R$38)))+1","v":1.9999999999999998}]
[18,{"$f":"'رصد الدرجات'!B24","v":"نواف أحمد محسن عبدالله البريكي"},{"$f":"('رصد الدرجات'!F24+'رصد الدرجات'!G24)/10","v":19},{"$f":"'رصد الدرجات'!H24","v":30},49,{"$f":"('رصد الدرجات'!L24+'رصد الدرجات'!M24)/10","v":20},{"$f":"'رصد الدرجات'!N24","v":30},50,{"$f":"('رصد الدرجات'!R24+'رصد الدرجات'!S24)/10","v":20},{"$f":"'رصد الدرجات'!T24","v":29},49,{"$f":"('رصد الدرجات'!X24+'رصد الدرجات'!Y24)/10","v":20},{"$f":"'رصد الدرجات'!Z24","v":30},50,{"$f":"('رصد الدرجات'!AD24+'رصد الدرجات'!AE24)/10","v":20},{"$f":"'رصد الدرجات'!AF24","v":30},50,248,"ناجح",{"$f":"SUM(IF(R26<$R$9:$R$38,1/COUNTIF($R$9:$R$38,$R$9:$R$38)))+1","v":3}]
[19,{"$f":"'رصد الدرجات'!B25","v":0},{"$f":"('رصد الدرجات'!F25+'رصد الدرجات'!G25)/10","v":0},{"$f":"'رصد الدرجات'!H25","v":0},0,{"$f":"('رصد الدرجات'!L25+'رصد الدرجات'!M25)/10","v":0},{"$f":"'رصد الدرجات'!N25","v":0},0,{"$f":"('رصد الدرجات'!R25+'رصد الدرجات'!S25)/10","v":0},{"$f":"'رصد الدرجات'!T25","v":0},0,{"$f":"('رصد الدرجات'!X25+'رصد الدرجات'!Y25)/10","v":0},{"$f":"'رصد الدرجات'!Z25","v":0},0,{"$f":"('رصد الدرجات'!AD25+'رصد الدرجات'!AE25)/10","v":0},{"$f":"'رصد الدرجات'!AF25","v":0},0,0,"",{"$f":"SUM(IF(R27<$R$9:$R$38,1/COUNTIF($R$9:$R$38,$R$9:$R$38)))+1","v":8}]
[20,{"$f":"'رصد الدرجات'!B26","v":0},{"$f":"('رصد الدرجات'!F26+'رصد الدرجات'!G26)/10","v":0},{"$f":"'رصد الدرجات'!H26","v":0},0,{"$f":"('رصد الدرجات'!L26+'رصد الدرجات'!M26)/10","v":0},{"$f":"'رصد الدرجات'!N26","v":0},0,{"$f":"('رصد الدرجات'!R26+'رصد الدرجات'!S26)/10","v":0},{"$f":"'رصد الدرجات'!T26","v":0},0,{"$f":"('رصد الدرجات'!X26+'رصد الدرجات'!Y26)/10","v":0},{"$f":"'رصد الدرجات'!Z26","v":0},0,{"$f":"('رصد الدرجات'!AD26+'رصد الدرجات'!AE26)/10","v":0},{"$f":"'رصد الدرجات'!AF26","v":0},0,0,"",{"$f":"SUM(IF(R28<$R$9:$R$38,1/COUNTIF($R$9:$R$38,$R$9:$R$38)))+1","v":8}]
[21,{"$f":"'رصد الدرجات'!B27","v":0},{"$f":"('رصد الدرجات'!F27+'رصد الدرجات'!G27)/10","v":0},{"$f":"'رصد الدرجات'!H27","v":0},0,{"$f":"('رصد الدرجات'!L27+'رصد الدرجات'!M27)/10","v":0},{"$f":"'رصد الدرجات'!N27","v":0},0,{"$f":"('رصد الدرجات'!R27+'رصد الدرجات'!S27)/10","v":0},{"$f":"'رصد الدرجات'!T27","v":0},0,{"$f":"('رصد الدرجات'!X27+'رصد الدرجات'!Y27)/10","v":0},{"$f":"'رصد الدرجات'!Z27","v":0},0,{"$f":"('رصد الدرجات'!AD27+'رصد الدرجات'!AE27)/10","v":0},{"$f":"'رصد الدرجات'!AF27","v":0},0,0,"",{"$f":"SUM(IF(R29<$R$9:$R$38,1/COUNTIF($R$9:$R$38,$R$9:$R$38)))+1","v":8}]
[22,{"$f":"'رصد الدرجات'!B28","v":0},{"$f":"('رصد الدرجات'!F28+'رصد الدرجات'!G28)/10","v":0},{"$f":"'رصد الدرجات'!H28","v":0},0,{"$f":"('رصد الدرجات'!L28+'رصد الدرجات'!M28)/10","v":0},{"$f":"'رصد الدرجات'!N28","v":0},0,{"$f":"('رصد الدرجات'!R28+'رصد الدرجات'!S28)/10","v":0},{"$f":"'رصد الدرجات'!T28","v":0},0,{"$f":"('رصد الدرجات'!X28+'رصد الدرجات'!Y28)/10","v":0},{"$f":"'رصد الدرجات'!Z28","v":0},0,{"$f":"('رصد الدرجات'!AD28+'رصد الدرجات'!AE28)/10","v":0},{"$f":"'رصد الدرجات'!AF28","v":0},0,0,"",{"$f":"SUM(IF(R30<$R$9:$R$38,1/COUNTIF($R$9:$R$38,$R$9:$R$38)))+1","v":8}]
{"$rows_left_out":13}
{"sheet":"الشهادة","index":3,"n_rows":25,"n_cols":13,"rows_kept":25,"cut":false,"hidden":true,"merged":[[24,1,24,3],[24,8,24,11],[20,1,20,2],[21,1,21,2],[22,1,22,2],[20,10,20,12],[21,10,21,12],[19,1,19,2],[19,11,19,12],[13,1,15,2],[13,9,13,12],[14,3,14,4],[14,5,14,6],[14,9,15,12],[16,1,16,2],[16,9,16,12],[17,1,17,2],[17,9,18,12],[18,1,18,2],[14,7,14,8],[13,3,13,8],[4,0,4,2],[7,4,8,10],[9,5,9,6],[9,7,9,8],[11,1,11,2],[11,3,11,8],[11,9,11,11],[1,0,1,2],[1,5,1,7],[2,0,2,2],[2,11,2,13],[3,0,3,3],[3,11,3,12]]}
[]
[]
["              الجهورية اليمنية ",null,null,null,null,null,null,null,null,null,"مدرسة /"]
["        مكتب وزارة التربية والتعليم  م/ شبوة",null,null,null,null,null,null,null,null,null,"الصف /","الأول"]
["    إدارة التربية والتعليم بمديرية /",null,null,{"$f":"#REF!","v":{"$error":"#REF!"}},null,null,null,null,null,null,"الشعبة / "]
[]
[]
[null,null,null,null,"شهادة تقويم أعمال نصف السنة "]
[]
[null,null,null,null,null,"للعام الدراسي : "]
[]
[null,"الاسم الرباعي",null,{"$f":"VLOOKUP(M12,'مسودة الدرجات'!A9:B38,2,FALSE)","v":"الخضر عبدالله الخضر عبدالله عمر"},null,null,null,null,null,"الرقـــــــــم فـــــي السجـــــــل ",null,null,2]
[]
[null,"المـــــــــــــــــــــواد الدراسية ",null,"الفصــــــــــــــــــــــــــــــــــــــــــــــــــــــــــــــــــــــــــــــــــل الأول",null,null,null,null,null,"ملاحظـــــــــــــــــــــــــــــــــــــــــــــــــــات مربي الصف"]
[null,null,null,"20 المحصلــــــــــــة الأولى ",null,"30 امتحــــــــــــــان الفصل",null,"50 المجــــــــمــــوع",null,{"$f":"IF(AND(H17>=25,H18>=25,H19>=25,H20>=25,H21>=25),\" بارك الله فيك ووهبك مزيد من التفوق والنجاح في الفصل الثاني\",\"ما زالت الفرصة أمامك متاحة وكل ما عليك فعله هو الاهتمام أكثر بدروسك مع بذل مزيد من الجهد في الفصل الثاني\")","v":" بارك الله فيك ووهبك مزيد من التفوق والنجاح في الفصل الثاني"}]
[null,null,null,"رقمـــــــا ","كــــــــــتابة ","رقمـــــــا ","كــــــــــتابة ","رقمـــــــا ","كــــــــــتابة "]
[null,"القـــــــرآن الكريـــــــم ",null,{"$f":"ROUND(VLOOKUP(M12,'مسودة الدرجات'!A9:C38,3,FALSE),0)","v":19},{"$f":"Horof(D17)","v":"تسعة عشر "},{"$f":"VLOOKUP(M12,'مسودة الدرجات'!A9:D38,4,FALSE)","v":30},{"$f":"Horof(F17)","v":"ثلاثون "},{"$f":"F17+D17","v":49},{"$f":"Horof(H17)","v":"تسعة و اربعون "},"ملاحظــــــــــــــــــــــــــــــــــــــــــــــــــــــــــــــــــــات الإدارة "]
[null,"التربية الإسلامية ",null,{"$f":"ROUND(VLOOKUP(M12,'مسودة الدرجات'!A9:F38,6,FALSE),0)","v":20},{"$f":"Horof(D18)","v":"عشرون "},{"$f":"VLOOKUP(M12,'مسودة الدرجات'!A9:G38,7,FALSE)","v":30},{"$f":"Horof(F18)","v":"ثلاثون "},{"$f":"F18+D18","v":50},{"$f":"Horof(H18)","v":"خمسون "},{"$f":"IF(AND(H17>=25,H18>=25,H19>=25,H20>=25,H21>=25),\"نتيجة مشرفة ونتمنى لك دوام التقدم والنجاح\",\"لا تيأس ولا تحزن فالرسوب هو بداية النجاح، مزيد من الإصرار والعزيمة والجهد وسيكون النجاح حليفك في الفصل الثاني إن شاء الله\")","v":"نتيجة مشرفة ونتمنى لك دوام التقدم والنجاح"}]
[null,"اللغـــــــة العربيــــــــة ",null,{"$f":"ROUND(VLOOKUP(M12,'مسودة الدرجات'!A9:I38,9,FALSE),0)","v":20},{"$f":"Horof(D19)","v":"عشرون "},{"$f":"VLOOKUP(M12,'مسودة الدرجات'!A9:J38,10,FALSE)","v":30},{"$f":"Horof(F19)","v":"ثلاثون "},{"$f":"F19+D19","v":50},{"$f":"Horof(H19)","v":"خمسون "}]
[null,"الرياضيـــــــــــــــــــــات ",null,{"$f":"ROUND(VLOOKUP(M12,'مسودة الدرجات'!A9:L38,12,FALSE),0)","v":20},{"$f":"Horof(D20)","v":"عشرون "},{"$f":"VLOOKUP(M12,'مسودة الدرجات'!A9:M38,13,FALSE)","v":30},{"$f":"Horof(F20)","v":"ثلاثون "},{"$f":"F20+D20","v":50},{"$f":"Horof(H20)","v":"خمسون "},"المجموع الكلي",{"$f":"H17+H18+H19+H20+H21","v":249},{"$f":"Horof(K20)","v":"مائتان و تسعة و اربعون "}]
[null,"العلــــــوم والصحـة ",null,{"$f":"ROUND(VLOOKUP(M12,'مسودة الدرجات'!A9:O38,15,FALSE),0)","v":20},{"$f":"Horof(D21)","v":"عشرون "},{"$f":"VLOOKUP(M12,'مسودة الدرجات'!A9:P38,16,FALSE)","v":30},{"$f":"Horof(F21)","v":"ثلاثون "},{"$f":"F21+D21","v":50},{"$f":"Horof(H21)","v":"خمسون "},"النتيجــــــــــــة ",{"$f":"IF(AND(H17>=25,H18>=25,H19>=25,H20>=25,H21>=25),\"ناجح\",\"راسب\")","v":"ناجح"}]
[null,"-",null,"-","-","-","-","-","-","الترتيـــــــــــــب"]
[null,"-",null,"-","-","-","-","-",null,"النسبــــــــــــــــة ",null,{"$f":"K20/2.5","v":99.6},"%"]
[]
[null,"توقيع مربي الصف",null,null,null,null,null,null,"توقيع إدارة المدرسة والختم "]