{"text_format":"1","workbook":"xlsx","n_sheets":4,"sheets":["التحضير","تقرير تفصيلي","قائمة المعلمين","Sheet3"],"not_rendered":{"charts":0,"images":0,"macros":1,"external_links":0,"defined_names":2,"comments":0,"pivot_tables":0},"unopened":[],"bounds":{"document_bytes":16777216,"sheet_cells":100000,"rows_first":2000,"rows_last":500,"rows_between":2000,"halvings":0,"cell_chars":16384,"cell_head_chars":4096},"cells_cut":0,"cells_raw":0,"read":"whole","date_system":"1900"}

{"sheet":"التحضير","index":0,"n_rows":78,"n_cols":16,"rows_kept":78,"cut":false,"hidden":false,"merged":[]}
[null,"اليوم:",{"$f":"D1","v":"2022-01-19"},{"$f":"TODAY()","v":"2022-01-19"}]
[null,"الشهر:",null,{"$f":"TEXT(D1,\"mmmm  yyyy\")","v":"January  2022"}]
[null,null,null,null,null,null,null,null,null,null,null,{"$f":"COUNTIF($H:$H,\"غائب\")","v":5}]
["التاريخ","الرقم :","اسم المعلم","الفصل","الجناح","الرئيس / السينير",null,"التحضير",null,null,"البديل:",null,"عدد الحصص",null,"ملاحظات",1]
[{"$f":"$D$1","v":"2022-01-19"},4,{"$f":"VLOOKUP(B5,'قائمة المعلمين'!$A:$E,2,0)","v":"معلم 4"},{"$f":"VLOOKUP(B5,'قائمة المعلمين'!$A:$E,3,0)","v":"A4"},{"$f":"VLOOKUP(B5,'قائمة المعلمين'!$A:$E,4,0)","v":"Weast"},{"$f":"VLOOKUP(B5,'قائمة المعلمين'!$A:$E,5,0)","v":"رئيس 4"},null,"غائب",null,null,{"$f":"IFERROR(IF(H5=\"غائب\",INDEX('قائمة المعلمين'!$K$4:$K$17,MATCH(SMALL('قائمة المعلمين'!$L$4:$L$17,L5),'قائمة المعلمين'!$L$4:$L$17,0)),\"\"),\"\")","v":"بديل 10"},{"$f":"IF(H5=\"غائب\",L4+1,\"\")","v":1}]
[{"$f":"$D$1","v":"2022-01-19"},7,{"$f":"VLOOKUP(B6,'قائمة المعلمين'!$A:$E,2,0)","v":"معلم 7"},{"$f":"VLOOKUP(B6,'قائمة المعلمين'!$A:$E,3,0)","v":"A7"},{"$f":"VLOOKUP(B6,'قائمة المعلمين'!$A:$E,4,0)","v":"Esat"},{"$f":"VLOOKUP(B6,'قائمة المعلمين'!$A:$E,5,0)","v":"رئيس 7"},null,"غائب",null,null,{"$f":"IFERROR(IF(H6=\"غائب\",INDEX('قائمة المعلمين'!$K$4:$K$17,MATCH(SMALL('قائمة المعلمين'!$L$4:$L$17,L6),'قائمة المعلمين'!$L$4:$L$17,0)),\"\"),\"\")","v":"بديل 10"},{"$f":"IF(H6=\"غائب\",L5+1,\"\")","v":2}]
[{"$f":"$D$1","v":"2022-01-19"},8,{"$f":"VLOOKUP(B7,'قائمة المعلمين'!$A:$E,2,0)","v":"معلم 8"},{"$f":"VLOOKUP(B7,'قائمة المعلمين'!$A:$E,3,0)","v":"A8"},{"$f":"VLOOKUP(B7,'قائمة المعلمين'!$A:$E,4,0)","v":"Weast"},{"$f":"VLOOKUP(B7,'قائمة المعلمين'!$A:$E,5,0)","v":"رئيس 8"},null,"غائب",null,null,{"$f":"IFERROR(IF(H7=\"غائب\",INDEX('قائمة المعلمين'!$K$4:$K$17,MATCH(SMALL('قائمة المعلمين'!$L$4:$L$17,L7),'قائمة المعلمين'!$L$4:$L$17,0)),\"\"),\"\")","v":"بديل 2"},{"$f":"IF(H7=\"غائب\",L6+1,\"\")","v":3}]
[{"$f":"$D$1","v":"2022-01-19"},10,{"$f":"VLOOKUP(B8,'قائمة المعلمين'!$A:$E,2,0)","v":"معلم 10"},{"$f":"VLOOKUP(B8,'قائمة المعلمين'!$A:$E,3,0)","v":"A10"},{"$f":"VLOOKUP(B8,'قائمة المعلمين'!$A:$E,4,0)","v":"Weast"},{"$f":"VLOOKUP(B8,'قائمة المعلمين'!$A:$E,5,0)","v":"رئيس 10"},null,"غائب",null,null,{"$f":"IFERROR(IF(H8=\"غائب\",INDEX('قائمة المعلمين'!$K$4:$K$17,MATCH(SMALL('قائمة المعلمين'!$L$4:$L$17,L8),'قائمة المعلمين'!$L$4:$L$17,0)),\"\"),\"\")","v":"بديل 2"},{"$f":"IF(H8=\"غائب\",L7+1,\"\")","v":4}]
[{"$f":"$D$1","v":"2022-01-19"},11,{"$f":"VLOOKUP(B9,'قائمة المعلمين'!$A:$E,2,0)","v":"معلم 11"},{"$f":"VLOOKUP(B9,'قائمة المعلمين'!$A:$E,3,0)","v":"A11"},{"$f":"VLOOKUP(B9,'قائمة المعلمين'!$A:$E,4,0)","v":"Esat"},{"$f":"VLOOKUP(B9,'قائمة المعلمين'!$A:$E,5,0)","v":"رئيس 11"},null,"غائب",null,null,{"$f":"IFERROR(IF(H9=\"غائب\",INDEX('قائمة المعلمين'!$K$4:$K$17,MATCH(SMALL('قائمة المعلمين'!$L$4:$L$17,L9),'قائمة المعلمين'!$L$4:$L$17,0)),\"\"),\"\")","v":"بديل 2"},{"$f":"IF(H9=\"غائب\",L8+1,\"\")","v":5}]
[{"$f":"$D$1","v":"2022-01-19"},1,{"$f":"VLOOKUP(B10,'قائمة المعلمين'!$A:$E,2,0)","v":"معلم 1"},{"$f":"VLOOKUP(B10,'قائمة المعلمين'!$A:$E,3,0)","v":"A1"},{"$f":"VLOOKUP(B10,'قائمة المعلمين'!$A:$E,4,0)","v":"Esat"},{"$f":"VLOOKUP(B10,'قائمة المعلمين'!$A:$E,5,0)","v":"رئيس 1"},null,"حاضر",null,null,{"$f":"IFERROR(IF(H10=\"غائب\",INDEX('قائمة المعلمين'!$K$4:$K$17,MATCH(SMALL('قائمة المعلمين'!$L$4:$L$17,L10),'قائمة المعلمين'!$L$4:$L$17,0)),\"\"),\"\")","v":""},{"$f":"IF(H10=\"غائب\",P9,\"\")","v":""}]
[{"$f":"$D$1","v":"2022-01-19"},2,{"$f":"VLOOKUP(B11,'قائمة المعلمين'!$A:$E,2,0)","v":"معلم 2"},{"$f":"VLOOKUP(B11,'قائمة المعلمين'!$A:$E,3,0)","v":"A2"},{"$f":"VLOOKUP(B11,'قائمة المعلمين'!$A:$E,4,0)","v":"Weast"},{"$f":"VLOOKUP(B11,'قائمة المعلمين'!$A:$E,5,0)","v":"رئيس 2"},null,"حاضر",null,null,{"$f":"IFERROR(IF(H11=\"غائب\",INDEX('قائمة المعلمين'!$K$4:$K$17,MATCH(SMALL('قائمة المعلمين'!$L$4:$L$17,L11),'قائمة المعلمين'!$L$4:$L$17,0)),\"\"),\"\")","v":""},{"$f":"IF(H11=\"غائب\",L10+1,\"\")","v":""}]
[{"$f":"$D$1","v":"2022-01-19"},3,{"$f":"VLOOKUP(B12,'قائمة المعلمين'!$A:$E,2,0)","v":"معلم 3"},{"$f":"VLOOKUP(B12,'قائمة المعلمين'!$A:$E,3,0)","v":"A3"},{"$f":"VLOOKUP(B12,'قائمة المعلمين'!$A:$E,4,0)","v":"Esat"},{"$f":"VLOOKUP(B12,'قائمة المعلمين'!$A:$E,5,0)","v":"رئيس 3"},null,"حاضر",null,null,{"$f":"IFERROR(IF(H12=\"غائب\",INDEX('قائمة المعلمين'!$K$4:$K$17,MATCH(SMALL('قائمة المعلمين'!$L$4:$L$17,L12),'قائمة المعلمين'!$L$4:$L$17,0)),\"\"),\"\")","v":""},{"$f":"IF(H12=\"غائب\",L11+1,\"\")","v":""}]
[{"$f":"$D$1","v":"2022-01-19"},5,{"$f":"VLOOKUP(B13,'قائمة المعلمين'!$A:$E,2,0)","v":"معلم 5"},{"$f":"VLOOKUP(B13,'قائمة المعلمين'!$A:$E,3,0)","v":"A5"},{"$f":"VLOOKUP(B13,'قائمة المعلمين'!$A:$E,4,0)","v":"Esat"},{"$f":"VLOOKUP(B13,'قائمة المعلمين'!$A:$E,5,0)","v":"رئيس 5"},null,"حاضر",null,null,{"$f":"IFERROR(IF(H13=\"غائب\",INDEX('قائمة المعلمين'!$K$4:$K$17,MATCH(SMALL('قائمة المعلمين'!$L$4:$L$17,L13),'قائمة المعلمين'!$L$4:$L$17,0)),\"\"),\"\")","v":""},{"$f":"IF(H13=\"غائب\",L12+1,\"\")","v":""}]
[{"$f":"$D$1","v":"2022-01-19"},6,{"$f":"VLOOKUP(B14,'قائمة المعلمين'!$A:$E,2,0)","v":"معلم 6"},{"$f":"VLOOKUP(B14,'قائمة المعلمين'!$A:$E,3,0)","v":"A6"},{"$f":"VLOOKUP(B14,'قائمة المعلمين'!$A:$E,4,0)","v":"Weast"},{"$f":"VLOOKUP(B14,'قائمة المعلمين'!$A:$E,5,0)","v":"رئيس 6"},null,"حاضر",null,null,{"$f":"IFERROR(IF(H14=\"غائب\",INDEX('قائمة المعلمين'!$K$4:$K$17,MATCH(SMALL('قائمة المعلمين'!$L$4:$L$17,L14),'قائمة المعلمين'!$L$4:$L$17,0)),\"\"),\"\")","v":""},{"$f":"IF(H14=\"غائب\",L13+1,\"\")","v":""}]
[{"$f":"$D$1","v":"2022-01-19"},9,{"$f":"VLOOKUP(B15,'قائمة المعلمين'!$A:$E,2,0)","v":"معلم 9"},{"$f":"VLOOKUP(B15,'قائمة المعلمين'!$A:$E,3,0)","v":"A9"},{"$f":"VLOOKUP(B15,'قائمة المعلمين'!$A:$E,4,0)","v":"Esat"},{"$f":"VLOOKUP(B15,'قائمة المعلمين'!$A:$E,5,0)","v":"رئيس 9"},null,"حاضر",null,null,{"$f":"IFERROR(IF(H15=\"غائب\",INDEX('قائمة المعلمين'!$K$4:$K$17,MATCH(SMALL('قائمة المعلمين'!$L$4:$L$17,L15),'قائمة المعلمين'!$L$4:$L$17,0)),\"\"),\"\")","v":""},{"$f":"IF(H15=\"غائب\",L14+1,\"\")","v":""}]
[{"$f":"$D$1","v":"2022-01-19"},12,{"$f":"VLOOKUP(B16,'قائمة المعلمين'!$A:$E,2,0)","v":"معلم 12"},{"$f":"VLOOKUP(B16,'قائمة المعلمين'!$A:$E,3,0)","v":"A12"},{"$f":"VLOOKUP(B16,'قائمة المعلمين'!$A:$E,4,0)","v":"Weast"},{"$f":"VLOOKUP(B16,'قائمة المعلمين'!$A:$E,5,0)","v":"رئيس 12"},null,"حاضر",null,null,{"$f":"IFERROR(IF(H16=\"غائب\",INDEX('قائمة المعلمين'!$K$4:$K$17,MATCH(SMALL('قائمة المعلمين'!$L$4:$L$17,L16),'قائمة المعلمين'!$L$4:$L$17,0)),\"\"),\"\")","v":""},{"$f":"IF(H16=\"غائب\",L15+1,\"\")","v":""}]
[{"$f":"$D$1","v":"2022-01-19"},13,{"$f":"VLOOKUP(B17,'قائمة المعلمين'!$A:$E,2,0)","v":"معلم 13"},{"$f":"VLOOKUP(B17,'قائمة المعلمين'!$A:$E,3,0)","v":"A13"},{"$f":"VLOOKUP(B17,'قائمة المعلمين'!$A:$E,4,0)","v":"Esat"},{"$f":"VLOOKUP(B17,'قائمة المعلمين'!$A:$E,5,0)","v":"رئيس 13"},null,"حاضر",null,null,{"$f":"IFERROR(IF(H17=\"غائب\",INDEX('قائمة المعلمين'!$K$4:$K$17,MATCH(SMALL('قائمة المعلمين'!$L$4:$L$17,L17),'قائمة المعلمين'!$L$4:$L$17,0)),\"\"),\"\")","v":""},{"$f":"IF(H17=\"غائب\",L16+1,\"\")","v":""}]
[{"$f":"$D$1","v":"2022-01-19"},14,{"$f":"VLOOKUP(B18,'قائمة المعلمين'!$A:$E,2,0)","v":"معلم 14"},{"$f":"VLOOKUP(B18,'قائمة المعلمين'!$A:$E,3,0)","v":"A14"},{"$f":"VLOOKUP(B18,'قائمة المعلمين'!$A:$E,4,0)","v":"Weast"},{"$f":"VLOOKUP(B18,'قائمة المعلمين'!$A:$E,5,0)","v":"رئيس 14"},null,"حاضر",null,null,{"$f":"IFERROR(IF(H18=\"غائب\",INDEX('قائمة المعلمين'!$K$4:$K$17,MATCH(SMALL('قائمة المعلمين'!$L$4:$L$17,L18),'قائمة المعلمين'!$L$4:$L$17,0)),\"\"),\"\")","v":""},{"$f":"IF(H18=\"غائب\",L17+1,\"\")","v":""}]
[{"$f":"$D$1","v":"2022-01-19"},15,{"$f":"VLOOKUP(B19,'قائمة المعلمين'!$A:$E,2,0)","v":"معلم 15"},{"$f":"VLOOKUP(B19,'قائمة المعلمين'!$A:$E,3,0)","v":"A15"},{"$f":"VLOOKUP(B19,'قائمة المعلمين'!$A:$E,4,0)","v":"Esat"},{"$f":"VLOOKUP(B19,'قائمة المعلمين'!$A:$E,5,0)","v":"رئيس 15"},null,null,null,null,{"$f":"IFERROR(IF(H19=\"غائب\",INDEX('قائمة المعلمين'!$K$4:$K$17,MATCH(SMALL('قائمة المعلمين'!$L$4:$L$17,L19),'قائمة المعلمين'!$L$4:$L$17,0)),\"\"),\"\")","v":""},{"$f":"IF(H19=\"غائب\",L18+1,\"\")","v":""}]
[{"$f":"$D$1","v":"2022-01-19"},16,{"$f":"VLOOKUP(B20,'قائمة المعلمين'!$A:$E,2,0)","v":"معلم 16"},{"$f":"VLOOKUP(B20,'قائمة المعلمين'!$A:$E,3,0)","v":"A16"},{"$f":"VLOOKUP(B20,'قائمة المعلمين'!$A:$E,4,0)","v":"Weast"},{"$f":"VLOOKUP(B20,'قائمة المعلمين'!$A:$E,5,0)","v":"رئيس 16"},null,null,null,null,{"$f":"IFERROR(IF(H20=\"غائب\",INDEX('قائمة المعلمين'!$K$4:$K$17,MATCH(SMALL('قائمة المعلمين'!$L$4:$L$17,L20),'قائمة المعلمين'!$L$4:$L$17,0)),\"\"),\"\")","v":""},{"$f":"IF(H20=\"غائب\",L19+1,\"\")","v":""}]
[{"$f":"$D$1","v":"2022-01-19"},17,{"$f":"VLOOKUP(B21,'قائمة المعلمين'!$A:$E,2,0)","v":"معلم 17"},{"$f":"VLOOKUP(B21,'قائمة المعلمين'!$A:$E,3,0)","v":"A17"},{"$f":"VLOOKUP(B21,'قائمة المعلمين'!$A:$E,4,0)","v":"Esat"},{"$f":"VLOOKUP(B21,'قائمة المعلمين'!$A:$E,5,0)","v":"رئيس 17"},null,null,null,null,{"$f":"IFERROR(IF(H21=\"غائب\",INDEX('قائمة المعلمين'!$K$4:$K$17,MATCH(SMALL('قائمة المعلمين'!$L$4:$L$17,L21),'قائمة المعلمين'!$L$4:$L$17,0)),\"\"),\"\")","v":""},{"$f":"IF(H21=\"غائب\",L20+1,\"\")","v":""}]
[{"$f":"$D$1","v":"2022-01-19"},18,{"$f":"VLOOKUP(B22,'قائمة المعلمين'!$A:$E,2,0)","v":"معلم 18"},{"$f":"VLOOKUP(B22,'قائمة المعلمين'!$A:$E,3,0)","v":"A18"},{"$f":"VLOOKUP(B22,'قائمة المعلمين'!$A:$E,4,0)","v":"Weast"},{"$f":"VLOOKUP(B22,'قائمة المعلمين'!$A:$E,5,0)","v":"رئيس 18"},null,null,null,null,{"$f":"IFERROR(IF(H22=\"غائب\",INDEX('قائمة المعلمين'!$K$4:$K$17,MATCH(SMALL('قائمة المعلمين'!$L$4:$L$17,L22),'قائمة المعلمين'!$L$4:$L$17,0)),\"\"),\"\")","v":""},{"$f":"IF(H22=\"غائب\",L21+1,\"\")","v":""}]
[{"$f":"$D$1","v":"2022-01-19"},19,{"$f":"VLOOKUP(B23,'قائمة المعلمين'!$A:$E,2,0)","v":"معلم 19"},{"$f":"VLOOKUP(B23,'قائمة المعلمين'!$A:$E,3,0)","v":"A19"},{"$f":"VLOOKUP(B23,'قائمة المعلمين'!$A:$E,4,0)","v":"Esat"},{"$f":"VLOOKUP(B23,'قائمة المعلمين'!$A:$E,5,0)","v":"رئيس 19"},null,null,null,null,{"$f":"IFERROR(IF(H23=\"غائب\",INDEX('قائمة المعلمين'!$K$4:$K$17,MATCH(SMALL('قائمة المعلمين'!$L$4:$L$17,L23),'قائمة المعلمين'!$L$4:$L$17,0)),\"\"),\"\")","v":""},{"$f":"IF(H23=\"غائب\",L22+1,\"\")","v":""}]
[{"$f":"$D$1","v":"2022-01-19"},20,{"$f":"VLOOKUP(B24,'قائمة المعلمين'!$A:$E,2,0)","v":"معلم 20"},{"$f":"VLOOKUP(B24,'قائمة المعلمين'!$A:$E,3,0)","v":"A20"},{"$f":"VLOOKUP(B24,'قائمة المعلمين'!$A:$E,4,0)","v":"Weast"},{"$f":"VLOOKUP(B24,'قائمة المعلمين'!$A:$E,5,0)","v":"رئيس 20"},null,null,null,null,{"$f":"IFERROR(IF(H24=\"غائب\",INDEX('قائمة المعلمين'!$K$4:$K$17,MATCH(SMALL('قائمة المعلمين'!$L$4:$L$17,L24),'قائمة المعلمين'!$L$4:$L$17,0)),\"\"),\"\")","v":""},{"$f":"IF(H24=\"غائب\",L23+1,\"\")","v":""}]
[{"$f":"$D$1","v":"2022-01-19"},21,{"$f":"VLOOKUP(B25,'قائمة المعلمين'!$A:$E,2,0)","v":"معلم 21"},{"$f":"VLOOKUP(B25,'قائمة المعلمين'!$A:$E,3,0)","v":"A21"},{"$f":"VLOOKUP(B25,'قائمة المعلمين'!$A:$E,4,0)","v":"Esat"},{"$f":"VLOOKUP(B25,'قائمة المعلمين'!$A:$E,5,0)","v":"رئيس 21"},null,null,null,null,{"$f":"IFERROR(IF(H25=\"غائب\",INDEX('قائمة المعلمين'!$K$4:$K$17,MATCH(SMALL('قائمة المعلمين'!$L$4:$L$17,L25),'قائمة المعلمين'!$L$4:$L$17,0)),\"\"),\"\")","v":""},{"$f":"IF(H25=\"غائب\",L24+1,\"\")","v":""}]
[{"$f":"$D$1","v":"2022-01-19"},22,{"$f":"VLOOKUP(B26,'قائمة المعلمين'!$A:$E,2,0)","v":"معلم 22"},{"$f":"VLOOKUP(B26,'قائمة المعلمين'!$A:$E,3,0)","v":"A22"},{"$f":"VLOOKUP(B26,'قائمة المعلمين'!$A:$E,4,0)","v":"Weast"},{"$f":"VLOOKUP(B26,'قائمة المعلمين'!$A:$E,5,0)","v":"رئيس 22"},null,null,null,null,{"$f":"IFERROR(IF(H26=\"غائب\",INDEX('قائمة المعلمين'!$K$4:$K$17,MATCH(SMALL('قائمة المعلمين'!$L$4:$L$17,L26),'قائمة المعلمين'!$L$4:$L$17,0)),\"\"),\"\")","v":""},{"$f":"IF(H26=\"غائب\",L25+1,\"\")","v":""}]
[{"$f":"$D$1","v":"2022-01-19"},23,{"$f":"VLOOKUP(B27,'قائمة المعلمين'!$A:$E,2,0)","v":"معلم 23"},{"$f":"VLOOKUP(B27,'قائمة المعلمين'!$A:$E,3,0)","v":"A23"},{"$f":"VLOOKUP(B27,'قائمة المعلمين'!$A:$E,4,0)","v":"Esat"},{"$f":"VLOOKUP(B27,'قائمة المعلمين'!$A:$E,5,0)","v":"رئيس 23"},null,null,null,null,{"$f":"IFERROR(IF(H27=\"غائب\",INDEX('قائمة المعلمين'!$K$4:$K$17,MATCH(SMALL('قائمة المعلمين'!$L$4:$L$17,L27),'قائمة المعلمين'!$L$4:$L$17,0)),\"\"),\"\")","v":""},{"$f":"IF(H27=\"غائب\",L26+1,\"\")","v":""}]
[{"$f":"$D$1","v":"2022-01-19"},24,{"$f":"VLOOKUP(B28,'قائمة المعلمين'!$A:$E,2,0)","v":"معلم 24"},{"$f":"VLOOKUP(B28,'قائمة المعلمين'!$A:$E,3,0)","v":"A24"},{"$f":"VLOOKUP(B28,'قائمة المعلمين'!$A:$E,4,0)","v":"Weast"},{"$f":"VLOOKUP(B28,'قائمة المعلمين'!$A:$E,5,0)","v":"رئيس 24"},null,null,null,null,{"$f":"IFERROR(IF(H28=\"غائب\",INDEX('قائمة المعلمين'!$K$4:$K$17,MATCH(SMALL('قائمة المعلمين'!$L$4:$L$17,L28),'قائمة المعلمين'!$L$4:$L$17,0)),\"\"),\"\")","v":""},{"$f":"IF(H28=\"غائب\",L27+1,\"\")","v":""}]
[{"$f":"$D$1","v":"2022-01-19"},25,{"$f":"VLOOKUP(B29,'قائمة المعلمين'!$A:$E,2,0)","v":"معلم 25"},{"$f":"VLOOKUP(B29,'قائمة المعلمين'!$A:$E,3,0)","v":"A25"},{"$f":"VLOOKUP(B29,'قائمة المعلمين'!$A:$E,4,0)","v":"Esat"},{"$f":"VLOOKUP(B29,'قائمة المعلمين'!$A:$E,5,0)","v":"رئيس 25"},null,null,null,null,{"$f":"IFERROR(IF(H29=\"غائب\",INDEX('قائمة المعلمين'!$K$4:$K$17,MATCH(SMALL('قائمة المعلمين'!$L$4:$L$17,L29),'قائمة المعلمين'!$L$4:$L$17,0)),\"\"),\"\")","v":""},{"$f":"IF(H29=\"غائب\",L28+1,\"\")","v":""}]
[null,null,null,null,null,null,null,null,null,null,{"$f":"IFERROR(IF(H30=\"غائب\",INDEX('قائمة المعلمين'!$K$4:$K$17,MATCH(SMALL('قائمة المعلمين'!$L$4:$L$17,L30),'قائمة المعلمين'!$L$4:$L$17,0)),\"\"),\"\")","v":""},{"$f":"IF(H30=\"غائب\",L29+1,\"\")","v":""}]
[null,null,null,null,null,null,null,null,null,null,{"$f":"IFERROR(IF(H31=\"غائب\",INDEX('قائمة المعلمين'!$K$4:$K$17,MATCH(SMALL('قائمة المعلمين'!$L$4:$L$17,L31),'قائمة المعلمين'!$L$4:$L$17,0)),\"\"),\"\")","v":""},""]
[null,null,null,null,null,null,null,null,null,null,{"$f":"IFERROR(IF(H32=\"غائب\",INDEX('قائمة المعلمين'!$K$4:$K$17,MATCH(SMALL('قائمة المعلمين'!$L$4:$L$17,L32),'قائمة المعلمين'!$L$4:$L$17,0)),\"\"),\"\")","v":""},""]
[null,null,null,null,null,null,null,null,null,null,{"$f":"IFERROR(IF(H33=\"غائب\",INDEX('قائمة المعلمين'!$K$4:$K$17,MATCH(SMALL('قائمة المعلمين'!$L$4:$L$17,L33),'قائمة المعلمين'!$L$4:$L$17,0)),\"\"),\"\")","v":""},""]
[null,null,null,null,null,null,null,null,null,null,{"$f":"IFERROR(IF(H34=\"غائب\",INDEX('قائمة المعلمين'!$K$4:$K$17,MATCH(SMALL('قائمة المعلمين'!$L$4:$L$17,L34),'قائمة المعلمين'!$L$4:$L$17,0)),\"\"),\"\")","v":""},""]
[null,null,null,null,null,null,null,null,null,null,{"$f":"IFERROR(IF(H35=\"غائب\",INDEX('قائمة المعلمين'!$K$4:$K$17,MATCH(SMALL('قائمة المعلمين'!$L$4:$L$17,L35),'قائمة المعلمين'!$L$4:$L$17,0)),\"\"),\"\")","v":""},""]
[null,null,null,null,null,null,null,null,null,null,{"$f":"IFERROR(IF(H36=\"غائب\",INDEX('قائمة المعلمين'!$K$4:$K$17,MATCH(SMALL('قائمة المعلمين'!$L$4:$L$17,L36),'قائمة المعلمين'!$L$4:$L$17,0)),\"\"),\"\")","v":""},""]
[null,null,null,null,null,null,null,null,null,null,{"$f":"IFERROR(IF(H37=\"غائب\",INDEX('قائمة المعلمين'!$K$4:$K$17,MATCH(SMALL('قائمة المعلمين'!$L$4:$L$17,L37),'قائمة المعلمين'!$L$4:$L$17,0)),\"\"),\"\")","v":""},""]
[null,null,null,null,null,null,null,null,null,null,{"$f":"IFERROR(IF(H38=\"غائب\",INDEX('قائمة المعلمين'!$K$4:$K$17,MATCH(SMALL('قائمة المعلمين'!$L$4:$L$17,L38),'قائمة المعلمين'!$L$4:$L$17,0)),\"\"),\"\")","v":""},""]
[null,null,null,null,null,null,null,null,null,null,{"$f":"IFERROR(IF(H39=\"غائب\",INDEX('قائمة المعلمين'!$K$4:$K$17,MATCH(SMALL('قائمة المعلمين'!$L$4:$L$17,L39),'قائمة المعلمين'!$L$4:$L$17,0)),\"\"),\"\")","v":""},""]
[null,null,null,null,null,null,null,null,null,null,{"$f":"IFERROR(IF(H40=\"غائب\",INDEX('قائمة المعلمين'!$K$4:$K$17,MATCH(SMALL('قائمة المعلمين'!$L$4:$L$17,L40),'قائمة المعلمين'!$L$4:$L$17,0)),\"\"),\"\")","v":""},""]
[null,null,null,null,null,null,null,null,null,null,{"$f":"IFERROR(IF(H41=\"غائب\",INDEX('قائمة المعلمين'!$K$4:$K$17,MATCH(SMALL('قائمة المعلمين'!$L$4:$L$17,L41),'قائمة المعلمين'!$L$4:$L$17,0)),\"\"),\"\")","v":""},""]
[null,null,null,null,null,null,null,null,null,null,{"$f":"IFERROR(IF(H42=\"غائب\",INDEX('قائمة المعلمين'!$K$4:$K$17,MATCH(SMALL('قائمة المعلمين'!$L$4:$L$17,L42),'قائمة المعلمين'!$L$4:$L$17,0)),\"\"),\"\")","v":""},""]
[null,null,null,null,null,null,null,null,null,null,{"$f":"IFERROR(IF(H43=\"غائب\",INDEX('قائمة المعلمين'!$K$4:$K$17,MATCH(SMALL('قائمة المعلمين'!$L$4:$L$17,L43),'قائمة المعلمين'!$L$4:$L$17,0)),\"\"),\"\")","v":""},""]
[null,null,null,null,null,null,null,null,null,null,{"$f":"IFERROR(IF(H44=\"غائب\",INDEX('قائمة المعلمين'!$K$4:$K$17,MATCH(SMALL('قائمة المعلمين'!$L$4:$L$17,L44),'قائمة المعلمين'!$L$4:$L$17,0)),\"\"),\"\")","v":""},""]
[null,null,null,null,null,null,null,null,null,null,{"$f":"IFERROR(IF(H45=\"غائب\",INDEX('قائمة المعلمين'!$K$4:$K$17,MATCH(SMALL('قائمة المعلمين'!$L$4:$L$17,L45),'قائمة المعلمين'!$L$4:$L$17,0)),\"\"),\"\")","v":""},""]
[null,null,null,null,null,null,null,null,null,null,{"$f":"IFERROR(IF(H46=\"غائب\",INDEX('قائمة المعلمين'!$K$4:$K$17,MATCH(SMALL('قائمة المعلمين'!$L$4:$L$17,L46),'قائمة المعلمين'!$L$4:$L$17,0)),\"\"),\"\")","v":""},""]
[null,null,null,null,null,null,null,null,null,null,{"$f":"IFERROR(IF(H47=\"غائب\",INDEX('قائمة المعلمين'!$K$4:$K$17,MATCH(SMALL('قائمة المعلمين'!$L$4:$L$17,L47),'قائمة المعلمين'!$L$4:$L$17,0)),\"\"),\"\")","v":""},""]
[null,null,null,null,null,null,null,null,null,null,{"$f":"IFERROR(IF(H48=\"غائب\",INDEX('قائمة المعلمين'!$K$4:$K$17,MATCH(SMALL('قائمة المعلمين'!$L$4:$L$17,L48),'قائمة المعلمين'!$L$4:$L$17,0)),\"\"),\"\")","v":""},""]
[null,null,null,null,null,null,null,null,null,null,{"$f":"IFERROR(IF(H49=\"غائب\",INDEX('قائمة المعلمين'!$K$4:$K$17,MATCH(SMALL('قائمة المعلمين'!$L$4:$L$17,L49),'قائمة المعلمين'!$L$4:$L$17,0)),\"\"),\"\")","v":""},""]
[null,null,null,null,null,null,null,null,null,null,{"$f":"IFERROR(IF(H50=\"غائب\",INDEX('قائمة المعلمين'!$K$4:$K$17,MATCH(SMALL('قائمة المعلمين'!$L$4:$L$17,L50),'قائمة المعلمين'!$L$4:$L$17,0)),\"\"),\"\")","v":""},""]
[null,null,null,null,null,null,null,null,null,null,{"$f":"IFERROR(IF(H51=\"غائب\",INDEX('قائمة المعلمين'!$K$4:$K$17,MATCH(SMALL('قائمة المعلمين'!$L$4:$L$17,L51),'قائمة المعلمين'!$L$4:$L$17,0)),\"\"),\"\")","v":""},""]
[null,null,null,null,null,null,null,null,null,null,{"$f":"IFERROR(IF(H52=\"غائب\",INDEX('قائمة المعلمين'!$K$4:$K$17,MATCH(SMALL('قائمة المعلمين'!$L$4:$L$17,L52),'قائمة المعلمين'!$L$4:$L$17,0)),\"\"),\"\")","v":""},""]
[null,null,null,null,null,null,null,null,null,null,{"$f":"IFERROR(IF(H53=\"غائب\",INDEX('قائمة المعلمين'!$K$4:$K$17,MATCH(SMALL('قائمة المعلمين'!$L$4:$L$17,L53),'قائمة المعلمين'!$L$4:$L$17,0)),\"\"),\"\")","v":""},""]
[null,null,null,null,null,null,null,null,null,null,{"$f":"IFERROR(IF(H54=\"غائب\",INDEX('قائمة المعلمين'!$K$4:$K$17,MATCH(SMALL('قائمة المعلمين'!$L$4:$L$17,L54),'قائمة المعلمين'!$L$4:$L$17,0)),\"\"),\"\")","v":""},""]
[null,null,null,null,null,null,null,null,null,null,{"$f":"IFERROR(IF(H55=\"غائب\",INDEX('قائمة المعلمين'!$K$4:$K$17,MATCH(SMALL('قائمة المعلمين'!$L$4:$L$17,L55),'قائمة المعلمين'!$L$4:$L$17,0)),\"\"),\"\")","v":""},""]
[null,null,null,null,null,null,null,null,null,null,{"$f":"IFERROR(IF(H56=\"غائب\",INDEX('قائمة المعلمين'!$K$4:$K$17,MATCH(SMALL('قائمة المعلمين'!$L$4:$L$17,L56),'قائمة المعلمين'!$L$4:$L$17,0)),\"\"),\"\")","v":""},""]
[null,null,null,null,null,null,null,null,null,null,{"$f":"IFERROR(IF(H57=\"غائب\",INDEX('قائمة المعلمين'!$K$4:$K$17,MATCH(SMALL('قائمة المعلمين'!$L$4:$L$17,L57),'قائمة المعلمين'!$L$4:$L$17,0)),\"\"),\"\")","v":""},""]
[null,null,null,null,null,null,null,null,null,null,{"$f":"IFERROR(IF(H58=\"غائب\",INDEX('قائمة المعلمين'!$K$4:$K$17,MATCH(SMALL('قائمة المعلمين'!$L$4:$L$17,L58),'قائمة المعلمين'!$L$4:$L$17,0)),\"\"),\"\")","v":""},""]
[null,null,null,null,null,null,null,null,null,null,{"$f":"IFERROR(IF(H59=\"غائب\",INDEX('قائمة المعلمين'!$K$4:$K$17,MATCH(SMALL('قائمة المعلمين'!$L$4:$L$17,L59),'قائمة المعلمين'!$L$4:$L$17,0)),\"\"),\"\")","v":""},""]
[null,null,null,null,null,null,null,null,null,null,{"$f":"IFERROR(IF(H60=\"غائب\",INDEX('قائمة المعلمين'!$K$4:$K$17,MATCH(SMALL('قائمة المعلمين'!$L$4:$L$17,L60),'قائمة المعلمين'!$L$4:$L$17,0)),\"\"),\"\")","v":""},""]
{"$rows_left_out":19}
{"sheet":"تقرير تفصيلي","index":1,"n_rows":3,"n_cols":13,"rows_kept":3,"cut":false,"hidden":false,"merged":[]}
[]
["التاريخ","الرقم :","اسم المعلم","الفصل","الجناح","الرئيس / السينير",null,"التحضير",null,null,"ملاحظة",null,"البديل:"]
["2022-01-18"]

{"sheet":"قائمة المعلمين","index":2,"n_rows":117,"n_cols":12,"rows_kept":117,"cut":false,"hidden":false,"merged":[]}
["المعلمين:"]
["الرقم :(تسلسلي او وظيفي)","اسم المعلم","مكان العمل (الفصل)","الجناح","الرئيس / السينبر",null,"قائمة الإنتظار :","عدد المشاركات"]
[1,"معلم 1","A1","Esat","رئيس 1","م","اسم الموظف","عدد المشاركات",null,"م","اسم الموظف","عدد المشاركات"]
[2,"معلم 2","A2","Weast","رئيس 2",1,"بديل 1",3,null,1,{"$f":"INDEX($G$4:$G$17,MATCH(SMALL($H$4:$H$17,J4),$H$4:$H$17,0))","v":"بديل 10"},{"$f":"SMALL($H$4:$H$17,J4)","v":1}]
[3,"معلم 3","A3","Esat","رئيس 3",2,"بديل 2",2,null,2,{"$f":"INDEX($G$4:$G$17,MATCH(SMALL($H$4:$H$17,J5),$H$4:$H$17,0))","v":"بديل 10"},{"$f":"SMALL($H$4:$H$17,J5)","v":1}]
[4,"معلم 4","A4","Weast","رئيس 4",3,"بديل 3",3,null,3,{"$f":"INDEX($G$4:$G$17,MATCH(SMALL($H$4:$H$17,J6),$H$4:$H$17,0))","v":"بديل 2"},{"$f":"SMALL($H$4:$H$17,J6)","v":2}]
[5,"معلم 5","A5","Esat","رئيس 5",4,"بديل 4",4,null,4,{"$f":"INDEX($G$4:$G$17,MATCH(SMALL($H$4:$H$17,J7),$H$4:$H$17,0))","v":"بديل 2"},{"$f":"SMALL($H$4:$H$17,J7)","v":2}]
[6,"معلم 6","A6","Weast","رئيس 6",5,"بديل 5",4,null,5,{"$f":"INDEX($G$4:$G$17,MATCH(SMALL($H$4:$H$17,J8),$H$4:$H$17,0))","v":"بديل 2"},2]
[7,"معلم 7","A7","Esat","رئيس 7",6,"بديل 6",2,null,6,"بديل 2",2]
[8,"معلم 8","A8","Weast","رئيس 8",7,"بديل 7",3,null,7,"بديل 1",3]
[9,"معلم 9","A9","Esat","رئيس 9",8,"بديل 8",2,null,8,"بديل 1",3]
[10,"معلم 10","A10","Weast","رئيس 10",9,"بديل 9",2,null,9,"بديل 1",3]
[11,"معلم 11","A11","Esat","رئيس 11",10,"بديل 10",1,null,10,"بديل 4",4]
[12,"معلم 12","A12","Weast","رئيس 12",11,"بديل 11",4,null,11,{"$f":"INDEX($G$4:$G$17,MATCH(SMALL($H$4:$H$17,J14),$H$4:$H$17,0))","v":"بديل 4"},4]
[13,"معلم 13","A13","Esat","رئيس 13",12,"بديل 12",5,null,12,"بديل 4",4]
[14,"معلم 14","A14","Weast","رئيس 14",13,"بديل 13",5,null,13,"بديل 12",5]
[15,"معلم 15","A15","Esat","رئيس 15",14,"بديل 14",1,null,14,"بديل 12",5]
[16,"معلم 16","A16","Weast","رئيس 16"]
[17,"معلم 17","A17","Esat","رئيس 17"]
[18,"معلم 18","A18","Weast","رئيس 18"]
[19,"معلم 19","A19","Esat","رئيس 19"]
[20,"معلم 20","A20","Weast","رئيس 20"]
[21,"معلم 21","A21","Esat","رئيس 21"]
[22,"معلم 22","A22","Weast","رئيس 22"]
[23,"معلم 23","A23","Esat","رئيس 23"]
[24,"معلم 24","A24","Weast","رئيس 24"]
[25,"معلم 25","A25","Esat","رئيس 25"]
[26,"معلم 26","A26","Weast","رئيس 26"]
[27,"معلم 27","A27","Esat","رئيس 27"]
[28,"معلم 28","A28","Weast","رئيس 28"]
[29,"معلم 29","A29","Esat","رئيس 29"]
[30,"معلم 30","A30","Weast","رئيس 30"]
[31,"معلم 31","A31","Esat","رئيس 31"]
[32,"معلم 32","A32","Weast","رئيس 32"]
[33,"معلم 33","A33","Esat","رئيس 33"]
[34,"معلم 34","A34","Weast","رئيس 34"]
[35,"معلم 35","A35","Esat","رئيس 35"]
[36,"معلم 36","A36","Weast","رئيس 36"]
[37,"معلم 37","A37","Esat","رئيس 37"]
[38,"معلم 38","A38","Weast","رئيس 38"]
[39,"معلم 39","A39","Esat","رئيس 39"]
[40,"معلم 40","A40","Weast","رئيس 40"]
[41,"معلم 41","A41","Esat","رئيس 41"]
[42,"معلم 42","A42","Weast","رئيس 42"]
[43,"معلم 43","A43","Esat","رئيس 43"]
[44,"معلم 44","A44","Weast","رئيس 44"]
[45,"معلم 45","A45","Esat","رئيس 45"]
[46,"معلم 46","A46","Weast","رئيس 46"]
[47,"معلم 47","A47","Esat","رئيس 47"]
[48,"معلم 48","A48","Weast","رئيس 48"]
[49,"معلم 49","A49","Esat","رئيس 49"]
[50,"معلم 50","A50","Weast","رئيس 50"]
[51,"معلم 51","A51","Esat","رئيس 51"]
[52,"معلم 52","A52","Weast","رئيس 52"]
[53,"معلم 53","A53","Esat","رئيس 53"]
[54,"معلم 54","A54","Weast","رئيس 54"]
[55,"معلم 55","A55","Esat","رئيس 55"]
[56,"معلم 56","A56","Weast","رئيس 56"]
[57,"معلم 57","A57","Esat","رئيس 57"]
[58,"معلم 58","A58","Weast","رئيس 58"]
{"$rows_left_out":58}
{"sheet":"Sheet3","index":3,"n_rows":5,"n_cols":1,"rows_kept":5,"cut":false,"hidden":false,"merged":[]}
["حاضر"]
["غائب"]
["مستأذن "]
["إجازة مرضية "]
["أخرى"]