{"text_format":"1","workbook":"xlsx","n_sheets":2,"sheets":["keabhosa","طباعة الغياب"],"not_rendered":{"charts":0,"images":1,"macros":1,"external_links":1,"defined_names":9,"comments":0,"pivot_tables":0},"unopened":[],"bounds":{"document_bytes":16777216,"sheet_cells":100000,"rows_first":2000,"rows_last":500,"rows_between":2000,"halvings":0,"cell_chars":16384,"cell_head_chars":4096},"cells_cut":0,"cells_raw":0,"read":"whole","date_system":"1900"}

{"sheet":"keabhosa","index":0,"n_rows":918,"n_cols":112,"rows_kept":918,"cut":false,"hidden":false,"merged":[[1,1,1,8]]}
[0,null,null,null,null,null,null,null,null,null,null,null,null,null,null,null,null,null,null,null,null,null,null,null,null,null,null,null,null,null,null,null,null,null,null,null,null,null,null,null,null,null,null,null,null,null,null,null,null,null,null,null,"الرقم","اسم المعلم","أيام الغياب"," أيام الغياب بالحروف","عدد أيام الغياب","شهر الغياب","السنة","العداد",null,null,"اسم المعلم",null,null,null,null,null,null,null,null,null,null,null,null,null,null,null,"الرقم","اسم المعلم","أيام الغياب"," أيام الغياب بالحروف","عدد أيام الغياب","شهر الغياب","السنة","العداد","العداد",null,null,null,null,null,null,null,null,null,null,null,null,null,null,null,null,null,"الرقم","اسم المعلم","أيام الغياب"," أيام الغياب بالحروف","عدد أيام الغياب","شهر الغياب","السنة","العداد"]
[null,"غيـــــاب الحصـــــص",null,null,null,null,null,null,null,null,null,null,null,null,null,null,null,null,null,null,null,null,null,null,null,null,null,null,null,null,null,null,null,null,null,null,null,null,null,null,null,null,null,null,null,null,null,null,null,null,null,null,1,"ابراهيم الصيد المصروب العموري"," 25 -19 -18 -17 -13 -12 "," الثلاثاء -الأربعاء -الأحد -الإثنين -الثلاثاء -الإثنين ",6,11,2019,24239,null,null,"ابراهيم الصيد المصروب العموري",null,null,null,null,null,null,null,null,null,null,null,null,null,null,null,null,"ابراهيم الصيد المصروب العموري",null,null,null,null,null,">=0","<=24360",null,null,null,null,null,null,null,null,null,null,null,null,null,null,null,null,null,1,"ابراهيم الصيد المصروب العموري"," 25 -19 -18 -17 -13 -12 "," الثلاثاء -الأربعاء -الأحد -الإثنين -الثلاثاء -الإثنين ",6,11,2019,24239]
[1,2,3,4,5,6,7,8,9,null,null,null,null,null,null,null,null,null,null,null,null,null,null,null,null,null,null,null,null,null,null,null,null,null,null,null,null,null,null,null,null,null,null,null,null,null,null,null,null,null,null,null,2,"اسمهان ابراهيم مختار البراملي"," 28 -27 -26 -25 -21 -20 -12 "," الثلاثاء -الأربعاء -الخميس -الإثنين -الثلاثاء -الأربعاء -الخميس ",7,11,2019,24239,null,null,"احلام صالح مختار ابوالعيد",null,null,null,null,null,null,null,null,null,null,null,null,null,null,null,null,null,null,null,null,null,null,null,null,null,null,null,null,null,null,null,null,null,null,null,null,null,null,null,null,null,34,"ابراهيم الصيد المصروب العموري"," 30 -18 -10 -4 "," الأربعاء -الثلاثاء -الأربعاء -الإثنين ",4,12,2019,24240]
[null,"الرقم","اسم المعلم","أيام الغياب"," أيام الغياب بالحروف","عدد أيام الغياب","شهر الغياب","السنة","العداد",null,null,null,null,null,null,null,null,null,null,null,null,null,null,null,null,null,null,null,null,null,null,null,null,null,null,null,null,null,null,null,null,null,null,null,null,null,null,null,null,null,null,null,3,"امال رمضان إبراهيم عبدالعالي"," 13 -12 "," الثلاثاء -الأربعاء ",2,11,2019,24239,null,null,"اسماء عبدالرحمن احمد القماطي",null,null,null,null,null,null,null,null,null,null,null,null,null,null,null,null,null,null,null,null,null,null,null,null,null,null,null,null,null,null,null,null,null,null,null,null,null,null,null,null,null,84,"ابراهيم الصيد المصروب العموري"," 27 -22 -16 -15 "," الأربعاء -الخميس -الأربعاء -الإثنين ",4,1,2020,24241]
[null,1,"معلم 1"," 27 -22 -16 -15 "," الأربعاء -الخميس -الأربعاء -الإثنين ",4,1,2020,24241,null,null,null,null,null,null,null,null,null,null,null,null,null,null,null,null,null,null,null,null,null,null,null,null,null,null,null,null,null,null,null,null,null,null,null,null,null,null,null,null,null,null,null,87,"اسمهان محمد علي المطري"," 21 -15 -1 "," الأربعاء -الأربعاء -الثلاثاء ",3,1,2020,24241]
[null,2,"معلم 2",5," الأحد ",1,1,2020,24241,null,null,null,null,null,null,null,null,null,null,null,null,null,null,null,null,null,null,null,null,null,null,null,null,null,null,null,null,null,null,null,null,null,null,null,null,null,null,null,null,null,null,null,88,"امال رمضان إبراهيم عبدالعالي"," 19 -16 -15 -2 -1 "," الأربعاء -الخميس -الأربعاء -الخميس -الأحد ",5,1,2020,24241]
[null,3,"معلم 3",19," الأحد ",1,1,2020,24241,null,null,null,null,null,null,null,null,null,null,null,null,null,null,null,null,null,null,null,null,null,null,null,null,null,null,null,null,null,null,null,null,null,null,null,null,null,null,null,null,null,null,null,89,"امال محمد النوري الكموشي"," 15 -5 -2 "," الخميس -الأحد -الأربعاء ",3,1,2020,24241]
[null,4,"معلم 4"," 21 -15 -1 "," الأربعاء -الأربعاء -الثلاثاء ",3,1,2020,24241,null,null,null,null,null,null,null,null,null,null,null,null,null,null,null,null,null,null,null,null,null,null,null,null,null,null,null,null,null,null,null,null,null,null,null,null,null,null,null,null,null,null,null,90,"اماني مصطفى حسين حواص"," 30 -29 -23 "," الخميس -الأربعاء -الخميس ",3,1,2020,24241]
[null,5,"معلم 5"," 19 -16 -15 -2 -1 "," الأربعاء -الخميس -الأربعاء -الخميس -الأحد ",5,1,2020,24241,null,null,null,null,null,null,null,null,null,null,null,null,null,null,null,null,null,null,null,null,null,null,null,null,null,null,null,null,null,null,null,null,null,null,null,null,null,null,null,null,null,null,null,91,"امل فتح الله سالم زائد",19," الأحد ",1,1,2020,24241]
[null,6,"معلم 6"," 15 -5 -2 "," الخميس -الأحد -الأربعاء ",3,1,2020,24241,null,null,null,null,null,null,null,null,null,null,null,null,null,null,null,null,null,null,null,null,null,null,null,null,null,null,null,null,null,null,null,null,null,null,null,null,null,null,null,null,null,null,null,92,"امنة على شعبان المجبري"," 28 -19 "," الأحد -الثلاثاء ",2,1,2020,24241]
[null,7,"معلم 7"," 30 -29 -23 "," الخميس -الأربعاء -الخميس ",3,1,2020,24241,null,null,null,null,null,null,null,null,null,null,null,null,null,null,null,null,null,null,null,null,null,null,null,null,null,null,null,null,null,null,null,null,null,null,null,null,null,null,null,null,null,null,null,93,"انتصار على محمد الشريف"," 16 -15 -1 "," الأربعاء -الأربعاء -الخميس ",3,1,2020,24241]
[null,8,"معلم 8",19," الأحد ",1,1,2020,24241,null,null,null,null,null,null,null,null,null,null,null,null,null,null,null,null,null,null,null,null,null,null,null,null,null,null,null,null,null,null,null,null,null,null,null,null,null,null,null,null,null,null,null,94,"ايمان على بشير ساسي"," 20 -19 "," الأحد -الإثنين ",2,1,2020,24241]
[null,9,"معلم 9"," 28 -19 "," الأحد -الثلاثاء ",2,1,2020,24241,null,null,null,null,null,null,null,null,null,null,null,null,null,null,null,null,null,null,null,null,null,null,null,null,null,null,null,null,null,null,null,null,null,null,null,null,null,null,null,null,null,null,null,95,"ايمان محمد علي الشريف"," 28 -27 "," الإثنين -الثلاثاء ",2,1,2020,24241]
[null,10,"معلم 10"," 16 -15 -1 "," الأربعاء -الأربعاء -الخميس ",3,1,2020,24241,null,null,null,null,null,null,null,null,null,null,null,null,null,null,null,null,null,null,null,null,null,null,null,null,null,null,null,null,null,null,null,null,null,null,null,null,null,null,null,null,null,null,null,96,"تغريد كامل احمد فرج",27," الإثنين ",1,1,2020,24241]
[null,11,"معلم 11"," 20 -19 "," الأحد -الإثنين ",2,1,2020,24241,null,null,null,null,null,null,null,null,null,null,null,null,null,null,null,null,null,null,null,null,null,null,null,null,null,null,null,null,null,null,null,null,null,null,null,null,null,null,null,null,null,null,null,97,"جميلة عمر خليفة الدرباك",1," الأربعاء ",1,1,2020,24241]
[null,12,"معلم 12"," 28 -27 "," الإثنين -الثلاثاء ",2,1,2020,24241,null,null,null,null,null,null,null,null,null,null,null,null,null,null,null,null,null,null,null,null,null,null,null,null,null,null,null,null,null,null,null,null,null,null,null,null,null,null,null,null,null,null,null,98,"حميدة عمران رجب الترهوني"," 29 -28 -20 -16 -15 -5 -1 "," الأربعاء -الأحد -الأربعاء -الخميس -الإثنين -الثلاثاء -الأربعاء ",7,1,2020,24241]
[null,13,"معلم 13",27," الإثنين ",1,1,2020,24241,null,null,null,null,null,null,null,null,null,null,null,null,null,null,null,null,null,null,null,null,null,null,null,null,null,null,null,null,null,null,null,null,null,null,null,null,null,null,null,null,null,null,null,99,"حنان عبدالغفار إبراهيم الكموشي"," 22 -21 "," الثلاثاء -الأربعاء ",2,1,2020,24241]
[null,14,"معلم 14",1," الأربعاء ",1,1,2020,24241,null,null,null,null,null,null,null,null,null,null,null,null,null,null,null,null,null,null,null,null,null,null,null,null,null,null,null,null,null,null,null,null,null,null,null,null,null,null,null,null,null,null,null,100,"حنان على الطاهر عبيد",15," الأربعاء ",1,1,2020,24241]
[null,15,"معلم 15"," 29 -28 -20 -16 -15 -5 -1 "," الأربعاء -الأحد -الأربعاء -الخميس -الإثنين -الثلاثاء -الأربعاء ",7,1,2020,24241,null,null,null,null,null,null,null,null,null,null,null,null,null,null,null,null,null,null,null,null,null,null,null,null,null,null,null,null,null,null,null,null,null,null,null,null,null,null,null,null,null,null,null,101,"حواء ميلاد ابوزيد ابوزيد"," 21 -19 "," الأحد -الثلاثاء ",2,1,2020,24241]
[null,16,"معلم 16"," 22 -21 "," الثلاثاء -الأربعاء ",2,1,2020,24241,null,null,null,null,null,null,null,null,null,null,null,null,null,null,null,null,null,null,null,null,null,null,null,null,null,null,null,null,null,null,null,null,null,null,null,null,null,null,null,null,null,null,null,102,"خالد محمد امحمد الكموشي",22," الأربعاء ",1,1,2020,24241]
[null,17,"معلم 17",15," الأربعاء ",1,1,2020,24241,null,null,null,null,null,null,null,null,null,null,null,null,null,null,null,null,null,null,null,null,null,null,null,null,null,null,null,null,null,null,null,null,null,null,null,null,null,null,null,null,null,null,null,103,"ربيعة سالم رمضان شتوان"," 27 -16 -15 -2 "," الخميس -الأربعاء -الخميس -الإثنين ",4,1,2020,24241]
[null,18,"معلم 18"," 21 -19 "," الأحد -الثلاثاء ",2,1,2020,24241,null,null,null,null,null,null,null,null,null,null,null,null,null,null,null,null,null,null,null,null,null,null,null,null,null,null,null,null,null,null,null,null,null,null,null,null,null,null,null,null,null,null,null,104,"ربيعة محمد عبدالله السموعي"," 28 -23 -20 -16 -1 "," الأربعاء -الخميس -الإثنين -الخميس -الثلاثاء ",5,1,2020,24241]
[null,19,"معلم 19",22," الأربعاء ",1,1,2020,24241,null,null,null,null,null,null,null,null,null,null,null,null,null,null,null,null,null,null,null,null,null,null,null,null,null,null,null,null,null,null,null,null,null,null,null,null,null,null,null,null,null,null,null,105,"ربيعة مختار محمد العزيبي"," 20 -15 "," الأربعاء -الإثنين ",2,1,2020,24241]
[null,20,"معلم 20"," 27 -16 -15 -2 "," الخميس -الأربعاء -الخميس -الإثنين ",4,1,2020,24241,null,null,null,null,null,null,null,null,null,null,null,null,null,null,null,null,null,null,null,null,null,null,null,null,null,null,null,null,null,null,null,null,null,null,null,null,null,null,null,null,null,null,null,106,"ريمة علي محمد النفاتي"," 29 -1 "," الأربعاء -الأربعاء ",2,1,2020,24241]
[null,21,"معلم 21"," 28 -23 -20 -16 -1 "," الأربعاء -الخميس -الإثنين -الخميس -الثلاثاء ",5,1,2020,24241,null,null,null,null,null,null,null,null,null,null,null,null,null,null,null,null,null,null,null,null,null,null,null,null,null,null,null,null,null,null,null,null,null,null,null,null,null,null,null,null,null,null,null,107,"زكية محمد مختار ابوالنور",29," الأربعاء ",1,1,2020,24241]
[null,22,"معلم 22"," 20 -15 "," الأربعاء -الإثنين ",2,1,2020,24241,null,null,null,null,null,null,null,null,null,null,null,null,null,null,null,null,null,null,null,null,null,null,null,null,null,null,null,null,null,null,null,null,null,null,null,null,null,null,null,null,null,null,null,108,"زينب ابراهيم محمد سيور",28," الثلاثاء ",1,1,2020,24241]
[null,23,"معلم 23"," 29 -1 "," الأربعاء -الأربعاء ",2,1,2020,24241,null,null,null,null,null,null,null,null,null,null,null,null,null,null,null,null,null,null,null,null,null,null,null,null,null,null,null,null,null,null,null,null,null,null,null,null,null,null,null,null,null,null,null,109,"زينب محمد على بالحاج"," 29 -15 "," الأربعاء -الأربعاء ",2,1,2020,24241]
[null,24,"معلم 24",29," الأربعاء ",1,1,2020,24241,null,null,null,null,null,null,null,null,null,null,null,null,null,null,null,null,null,null,null,null,null,null,null,null,null,null,null,null,null,null,null,null,null,null,null,null,null,null,null,null,null,null,null,110,"سالم الفيتوري محمد العبدلي"," 16 -2 "," الخميس -الخميس ",2,1,2020,24241]
[null,25,"معلم 25",28," الثلاثاء ",1,1,2020,24241,null,null,null,null,null,null,null,null,null,null,null,null,null,null,null,null,null,null,null,null,null,null,null,null,null,null,null,null,null,null,null,null,null,null,null,null,null,null,null,null,null,null,null,111,"سالمة علي عاشور ازويد"," 23 -22 -21 -19 -16 -15 "," الأربعاء -الخميس -الأحد -الثلاثاء -الأربعاء -الخميس ",6,1,2020,24241]
[null,26,"معلم 26"," 29 -15 "," الأربعاء -الأربعاء ",2,1,2020,24241,null,null,null,null,null,null,null,null,null,null,null,null,null,null,null,null,null,null,null,null,null,null,null,null,null,null,null,null,null,null,null,null,null,null,null,null,null,null,null,null,null,null,null,112,"سعاد علي الهادي عبدالسلام",22," الأربعاء ",1,1,2020,24241]
[null,27,"معلم 27"," 16 -2 "," الخميس -الخميس ",2,1,2020,24241,null,null,null,null,null,null,null,null,null,null,null,null,null,null,null,null,null,null,null,null,null,null,null,null,null,null,null,null,null,null,null,null,null,null,null,null,null,null,null,null,null,null,null,113,"صفاء السائح محمد ظواقة"," 27 -26 -23 -22 -21 -20 -19 -16 -15 -5 -2 -1 "," الأربعاء -الخميس -الأحد -الأربعاء -الخميس -الأحد -الإثنين -الثلاثاء -الأربعاء -الخميس -الأحد -الإثنين ",12,1,2020,24241]
[null,28,"معلم 28"," 23 -22 -21 -19 -16 -15 "," الأربعاء -الخميس -الأحد -الثلاثاء -الأربعاء -الخميس ",6,1,2020,24241,null,null,null,null,null,null,null,null,null,null,null,null,null,null,null,null,null,null,null,null,null,null,null,null,null,null,null,null,null,null,null,null,null,null,null,null,null,null,null,null,null,null,null,114,"عائشة عبدالله سعد الشنتيري"," 21 -16 "," الخميس -الثلاثاء ",2,1,2020,24241]
[null,29,"معلم 29",22," الأربعاء ",1,1,2020,24241,null,null,null,null,null,null,null,null,null,null,null,null,null,null,null,null,null,null,null,null,null,null,null,null,null,null,null,null,null,null,null,null,null,null,null,null,null,null,null,null,null,null,null,115,"عائشة مختار الصادق المسلاتي"," 23 -16 -15 -5 "," الأحد -الأربعاء -الخميس -الخميس ",4,1,2020,24241]
[null,30,"معلم 30"," 27 -26 -23 -22 -21 -20 -19 -16 -15 -14-13-12-9-8-7-6-5 -2-1"," الأربعاء -الخميس -الأحد -الأربعاء -الخميس -الأحد -الإثنين -الثلاثاء -الأربعاء -الخميس -الأحد -الإثنين ",19,1,2020,24241,null,null,null,null,null,null,null,null,null,null,null,null,null,null,null,null,null,null,null,null,null,null,null,null,null,null,null,null,null,null,null,null,null,null,null,null,null,null,null,null,null,null,null,116,"عبير محمود على الشريف"," 30 -26 -23 -22 -21 "," الثلاثاء -الأربعاء -الخميس -الأحد -الخميس ",5,1,2020,24241]
[null,31,"معلم 31"," 21 -16 "," الخميس -الثلاثاء ",2,1,2020,24241,null,null,null,null,null,null,null,null,null,null,null,null,null,null,null,null,null,null,null,null,null,null,null,null,null,null,null,null,null,null,null,null,null,null,null,null,null,null,null,null,null,null,null,117,"عفاف الطاهر احميدة خنشوش"," 27 -21 -16 -15 -5 "," الأحد -الأربعاء -الخميس -الثلاثاء -الإثنين ",5,1,2020,24241]
[null,32,"معلم 32"," 23 -16 -15 -5 "," الأحد -الأربعاء -الخميس -الخميس ",4,1,2020,24241,null,null,null,null,null,null,null,null,null,null,null,null,null,null,null,null,null,null,null,null,null,null,null,null,null,null,null,null,null,null,null,null,null,null,null,null,null,null,null,null,null,null,null,118,"عويش محمد المهدي النعاس"," 30 -15 -1 "," الأربعاء -الأربعاء -الخميس ",3,1,2020,24241]
[null,33,"معلم 33"," 30 -26 -23 -22 -21 "," الثلاثاء -الأربعاء -الخميس -الأحد -الخميس ",5,1,2020,24241,null,null,null,null,null,null,null,null,null,null,null,null,null,null,null,null,null,null,null,null,null,null,null,null,null,null,null,null,null,null,null,null,null,null,null,null,null,null,null,null,null,null,null,119,"غالية ابراهيم محمد الطاهر"," 16 -15 "," الأربعاء -الخميس ",2,1,2020,24241]
[null,34,"معلم 34"," 27 -21 -16 -15 -5 "," الأحد -الأربعاء -الخميس -الثلاثاء -الإثنين ",5,1,2020,24241,null,null,null,null,null,null,null,null,null,null,null,null,null,null,null,null,null,null,null,null,null,null,null,null,null,null,null,null,null,null,null,null,null,null,null,null,null,null,null,null,null,null,null,120,"فاتن الشاذلي محمد شهاب"," 19 -15 -5 "," الأحد -الأربعاء -الأحد ",3,1,2020,24241]
[null,35,"معلم 35"," 30 -15 -1 "," الأربعاء -الأربعاء -الخميس ",3,1,2020,24241,null,null,null,null,null,null,null,null,null,null,null,null,null,null,null,null,null,null,null,null,null,null,null,null,null,null,null,null,null,null,null,null,null,null,null,null,null,null,null,null,null,null,null,121,"فاطمة محمد البهلول محمد الضفير"," 21 -15 "," الأربعاء -الثلاثاء ",2,1,2020,24241]
[null,36,"معلم 36"," 16 -15 "," الأربعاء -الخميس ",2,1,2020,24241,null,null,null,null,null,null,null,null,null,null,null,null,null,null,null,null,null,null,null,null,null,null,null,null,null,null,null,null,null,null,null,null,null,null,null,null,null,null,null,null,null,null,null,122,"فدوى مفتاح محمد شلقم",1," الأربعاء ",1,1,2020,24241]
{"$rows_left_out":879}
{"sheet":"طباعة الغياب","index":1,"n_rows":26,"n_cols":11,"rows_kept":26,"cut":false,"hidden":false,"merged":[[22,1,22,2],[0,1,0,7],[1,1,1,7],[2,1,2,7],[3,1,3,7],[4,1,4,7],[23,1,23,2],[23,3,23,4],[23,5,23,6],[25,1,25,2],[25,3,25,4],[25,5,25,6]]}
[null,"دولــــــــــــــــــــة ليبيا",null,null,null,null,null,null,{"$f":"B8","v":15}]
[null,"وزارة التربيـــة والتعلـــيم"]
[null,"مراقبة التعليم"]
[null,"مدرسة 24 ديسمبر للتعليم الثانوي"]
[null,"كشف غياب بدون مبرر للمعلمين تعيين ((   P  )) عقد ((   P   )) خلال شهر سبتمــــــبر (  1 ) لسنة 2020 ف 1441 هـ "]
[]
[null,"الرقم","الاسم بالكامل","ايـــــــــــــــــــــــام الغياب","أيام الغياب بالحروف","عدد أيام الغياب ","الشهر","السنة"]
[null,15,{"$f":"IFERROR(VLOOKUP($B8,keabhosa!$B$5:$H$100,2,0),\"\")","v":"معلم 15"},{"$f":"IFERROR(VLOOKUP($B8,keabhosa!$B$5:$H$100,3,0),\"\")","v":" 29 -28 -20 -16 -15 -5 -1 "},{"$f":"IFERROR(VLOOKUP($B8,keabhosa!$B$5:$H$100,4,0),\"\")","v":" الأربعاء -الأحد -الأربعاء -الخميس -الإثنين -الثلاثاء -الأربعاء "},{"$f":"IFERROR(VLOOKUP($B8,keabhosa!$B$5:$H$100,5,0),\"\")","v":7},{"$f":"IFERROR(VLOOKUP($B8,keabhosa!$B$5:$H$100,6,0),\"\")","v":1},{"$f":"IFERROR(VLOOKUP($B8,keabhosa!$B$5:$H$100,7,0),\"\")","v":2020},null,null,{"$f":"COUNTA(C8:C21)-COUNTBLANK(C8:C21)","v":14}]
[null,{"$f":"B8+1","v":16},{"$f":"IFERROR(VLOOKUP($B9,keabhosa!$B$5:$H$100,2,0),\"\")","v":"معلم 16"},{"$f":"IFERROR(VLOOKUP($B9,keabhosa!$B$5:$H$100,3,0),\"\")","v":" 22 -21 "},{"$f":"IFERROR(VLOOKUP($B9,keabhosa!$B$5:$H$100,4,0),\"\")","v":" الثلاثاء -الأربعاء "},{"$f":"IFERROR(VLOOKUP($B9,keabhosa!$B$5:$H$100,5,0),\"\")","v":2},{"$f":"IFERROR(VLOOKUP($B9,keabhosa!$B$5:$H$100,6,0),\"\")","v":1},{"$f":"IFERROR(VLOOKUP($B9,keabhosa!$B$5:$H$100,7,0),\"\")","v":2020}]
[null,17,{"$f":"IFERROR(VLOOKUP($B10,keabhosa!$B$5:$H$100,2,0),\"\")","v":"معلم 17"},{"$f":"IFERROR(VLOOKUP($B10,keabhosa!$B$5:$H$100,3,0),\"\")","v":15},{"$f":"IFERROR(VLOOKUP($B10,keabhosa!$B$5:$H$100,4,0),\"\")","v":" الأربعاء "},{"$f":"IFERROR(VLOOKUP($B10,keabhosa!$B$5:$H$100,5,0),\"\")","v":1},{"$f":"IFERROR(VLOOKUP($B10,keabhosa!$B$5:$H$100,6,0),\"\")","v":1},{"$f":"IFERROR(VLOOKUP($B10,keabhosa!$B$5:$H$100,7,0),\"\")","v":2020}]
[null,18,{"$f":"IFERROR(VLOOKUP($B11,keabhosa!$B$5:$H$100,2,0),\"\")","v":"معلم 18"},{"$f":"IFERROR(VLOOKUP($B11,keabhosa!$B$5:$H$100,3,0),\"\")","v":" 21 -19 "},{"$f":"IFERROR(VLOOKUP($B11,keabhosa!$B$5:$H$100,4,0),\"\")","v":" الأحد -الثلاثاء "},{"$f":"IFERROR(VLOOKUP($B11,keabhosa!$B$5:$H$100,5,0),\"\")","v":2},{"$f":"IFERROR(VLOOKUP($B11,keabhosa!$B$5:$H$100,6,0),\"\")","v":1},{"$f":"IFERROR(VLOOKUP($B11,keabhosa!$B$5:$H$100,7,0),\"\")","v":2020}]
[null,19,{"$f":"IFERROR(VLOOKUP($B12,keabhosa!$B$5:$H$100,2,0),\"\")","v":"معلم 19"},{"$f":"IFERROR(VLOOKUP($B12,keabhosa!$B$5:$H$100,3,0),\"\")","v":22},{"$f":"IFERROR(VLOOKUP($B12,keabhosa!$B$5:$H$100,4,0),\"\")","v":" الأربعاء "},{"$f":"IFERROR(VLOOKUP($B12,keabhosa!$B$5:$H$100,5,0),\"\")","v":1},{"$f":"IFERROR(VLOOKUP($B12,keabhosa!$B$5:$H$100,6,0),\"\")","v":1},{"$f":"IFERROR(VLOOKUP($B12,keabhosa!$B$5:$H$100,7,0),\"\")","v":2020}]
[null,20,{"$f":"IFERROR(VLOOKUP($B13,keabhosa!$B$5:$H$100,2,0),\"\")","v":"معلم 20"},{"$f":"IFERROR(VLOOKUP($B13,keabhosa!$B$5:$H$100,3,0),\"\")","v":" 27 -16 -15 -2 "},{"$f":"IFERROR(VLOOKUP($B13,keabhosa!$B$5:$H$100,4,0),\"\")","v":" الخميس -الأربعاء -الخميس -الإثنين "},{"$f":"IFERROR(VLOOKUP($B13,keabhosa!$B$5:$H$100,5,0),\"\")","v":4},{"$f":"IFERROR(VLOOKUP($B13,keabhosa!$B$5:$H$100,6,0),\"\")","v":1},{"$f":"IFERROR(VLOOKUP($B13,keabhosa!$B$5:$H$100,7,0),\"\")","v":2020}]
[null,21,{"$f":"IFERROR(VLOOKUP($B14,keabhosa!$B$5:$H$100,2,0),\"\")","v":"معلم 21"},{"$f":"IFERROR(VLOOKUP($B14,keabhosa!$B$5:$H$100,3,0),\"\")","v":" 28 -23 -20 -16 -1 "},{"$f":"IFERROR(VLOOKUP($B14,keabhosa!$B$5:$H$100,4,0),\"\")","v":" الأربعاء -الخميس -الإثنين -الخميس -الثلاثاء "},{"$f":"IFERROR(VLOOKUP($B14,keabhosa!$B$5:$H$100,5,0),\"\")","v":5},{"$f":"IFERROR(VLOOKUP($B14,keabhosa!$B$5:$H$100,6,0),\"\")","v":1},{"$f":"IFERROR(VLOOKUP($B14,keabhosa!$B$5:$H$100,7,0),\"\")","v":2020}]
[null,22,{"$f":"IFERROR(VLOOKUP($B15,keabhosa!$B$5:$H$100,2,0),\"\")","v":"معلم 22"},{"$f":"IFERROR(VLOOKUP($B15,keabhosa!$B$5:$H$100,3,0),\"\")","v":" 20 -15 "},{"$f":"IFERROR(VLOOKUP($B15,keabhosa!$B$5:$H$100,4,0),\"\")","v":" الأربعاء -الإثنين "},{"$f":"IFERROR(VLOOKUP($B15,keabhosa!$B$5:$H$100,5,0),\"\")","v":2},{"$f":"IFERROR(VLOOKUP($B15,keabhosa!$B$5:$H$100,6,0),\"\")","v":1},{"$f":"IFERROR(VLOOKUP($B15,keabhosa!$B$5:$H$100,7,0),\"\")","v":2020}]
[null,23,{"$f":"IFERROR(VLOOKUP($B16,keabhosa!$B$5:$H$100,2,0),\"\")","v":"معلم 23"},{"$f":"IFERROR(VLOOKUP($B16,keabhosa!$B$5:$H$100,3,0),\"\")","v":" 29 -1 "},{"$f":"IFERROR(VLOOKUP($B16,keabhosa!$B$5:$H$100,4,0),\"\")","v":" الأربعاء -الأربعاء "},{"$f":"IFERROR(VLOOKUP($B16,keabhosa!$B$5:$H$100,5,0),\"\")","v":2},{"$f":"IFERROR(VLOOKUP($B16,keabhosa!$B$5:$H$100,6,0),\"\")","v":1},{"$f":"IFERROR(VLOOKUP($B16,keabhosa!$B$5:$H$100,7,0),\"\")","v":2020}]
[null,24,{"$f":"IFERROR(VLOOKUP($B17,keabhosa!$B$5:$H$100,2,0),\"\")","v":"معلم 24"},{"$f":"IFERROR(VLOOKUP($B17,keabhosa!$B$5:$H$100,3,0),\"\")","v":29},{"$f":"IFERROR(VLOOKUP($B17,keabhosa!$B$5:$H$100,4,0),\"\")","v":" الأربعاء "},{"$f":"IFERROR(VLOOKUP($B17,keabhosa!$B$5:$H$100,5,0),\"\")","v":1},{"$f":"IFERROR(VLOOKUP($B17,keabhosa!$B$5:$H$100,6,0),\"\")","v":1},{"$f":"IFERROR(VLOOKUP($B17,keabhosa!$B$5:$H$100,7,0),\"\")","v":2020}]
[null,25,{"$f":"IFERROR(VLOOKUP($B18,keabhosa!$B$5:$H$100,2,0),\"\")","v":"معلم 25"},{"$f":"IFERROR(VLOOKUP($B18,keabhosa!$B$5:$H$100,3,0),\"\")","v":28},{"$f":"IFERROR(VLOOKUP($B18,keabhosa!$B$5:$H$100,4,0),\"\")","v":" الثلاثاء "},{"$f":"IFERROR(VLOOKUP($B18,keabhosa!$B$5:$H$100,5,0),\"\")","v":1},{"$f":"IFERROR(VLOOKUP($B18,keabhosa!$B$5:$H$100,6,0),\"\")","v":1},{"$f":"IFERROR(VLOOKUP($B18,keabhosa!$B$5:$H$100,7,0),\"\")","v":2020}]
[null,26,{"$f":"IFERROR(VLOOKUP($B19,keabhosa!$B$5:$H$100,2,0),\"\")","v":"معلم 26"},{"$f":"IFERROR(VLOOKUP($B19,keabhosa!$B$5:$H$100,3,0),\"\")","v":" 29 -15 "},{"$f":"IFERROR(VLOOKUP($B19,keabhosa!$B$5:$H$100,4,0),\"\")","v":" الأربعاء -الأربعاء "},{"$f":"IFERROR(VLOOKUP($B19,keabhosa!$B$5:$H$100,5,0),\"\")","v":2},{"$f":"IFERROR(VLOOKUP($B19,keabhosa!$B$5:$H$100,6,0),\"\")","v":1},{"$f":"IFERROR(VLOOKUP($B19,keabhosa!$B$5:$H$100,7,0),\"\")","v":2020}]
[null,27,{"$f":"IFERROR(VLOOKUP($B20,keabhosa!$B$5:$H$100,2,0),\"\")","v":"معلم 27"},{"$f":"IFERROR(VLOOKUP($B20,keabhosa!$B$5:$H$100,3,0),\"\")","v":" 16 -2 "},{"$f":"IFERROR(VLOOKUP($B20,keabhosa!$B$5:$H$100,4,0),\"\")","v":" الخميس -الخميس "},{"$f":"IFERROR(VLOOKUP($B20,keabhosa!$B$5:$H$100,5,0),\"\")","v":2},{"$f":"IFERROR(VLOOKUP($B20,keabhosa!$B$5:$H$100,6,0),\"\")","v":1},{"$f":"IFERROR(VLOOKUP($B20,keabhosa!$B$5:$H$100,7,0),\"\")","v":2020}]
[null,28,{"$f":"IFERROR(VLOOKUP($B21,keabhosa!$B$5:$H$100,2,0),\"\")","v":"معلم 28"},{"$f":"IFERROR(VLOOKUP($B21,keabhosa!$B$5:$H$100,3,0),\"\")","v":" 23 -22 -21 -19 -16 -15 "},{"$f":"IFERROR(VLOOKUP($B21,keabhosa!$B$5:$H$100,4,0),\"\")","v":" الأربعاء -الخميس -الأحد -الثلاثاء -الأربعاء -الخميس "},{"$f":"IFERROR(VLOOKUP($B21,keabhosa!$B$5:$H$100,5,0),\"\")","v":6},{"$f":"IFERROR(VLOOKUP($B21,keabhosa!$B$5:$H$100,6,0),\"\")","v":1},{"$f":"IFERROR(VLOOKUP($B21,keabhosa!$B$5:$H$100,7,0),\"\")","v":2020}]
[]
[null,"المكلف بتفريغ الغياب",null,null,null,null,null,"اعتماد مدير المدرسة"]
[null,"الاسم : خــــيري علـــي الكمـــــــوشي",null,null,null,"مساعد الفترة المسائية / ...............................",null,"الاســــــم : ................................"]
[]
[null,"التوقيع : ........................................",null,null,null,"التوقيع : ..........................................................",null,"التوقيع : ..........................................."]