{"text_format":"1","workbook":"xlsx","n_sheets":4,"sheets":["ورقة1","ر1","م1 1","ش1 1"],"not_rendered":{"charts":0,"images":3,"macros":1,"external_links":0,"defined_names":7,"comments":0,"pivot_tables":0},"unopened":[],"bounds":{"document_bytes":16777216,"sheet_cells":100000,"rows_first":2000,"rows_last":500,"rows_between":2000,"halvings":0,"cell_chars":16384,"cell_head_chars":4096},"cells_cut":0,"cells_raw":0,"read":"whole","date_system":"1900"}

{"sheet":"ورقة1","index":0,"n_rows":11,"n_cols":3,"rows_kept":11,"cut":false,"hidden":true,"merged":[[3,2,3,17],[10,2,10,17],[14,6,14,12]]}
[]
[]
[]
[]
[]
[]
[]
[]
[]
[]
[null,null,"فضلا.. قم بتمكين وحدات الماكرو لكي تتمكن من فتح هذا المصنف "]

{"sheet":"ر1","index":1,"n_rows":39,"n_cols":39,"rows_kept":39,"cut":false,"hidden":false,"merged":[[1,31,2,32],[3,31,3,36],[3,0,5,0],[3,3,5,3],[3,7,3,12],[3,13,3,18],[3,19,3,24],[3,25,3,30],[3,4,5,4],[3,6,5,6],[3,2,5,2],[1,2,2,6],[1,21,2,24],[1,7,2,20],[1,25,2,28],[1,29,2,30]]}
[2]
[null,null,"تسجيل بيانات الطلاب ",null,null,null,null,"رصد درجات الاختبارات الشهرية والنهائية للفصلين الأول والثاني",null,null,null,null,null,null,null,null,null,null,null,null,null,null,null,null,null,"الصف: ( الأول )",null,null,null,"الشعبة:",null,"هـ"]
[]
[null,null,"رقم السجل","اســــــــــــم الطــــــــــــالب","     اللقب",null,"    الجنسية ","القرآن الكريم ",null,null,null,null,null,"التربية الإسلامية ",null,null,null,null,null,"اللغة العربية ",null,null,null,null,null,"الرياضيات ",null,null,null,null,null,"العلوم"]
[null,null,null,null,null,"  النوع",null,"  اكتوبر","  نوفمبر","  الفصل","  يناير","  فبراير","  نهائي","  اكتوبر","  نوفمبر","  الفصل","  يناير","  فبراير","  نهائي","  اكتوبر","  نوفمبر","  الفصل","  يناير","  فبراير","  نهائي","  اكتوبر","  نوفمبر","  الفصل","  يناير","  فبراير","  نهائي","  اكتوبر","  نوفمبر","  الفصل","  يناير","  فبراير","  نهائي"]
[null,null,null,null,null,null,null,100,100,30,100,100,30,100,100,30,100,100,30,100,100,30,100,100,30,100,100,30,100,100,30,100,100,30,100,100,30]
[null,null,1,"الخضر عبدالله الخضر عبدالله عمر","عمر","ذكر ","يمني",90,100,30,null,null,null,100,100,30,null,null,null,100,98,30,null,null,null,100,100,30,null,null,null,100,100,30]
[null,null,2,"أحمد ناصر أحمد صالح حيدره","حيدره","ذكر","يمني",90,100,29,null,null,null,100,93,29,null,null,null,92,91,29,null,null,null,100,94,29,null,null,null,100,100,29,null,null,null,null,"بدون"]
[null,null,3,"بيان حسين سعيد علي حقروص","حقروص","أنثى","يمنية",100,100,28,null,null,null,100,100,28,null,null,null,100,100,28,null,null,null,100,100,28,null,null,null,100,100,28,null,null,null,null,"أ"]
[null,null,4,"جود أحمد صالح طالب معيض","معيض","أنثى","يمنية",100,100,27,null,null,null,100,100,27,null,null,null,100,100,27,null,null,null,100,100,27,null,null,null,100,100,27,null,null,null,null,"ب"]
[null,null,5,"دانه صالح حسين ناصر دوح","دوح","أنثى","يمنية",90,100,26,null,null,null,100,100,26,null,null,null,94,100,26,null,null,null,100,96,26,null,null,null,100,100,26,null,null,null,null,"ج"]
[null,null,6,"راكان محمد أحمد ناصر معيض","معيض","ذكر","يمني",100,100,25,null,null,null,100,100,25,null,null,null,100,100,25,null,null,null,100,100,25,null,null,null,100,100,25,null,null,null,null,"د"]
[null,null,7,"رحاب ماجد عمر علي حقروص","حقروص","أنثى","يمنية",100,100,24,null,null,null,100,100,24,null,null,null,98,98,24,null,null,null,100,98,24,null,null,null,97,98,24,null,null,null,null,"هـ"]
[null,null,8,"رسيل نايف صالح عيدروس دوح","دوح","أنثى","يمنية",100,100,23,null,null,null,100,100,23,null,null,null,100,100,23,null,null,null,100,100,23,null,null,null,100,100,23,null,null,null,null,"و"]
[null,null,9,"رندى أحمد سعيد منصور السمع","السمع","أنثى","يمنية",98,95,22,null,null,null,100,100,22,null,null,null,100,100,22,null,null,null,100,100,22,null,null,null,100,100,22,null,null,null,null,"ي"]
[null,null,10,"سلمان محمد رويس محمد لحنف","لحنف","ذكر","يمني",100,100,20,null,null,null,100,100,20,null,null,null,96,91,20,null,null,null,100,100,20,null,null,null,95,100,20]
[null,null,11,"علي أحمد عبدالله علي حقروص","حقروص","ذكر","يمني",90,100,19,null,null,null,100,100,19,null,null,null,95,92,19,null,null,null,100,100,19,null,null,null,100,100,19]
[null,null,12,"فاطمة عبدالله رويس محمد لحنف","لحنف","أنثى","يمنية",90,100,18,null,null,null,93,100,18,null,null,null,68,88,18,null,null,null,94,96,18,null,null,null,93,100,18]
[null,null,13,"لمى ناظم أحمد صالح حقروص","حقروص","أنثى","يمنية",100,100,17,null,null,null,100,100,17,null,null,null,100,100,17,null,null,null,100,100,17,null,null,null,100,100,17]
[null,null,14,"محمد سالم صالح عيدروس دوح","دوح","ذكر","يمني",100,100,16,null,null,null,100,100,16,null,null,null,100,100,16,null,null,null,100,100,16,null,null,null,100,100,16]
[null,null,15,"محمد علي سعيد حسين يوس","يوس","ذكر","يمني",100,100,15,null,null,null,100,98,15,null,null,null,96,92,15,null,null,null,100,100,15,null,null,null,100,100,15]
[null,null,16,"منه أحمد سالم أحمد معيض","معيض","أنثى","يمنية",100,100,14,null,null,null,100,100,14,null,null,null,98,97,14,null,null,null,100,100,14,null,null,null,100,100,14]
[null,null,17,"نواف أحمد محسن عبدالله البريكي","البريكي","ذكر","يمني",90,100,13,null,null,null,100,100,13,null,null,null,100,100,13,null,null,null,100,100,13,null,null,null,100,100,13]
[null,null,18,"هيفاء عيضة عمر علي حقروص","حقروص","أنثى","يمنية",90,100,12,null,null,null,100,100,12,null,null,null,100,96,12,null,null,null,100,98,12,null,null,null,100,98,12]
[null,null,19]
[null,null,20]
[null,null,21]
[null,null,22]
[null,null,23]
[null,null,24]
{"$rows_left_out":10}
{"sheet":"م1 1","index":2,"n_rows":43,"n_cols":26,"rows_kept":43,"cut":false,"hidden":false,"merged":[[6,1,8,1],[6,3,6,5],[6,6,6,8],[6,9,6,11],[6,15,6,17],[6,12,6,14],[6,2,8,2],[41,9,41,12],[41,17,41,19],[6,20,8,20],[6,18,7,18],[6,19,8,19],[1,17,1,20],[1,15,1,16],[2,17,2,18],[4,3,5,16],[5,17,5,19],[3,17,3,18]]}
[]
[null,null,null,null,null,null,null,null,null,null,null,null,null,null,null,"مدرسة /"]
[null,null,null,null,null,null,null,null,null,null,null,null,null,null,null,null,"الصف /","الأول"]
[null,null,null,null,null,null,null,null,null,null,null,null,null,null,null,null,"الشعبة /",{"$f":"ر1!$AF$2","v":"هـ"}]
[null,null,null,"كشوفات رصد درجات أعمال وامتحانات الفصل الدراسي الأول في المرحلة الأساسية للعام الدراسي "]
[null,null,null,null,null,null,null,null,null,null,null,null,null,null,null,null,null,{"$f":"#REF!","v":{"$error":"#REF!"}}]
[null,"رقم مسلسل","اســـــــم الطالـــب ","القرآن الكريم ",null,null,"التربية الإسلامية ",null,null,"اللغة العربية ",null,null,"الرياضيات ",null,null,"العلوم ",null,null,"المجموع الكلي","نتيجة الفصل الأول","الملاحظات "]
[null,null,null,"محصلة الفصل الأول","امتحان الفصل الأول","المجموع","محصلة الفصل الأول","امتحان الفصل الأول","المجموع","محصلة الفصل الأول","امتحان الفصل الأول","المجموع","محصلة الفصل الأول","امتحان الفصل الأول","المجموع","محصلة الفصل الأول","امتحان الفصل الأول","المجموع"]
[null,null,null,20,30,50,20,30,50,20,30,50,20,30,50,20,30,50,250]
[null,1,{"$f":"ر1!D7","v":"الخضر عبدالله الخضر عبدالله عمر"},{"$f":"(ر1!H7+ر1!I7)/10","v":19},{"$f":"ر1!J7","v":30},{"$f":"ROUND((D10+E10),0)","v":49},{"$f":"(ر1!N7+ر1!O7)/10","v":20},{"$f":"ر1!P7","v":30},{"$f":"ROUND((G10+H10),0)","v":50},{"$f":"(ر1!T7+ر1!U7)/10","v":19.8},{"$f":"ر1!V7","v":30},{"$f":"ROUND((J10+K10),0)","v":50},{"$f":"(ر1!Z7+ر1!AA7)/10","v":20},{"$f":"ر1!AB7","v":30},{"$f":"ROUND((M10+N10),0)","v":50},{"$f":"(ر1!AF7+ر1!AG7)/10","v":20},{"$f":"ر1!AH7","v":30},{"$f":"ROUND((P10+Q10),0)","v":50},{"$f":"ROUND((R10+O10+L10+I10+F10),0)","v":249},{"$f":"IF(S10=0,\"\",(IF(AND(R10>=25,O10>=25,L10>=25,I10>=25,F10>=25),\"ناجح\",\"راسب\")))","v":"ناجح"},null,null,null,{"$f":"SUMPRODUCT((S10<=$S$10:$S$39)/COUNTIF($S$10:$S$39,$S$10:$S$39))","v":1},{"$f":"COUNTIF($X$10:X10,X10)","v":1},{"$f":"IF(COUNTIF($X$10:X10,X10)>1,\"مكرر\",\"\")","v":""}]
[null,2,{"$f":"ر1!D8","v":"أحمد ناصر أحمد صالح حيدره"},{"$f":"(ر1!H8+ر1!I8)/10","v":19},{"$f":"ر1!J8","v":29},{"$f":"ROUND((D11+E11),0)","v":48},{"$f":"(ر1!N8+ر1!O8)/10","v":19.3},{"$f":"ر1!P8","v":29},{"$f":"ROUND((G11+H11),0)","v":48},{"$f":"(ر1!T8+ر1!U8)/10","v":18.3},{"$f":"ر1!V8","v":29},{"$f":"ROUND((J11+K11),0)","v":47},{"$f":"(ر1!Z8+ر1!AA8)/10","v":19.399999999999999},{"$f":"ر1!AB8","v":29},{"$f":"ROUND((M11+N11),0)","v":48},{"$f":"(ر1!AF8+ر1!AG8)/10","v":20},{"$f":"ر1!AH8","v":29},{"$f":"ROUND((P11+Q11),0)","v":49},{"$f":"ROUND((R11+O11+L11+I11+F11),0)","v":240},{"$f":"IF(S11=0,\"\",(IF(AND(R11>=25,O11>=25,L11>=25,I11>=25,F11>=25),\"ناجح\",\"راسب\")))","v":"ناجح"},null,null,null,{"$f":"SUMPRODUCT((S11<=$S$10:$S$39)/COUNTIF($S$10:$S$39,$S$10:$S$39))","v":2},{"$f":"COUNTIF($X$10:X11,X11)","v":1},{"$f":"IF(COUNTIF($X$10:X11,X11)>1,\"مكرر\",\"\")","v":""}]
[null,3,{"$f":"ر1!D9","v":"بيان حسين سعيد علي حقروص"},{"$f":"(ر1!H9+ر1!I9)/10","v":20},{"$f":"ر1!J9","v":28},48,{"$f":"(ر1!N9+ر1!O9)/10","v":20},{"$f":"ر1!P9","v":28},48,{"$f":"(ر1!T9+ر1!U9)/10","v":20},{"$f":"ر1!V9","v":28},48,{"$f":"(ر1!Z9+ر1!AA9)/10","v":20},{"$f":"ر1!AB9","v":28},48,{"$f":"(ر1!AF9+ر1!AG9)/10","v":20},{"$f":"ر1!AH9","v":28},48,240,"ناجح",null,null,null,2,{"$f":"COUNTIF($X$10:X12,X12)","v":2},{"$f":"IF(COUNTIF($X$10:X12,X12)>1,\"مكرر\",\"\")","v":"مكرر"}]
[null,4,{"$f":"ر1!D10","v":"جود أحمد صالح طالب معيض"},{"$f":"(ر1!H10+ر1!I10)/10","v":20},{"$f":"ر1!J10","v":27},47,{"$f":"(ر1!N10+ر1!O10)/10","v":20},{"$f":"ر1!P10","v":27},47,{"$f":"(ر1!T10+ر1!U10)/10","v":20},{"$f":"ر1!V10","v":27},47,{"$f":"(ر1!Z10+ر1!AA10)/10","v":20},{"$f":"ر1!AB10","v":27},47,{"$f":"(ر1!AF10+ر1!AG10)/10","v":20},{"$f":"ر1!AH10","v":27},47,235,"ناجح",null,null,null,3,{"$f":"COUNTIF($X$10:X13,X13)","v":1},{"$f":"IF(COUNTIF($X$10:X13,X13)>1,\"مكرر\",\"\")","v":""}]
[null,5,{"$f":"ر1!D11","v":"دانه صالح حسين ناصر دوح"},{"$f":"(ر1!H11+ر1!I11)/10","v":19},{"$f":"ر1!J11","v":26},45,{"$f":"(ر1!N11+ر1!O11)/10","v":20},{"$f":"ر1!P11","v":26},46,{"$f":"(ر1!T11+ر1!U11)/10","v":19.399999999999999},{"$f":"ر1!V11","v":26},45,{"$f":"(ر1!Z11+ر1!AA11)/10","v":19.600000000000001},{"$f":"ر1!AB11","v":26},46,{"$f":"(ر1!AF11+ر1!AG11)/10","v":20},{"$f":"ر1!AH11","v":26},46,228,"ناجح",null,null,null,4,{"$f":"COUNTIF($X$10:X14,X14)","v":1},{"$f":"IF(COUNTIF($X$10:X14,X14)>1,\"مكرر\",\"\")","v":""}]
[null,6,{"$f":"ر1!D12","v":"راكان محمد أحمد ناصر معيض"},{"$f":"(ر1!H12+ر1!I12)/10","v":20},{"$f":"ر1!J12","v":25},45,{"$f":"(ر1!N12+ر1!O12)/10","v":20},{"$f":"ر1!P12","v":25},45,{"$f":"(ر1!T12+ر1!U12)/10","v":20},{"$f":"ر1!V12","v":25},45,{"$f":"(ر1!Z12+ر1!AA12)/10","v":20},{"$f":"ر1!AB12","v":25},45,{"$f":"(ر1!AF12+ر1!AG12)/10","v":20},{"$f":"ر1!AH12","v":25},45,225,"ناجح",null,null,null,5,{"$f":"COUNTIF($X$10:X15,X15)","v":1},{"$f":"IF(COUNTIF($X$10:X15,X15)>1,\"مكرر\",\"\")","v":""}]
[null,7,{"$f":"ر1!D13","v":"رحاب ماجد عمر علي حقروص"},{"$f":"(ر1!H13+ر1!I13)/10","v":20},{"$f":"ر1!J13","v":24},44,{"$f":"(ر1!N13+ر1!O13)/10","v":20},{"$f":"ر1!P13","v":24},44,{"$f":"(ر1!T13+ر1!U13)/10","v":19.600000000000001},{"$f":"ر1!V13","v":24},44,{"$f":"(ر1!Z13+ر1!AA13)/10","v":19.8},{"$f":"ر1!AB13","v":24},44,{"$f":"(ر1!AF13+ر1!AG13)/10","v":19.5},{"$f":"ر1!AH13","v":24},44,220,"ناجح",null,null,null,6,{"$f":"COUNTIF($X$10:X16,X16)","v":1},{"$f":"IF(COUNTIF($X$10:X16,X16)>1,\"مكرر\",\"\")","v":""}]
[null,8,{"$f":"ر1!D14","v":"رسيل نايف صالح عيدروس دوح"},{"$f":"(ر1!H14+ر1!I14)/10","v":20},{"$f":"ر1!J14","v":23},43,{"$f":"(ر1!N14+ر1!O14)/10","v":20},{"$f":"ر1!P14","v":23},43,{"$f":"(ر1!T14+ر1!U14)/10","v":20},{"$f":"ر1!V14","v":23},43,{"$f":"(ر1!Z14+ر1!AA14)/10","v":20},{"$f":"ر1!AB14","v":23},43,{"$f":"(ر1!AF14+ر1!AG14)/10","v":20},{"$f":"ر1!AH14","v":23},43,215,"ناجح",null,null,null,7,{"$f":"COUNTIF($X$10:X17,X17)","v":1},{"$f":"IF(COUNTIF($X$10:X17,X17)>1,\"مكرر\",\"\")","v":""}]
[null,9,{"$f":"ر1!D15","v":"رندى أحمد سعيد منصور السمع"},{"$f":"(ر1!H15+ر1!I15)/10","v":19.3},{"$f":"ر1!J15","v":22},41,{"$f":"(ر1!N15+ر1!O15)/10","v":20},{"$f":"ر1!P15","v":22},42,{"$f":"(ر1!T15+ر1!U15)/10","v":20},{"$f":"ر1!V15","v":22},42,{"$f":"(ر1!Z15+ر1!AA15)/10","v":20},{"$f":"ر1!AB15","v":22},42,{"$f":"(ر1!AF15+ر1!AG15)/10","v":20},{"$f":"ر1!AH15","v":22},42,209,"ناجح",null,null,null,8,{"$f":"COUNTIF($X$10:X18,X18)","v":1},{"$f":"IF(COUNTIF($X$10:X18,X18)>1,\"مكرر\",\"\")","v":""}]
[null,10,{"$f":"ر1!D16","v":"سلمان محمد رويس محمد لحنف"},{"$f":"(ر1!H16+ر1!I16)/10","v":20},{"$f":"ر1!J16","v":20},40,{"$f":"(ر1!N16+ر1!O16)/10","v":20},{"$f":"ر1!P16","v":20},40,{"$f":"(ر1!T16+ر1!U16)/10","v":18.7},{"$f":"ر1!V16","v":20},39,{"$f":"(ر1!Z16+ر1!AA16)/10","v":20},{"$f":"ر1!AB16","v":20},40,{"$f":"(ر1!AF16+ر1!AG16)/10","v":19.5},{"$f":"ر1!AH16","v":20},40,199,"ناجح",null,null,null,9,{"$f":"COUNTIF($X$10:X19,X19)","v":1},{"$f":"IF(COUNTIF($X$10:X19,X19)>1,\"مكرر\",\"\")","v":""}]
[null,11,{"$f":"ر1!D17","v":"علي أحمد عبدالله علي حقروص"},{"$f":"(ر1!H17+ر1!I17)/10","v":19},{"$f":"ر1!J17","v":19},38,{"$f":"(ر1!N17+ر1!O17)/10","v":20},{"$f":"ر1!P17","v":19},39,{"$f":"(ر1!T17+ر1!U17)/10","v":18.7},{"$f":"ر1!V17","v":19},38,{"$f":"(ر1!Z17+ر1!AA17)/10","v":20},{"$f":"ر1!AB17","v":19},39,{"$f":"(ر1!AF17+ر1!AG17)/10","v":20},{"$f":"ر1!AH17","v":19},39,193,"ناجح",null,null,null,10,{"$f":"COUNTIF($X$10:X20,X20)","v":1},{"$f":"IF(COUNTIF($X$10:X20,X20)>1,\"مكرر\",\"\")","v":""}]
[null,12,{"$f":"ر1!D18","v":"فاطمة عبدالله رويس محمد لحنف"},{"$f":"(ر1!H18+ر1!I18)/10","v":19},{"$f":"ر1!J18","v":18},37,{"$f":"(ر1!N18+ر1!O18)/10","v":19.3},{"$f":"ر1!P18","v":18},37,{"$f":"(ر1!T18+ر1!U18)/10","v":15.6},{"$f":"ر1!V18","v":18},34,{"$f":"(ر1!Z18+ر1!AA18)/10","v":19},{"$f":"ر1!AB18","v":18},37,{"$f":"(ر1!AF18+ر1!AG18)/10","v":19.3},{"$f":"ر1!AH18","v":18},37,182,"ناجح",null,null,null,12,{"$f":"COUNTIF($X$10:X21,X21)","v":1},{"$f":"IF(COUNTIF($X$10:X21,X21)>1,\"مكرر\",\"\")","v":""}]
[null,13,{"$f":"ر1!D19","v":"لمى ناظم أحمد صالح حقروص"},{"$f":"(ر1!H19+ر1!I19)/10","v":20},{"$f":"ر1!J19","v":17},37,{"$f":"(ر1!N19+ر1!O19)/10","v":20},{"$f":"ر1!P19","v":17},37,{"$f":"(ر1!T19+ر1!U19)/10","v":20},{"$f":"ر1!V19","v":17},37,{"$f":"(ر1!Z19+ر1!AA19)/10","v":20},{"$f":"ر1!AB19","v":17},37,{"$f":"(ر1!AF19+ر1!AG19)/10","v":20},{"$f":"ر1!AH19","v":17},37,185,"ناجح",null,null,null,11,{"$f":"COUNTIF($X$10:X22,X22)","v":1},{"$f":"IF(COUNTIF($X$10:X22,X22)>1,\"مكرر\",\"\")","v":""}]
[null,14,{"$f":"ر1!D20","v":"محمد سالم صالح عيدروس دوح"},{"$f":"(ر1!H20+ر1!I20)/10","v":20},{"$f":"ر1!J20","v":16},36,{"$f":"(ر1!N20+ر1!O20)/10","v":20},{"$f":"ر1!P20","v":16},36,{"$f":"(ر1!T20+ر1!U20)/10","v":20},{"$f":"ر1!V20","v":16},36,{"$f":"(ر1!Z20+ر1!AA20)/10","v":20},{"$f":"ر1!AB20","v":16},36,{"$f":"(ر1!AF20+ر1!AG20)/10","v":20},{"$f":"ر1!AH20","v":16},36,180,"ناجح",null,null,null,13,{"$f":"COUNTIF($X$10:X23,X23)","v":1},{"$f":"IF(COUNTIF($X$10:X23,X23)>1,\"مكرر\",\"\")","v":""}]
[null,15,{"$f":"ر1!D21","v":"محمد علي سعيد حسين يوس"},{"$f":"(ر1!H21+ر1!I21)/10","v":20},{"$f":"ر1!J21","v":15},35,{"$f":"(ر1!N21+ر1!O21)/10","v":19.8},{"$f":"ر1!P21","v":15},35,{"$f":"(ر1!T21+ر1!U21)/10","v":18.8},{"$f":"ر1!V21","v":15},34,{"$f":"(ر1!Z21+ر1!AA21)/10","v":20},{"$f":"ر1!AB21","v":15},35,{"$f":"(ر1!AF21+ر1!AG21)/10","v":20},{"$f":"ر1!AH21","v":15},35,174,"ناجح",null,null,null,14,{"$f":"COUNTIF($X$10:X24,X24)","v":1},{"$f":"IF(COUNTIF($X$10:X24,X24)>1,\"مكرر\",\"\")","v":""}]
[null,16,{"$f":"ر1!D22","v":"منه أحمد سالم أحمد معيض"},{"$f":"(ر1!H22+ر1!I22)/10","v":20},{"$f":"ر1!J22","v":14},34,{"$f":"(ر1!N22+ر1!O22)/10","v":20},{"$f":"ر1!P22","v":14},34,{"$f":"(ر1!T22+ر1!U22)/10","v":19.5},{"$f":"ر1!V22","v":14},34,{"$f":"(ر1!Z22+ر1!AA22)/10","v":20},{"$f":"ر1!AB22","v":14},34,{"$f":"(ر1!AF22+ر1!AG22)/10","v":20},{"$f":"ر1!AH22","v":14},34,170,"ناجح",null,null,null,15,{"$f":"COUNTIF($X$10:X25,X25)","v":1},{"$f":"IF(COUNTIF($X$10:X25,X25)>1,\"مكرر\",\"\")","v":""}]
[null,17,{"$f":"ر1!D23","v":"نواف أحمد محسن عبدالله البريكي"},{"$f":"(ر1!H23+ر1!I23)/10","v":19},{"$f":"ر1!J23","v":13},32,{"$f":"(ر1!N23+ر1!O23)/10","v":20},{"$f":"ر1!P23","v":13},33,{"$f":"(ر1!T23+ر1!U23)/10","v":20},{"$f":"ر1!V23","v":13},33,{"$f":"(ر1!Z23+ر1!AA23)/10","v":20},{"$f":"ر1!AB23","v":13},33,{"$f":"(ر1!AF23+ر1!AG23)/10","v":20},{"$f":"ر1!AH23","v":13},33,164,"ناجح",null,null,null,16,{"$f":"COUNTIF($X$10:X26,X26)","v":1},{"$f":"IF(COUNTIF($X$10:X26,X26)>1,\"مكرر\",\"\")","v":""}]
[null,18,{"$f":"ر1!D24","v":"هيفاء عيضة عمر علي حقروص"},{"$f":"(ر1!H24+ر1!I24)/10","v":19},{"$f":"ر1!J24","v":12},31,{"$f":"(ر1!N24+ر1!O24)/10","v":20},{"$f":"ر1!P24","v":12},32,{"$f":"(ر1!T24+ر1!U24)/10","v":19.600000000000001},{"$f":"ر1!V24","v":12},32,{"$f":"(ر1!Z24+ر1!AA24)/10","v":19.8},{"$f":"ر1!AB24","v":12},32,{"$f":"(ر1!AF24+ر1!AG24)/10","v":19.8},{"$f":"ر1!AH24","v":12},32,159,"ناجح",null,null,null,17,{"$f":"COUNTIF($X$10:X27,X27)","v":1},{"$f":"IF(COUNTIF($X$10:X27,X27)>1,\"مكرر\",\"\")","v":""}]
[null,19,{"$f":"ر1!D25","v":0},{"$f":"(ر1!H25+ر1!I25)/10","v":0},{"$f":"ر1!J25","v":0},0,{"$f":"(ر1!N25+ر1!O25)/10","v":0},{"$f":"ر1!P25","v":0},0,{"$f":"(ر1!T25+ر1!U25)/10","v":0},{"$f":"ر1!V25","v":0},0,{"$f":"(ر1!Z25+ر1!AA25)/10","v":0},{"$f":"ر1!AB25","v":0},0,{"$f":"(ر1!AF25+ر1!AG25)/10","v":0},{"$f":"ر1!AH25","v":0},0,0,"",null,null,null,17.999999999999986,{"$f":"COUNTIF($X$10:X28,X28)","v":1},{"$f":"IF(COUNTIF($X$10:X28,X28)>1,\"مكرر\",\"\")","v":""}]
[null,20,{"$f":"ر1!D26","v":0},{"$f":"(ر1!H26+ر1!I26)/10","v":0},{"$f":"ر1!J26","v":0},0,{"$f":"(ر1!N26+ر1!O26)/10","v":0},{"$f":"ر1!P26","v":0},0,{"$f":"(ر1!T26+ر1!U26)/10","v":0},{"$f":"ر1!V26","v":0},0,{"$f":"(ر1!Z26+ر1!AA26)/10","v":0},{"$f":"ر1!AB26","v":0},0,{"$f":"(ر1!AF26+ر1!AG26)/10","v":0},{"$f":"ر1!AH26","v":0},0,0,"",null,null,null,17.999999999999986,{"$f":"COUNTIF($X$10:X29,X29)","v":2},{"$f":"IF(COUNTIF($X$10:X29,X29)>1,\"مكرر\",\"\")","v":"مكرر"}]
[null,21,{"$f":"ر1!D27","v":0},{"$f":"(ر1!H27+ر1!I27)/10","v":0},{"$f":"ر1!J27","v":0},0,{"$f":"(ر1!N27+ر1!O27)/10","v":0},{"$f":"ر1!P27","v":0},0,{"$f":"(ر1!T27+ر1!U27)/10","v":0},{"$f":"ر1!V27","v":0},0,{"$f":"(ر1!Z27+ر1!AA27)/10","v":0},{"$f":"ر1!AB27","v":0},0,{"$f":"(ر1!AF27+ر1!AG27)/10","v":0},{"$f":"ر1!AH27","v":0},0,0,"",null,null,null,17.999999999999986,{"$f":"COUNTIF($X$10:X30,X30)","v":3},{"$f":"IF(COUNTIF($X$10:X30,X30)>1,\"مكرر\",\"\")","v":"مكرر"}]
{"$rows_left_out":14}
{"sheet":"ش1 1","index":3,"n_rows":26,"n_cols":23,"rows_kept":26,"cut":false,"hidden":false,"merged":[[5,2,5,4],[2,6,2,8],[3,12,3,14],[4,12,4,13],[4,2,4,6],[3,3,3,5],[8,5,9,11],[10,6,10,7],[10,8,10,9],[12,2,12,3],[12,4,12,9],[12,10,12,12],[20,2,20,3],[20,12,20,13],[14,2,16,3],[14,10,14,13],[15,4,15,5],[15,6,15,7],[15,10,16,13],[17,2,17,3],[17,10,17,13],[18,2,18,3],[18,10,19,13],[19,2,19,3],[15,8,15,9],[14,4,14,9],[25,2,25,4],[25,9,25,12],[21,2,21,3],[22,2,22,3],[23,2,23,3],[22,11,22,12],[21,11,21,13]]}
[]
[]
[]
[null,null,null,"الجمهورية اليمنية",null,null,null,null,null,null,null,"مدرسة /"]
["       ",null," مكتب وزارة التربية والتعليم  م/ شبوة",null,null,null,null,null,null,null,null,"الصف /","الأول"]
[null,null,"    إدارة التربية والتعليم بمديرية /",null,null,null,null,null,null,null,null,"الشعبة / ",{"$f":"ر1!$AF$2","v":"هـ"},null,null,null,null,null,null,null,null,null,1]
[]
[]
[null,null,null,null,null,"شهادة تقويم أعمال نصف السنة "]
[]
[null,null,null,null,null,null,"للعام الدراسي : "]
[]
[null,null,"الاسم الرباعي",null,{"$f":"VLOOKUP(N13,'م1 1'!B10:C39,2,FALSE)","v":"الخضر عبدالله الخضر عبدالله عمر"},null,null,null,null,null,"الرقـــــــــم فـــــي السجـــــــل ",null,null,1]
[]
[null,null,"المـــــــــــــــــــــواد الدراسية ",null,"الفصــــــــــــــــــــــــــــــــــــــــــــــــــــــــــــــــــــــــــــــــــل الأول",null,null,null,null,null,"ملاحظـــــــــــــــــــــــــــــــــــــــــــــــــــات مربي الصف"]
[null,null,null,null,"20 المحصلــــــــــــة الأولى ",null,"30 امتحــــــــــــــان الفصل",null,"50 المجــــــــمــــوع",null,{"$f":"IF(AND(I18>=25,I19>=25,I20>=25,I21>=25,I22>=25),\" بارك الله فيك ووهبك مزيد من التفوق والنجاح في الفصل الثاني\",\"ما زالت الفرصة أمامك متاحة وكل ما عليك فعله هو الاهتمام أكثر بدروسك مع بذل مزيد من الجهد في الفصل الثاني\")","v":" بارك الله فيك ووهبك مزيد من التفوق والنجاح في الفصل الثاني"}]
[null,null,null,null,"رقمـــــــا ","كــــــــــتابة ","رقمـــــــا ","كــــــــــتابة ","رقمـــــــا ","كــــــــــتابة "]
[null,null,"القـــــــرآن الكريـــــــم ",null,{"$f":"ROUND(VLOOKUP(N13,'م1 1'!B10:D39,3,FALSE),0)","v":19},null,{"$f":"VLOOKUP(N13,'م1 1'!B10:E39,4,FALSE)","v":30},null,{"$f":"G18+E18","v":49},null,"ملاحظــــــــــــــــــــــــــــــــــــــــــــــــــــــــــــــــــــات الإدارة "]
[null,null,"التربية الإسلامية ",null,{"$f":"ROUND(VLOOKUP(N13,'م1 1'!B10:G39,6,FALSE),0)","v":20},null,{"$f":"VLOOKUP(N13,'م1 1'!B10:H39,7,FALSE)","v":30},null,{"$f":"G19+E19","v":50},null,{"$f":"IF(AND(I18>=25,I19>=25,I20>=25,I21>=25,I22>=25),\"نتيجة مشرفة ونتمنى لك دوام التقدم والنجاح\",\"لا تيأس ولا تحزن فالرسوب هو بداية النجاح، مزيد من الإصرار والعزيمة والجهد وسيكون النجاح حليفك في الفصل الثاني إن شاء الله\")","v":"نتيجة مشرفة ونتمنى لك دوام التقدم والنجاح"}]
[null,null,"اللغـــــــة العربيــــــــة ",null,{"$f":"ROUND(VLOOKUP(N13,'م1 1'!B10:J39,9,FALSE),0)","v":20},null,{"$f":"VLOOKUP(N13,'م1 1'!B10:K39,10,FALSE)","v":30},null,{"$f":"G20+E20","v":50}]
[null,null,"الرياضيـــــــــــــــــــــات ",null,{"$f":"ROUND(VLOOKUP(N13,'م1 1'!B10:M39,12,FALSE),0)","v":20},null,{"$f":"VLOOKUP(N13,'م1 1'!B10:N39,13,FALSE)","v":30},null,{"$f":"G21+E21","v":50},null,"المجموع الكلي",{"$f":"I18+I19+I20+I21+I22","v":249}]
[null,null,"العلــــــوم والصحـة ",null,{"$f":"ROUND(VLOOKUP(N13,'م1 1'!B10:P39,15,FALSE),0)","v":20},null,{"$f":"VLOOKUP(N13,'م1 1'!B10:Q39,16,FALSE)","v":30},null,{"$f":"G22+E22","v":50},null,"النتيجــــــــــــة ",{"$f":"IF(AND(I18>=25,I19>=25,I20>=25,I21>=25,I22>=25),\"ناجح\",\"راسب\")","v":"ناجح"}]
[null,null,"-",null,"-",null,"-",null,"-",null,"الترتيـــــــــــــب",null,null,{"$f":"IF(L22=\"راسب\",\"\",VLOOKUP(N13,'م1 1'!B10:Z39,25,FALSE))","v":""}]
[null,null,"-",null,"-",null,"-",null,"-",null,"النسبــــــــــــــــة ",null,{"$f":"L21/2.5","v":99.6},"%"]
[]
[null,null,"توقيع مربي الصف",null,null,null,null,null,null,"توقيع إدارة المدرسة والختم "]