{"text_format":"1","workbook":"xlsx","n_sheets":5,"sheets":["الرئيسية","البيانات الاساسية","المخزن","اذن صرف","المنصرف"],"not_rendered":{"charts":0,"images":4,"macros":1,"external_links":0,"defined_names":2,"comments":0,"pivot_tables":0},"unopened":[],"bounds":{"document_bytes":16777216,"sheet_cells":100000,"rows_first":2000,"rows_last":500,"rows_between":2000,"halvings":0,"cell_chars":16384,"cell_head_chars":4096},"cells_cut":0,"cells_raw":0,"read":"whole","date_system":"1900"}

{"sheet":"الرئيسية","index":0,"n_rows":0,"n_cols":0,"rows_kept":0,"cut":false,"hidden":false,"merged":[]}

{"sheet":"البيانات الاساسية","index":1,"n_rows":73,"n_cols":11,"rows_kept":73,"cut":false,"hidden":false,"merged":[[0,6,0,10]]}
["مدارس تاجوراء","المرحلة التعليمية",null,null,null,null,"الأحصــــــــــــائيات"]
["مدرسة 17 فبراير","ثانــوي",null,null,null,null,"الرقم","اسم المدرسة","المرحلة التعليمية","عدد الطلبة","الكمية المستحقة"]
["مدرسة 24 ديسمبر","أساسي",null,null,null,null,1,"مدرسة 17 فبراير","ثانوي",850]
["مدرسة ابن العربي ","مختلطة",null,null,null,null,2,"مدرسة 24 ديسمبر","ثانوي",1450]
["مدرسة ابن سيناء ",null,null,null,null,null,3,"مدرسة ابن العربي "]
["مدرسة ابو بكر الصديق ",null,null,null,null,null,4,"مدرسة ابن سيناء "]
["مدرسة ابي الاشهر ",null,null,null,null,null,5,"مدرسة ابو بكر الصديق "]
["مدرسة ابي فراس الحمداني ",null,null,null,null,null,6,"مدرسة ابي الاشهر "]
["مدرسة احفاد المختار ",null,null,null,null,null,7,"مدرسة ابي فراس الحمداني "]
["مدرسة اسامة بن زيد ",null,null,null,null,null,8,"مدرسة احفاد المختار "]
["مدرسة الانتصارات",null,null,null,null,null,9,"مدرسة اسامة بن زيد "]
["مدرسة البساتين ",null,null,null,null,null,10,"مدرسة الانتصارات"]
["مدرسة الحسن ابن الهيثم ",null,null,null,null,null,11,"مدرسة البساتين "]
["مدرسة الحطاب ",null,null,null,null,null,12,"مدرسة الحسن ابن الهيثم "]
["مدرسة الحميدية / الثانوي ",null,null,null,null,null,13,"مدرسة الحطاب "]
["مدرسة الحميدية الاساسي ",null,null,null,null,null,14,"مدرسة الحميدية / الثانوي "]
["مدرسة الخالدون",null,null,null,null,null,15,"مدرسة الحميدية الاساسي "]
["مدرسة الخضراء ",null,null,null,null,null,16,"مدرسة الخالدون"]
["مدرسة الخلفاء ",null,null,null,null,null,17,"مدرسة الخضراء "]
["مدرسة الدار البيضاء ",null,null,null,null,null,18,"مدرسة الخلفاء "]
["مدرسة الرسالة ",null,null,null,null,null,19,"مدرسة الدار البيضاء "]
["مدرسة الرشيد ",null,null,null,null,null,20,"مدرسة الرسالة "]
["مدرسة السبابيل ",null,null,null,null,null,21,"مدرسة الرشيد "]
["مدرسة السلام",null,null,null,null,null,22,"مدرسة السبابيل "]
["مدرسة السيدة عائشة ",null,null,null,null,null,23,"مدرسة السلام"]
["مدرسة الشعلة ",null,null,null,null,null,24,"مدرسة السيدة عائشة "]
["مدرسة الصابرين ",null,null,null,null,null,25,"مدرسة الشعلة "]
["مدرسة الصامت ",null,null,null,null,null,26,"مدرسة الصابرين "]
["مدرسة الصحابة ",null,null,null,null,null,27,"مدرسة الصامت "]
["مدرسة الطالب ",null,null,null,null,null,28,"مدرسة الصحابة "]
["مدرسة العثمانية",null,null,null,null,null,29,"مدرسة الطالب "]
["مدرسة الفاروق ",null,null,null,null,null,30,"مدرسة العثمانية"]
["مدرسة القدس ",null,null,null,null,null,31,"مدرسة الفاروق "]
["مدرسة القلعة للبنات ",null,null,null,null,null,32,"مدرسة القدس "]
["مدرسة الكرامة ",null,null,null,null,null,33,"مدرسة القلعة للبنات "]
["مدرسة المجاهد محمد بن حسين ",null,null,null,null,null,34,"مدرسة الكرامة "]
["مدرسة المراونة ",null,null,null,null,null,35,"مدرسة المجاهد محمد بن حسين "]
["مدرسة النشيع",null,null,null,null,null,36,"مدرسة المراونة "]
["مدرسة النصر ",null,null,null,null,null,37,"مدرسة النشيع"]
["مدرسة النعم المركزية ",null,null,null,null,null,38,"مدرسة النصر "]
["مدرسة النـــور ",null,null,null,null,null,39,"مدرسة النعم المركزية "]
["مدرسة الواحة ",null,null,null,null,null,40,"مدرسة النـــور "]
["مدرسة الوادي الغربي ",null,null,null,null,null,41,"مدرسة الواحة "]
["مدرسة ام البنين ",null,null,null,null,null,42,"مدرسة الوادي الغربي "]
["مدرسة امنة بنت وهب ",null,null,null,null,null,43,"مدرسة ام البنين "]
["مدرسة بدر الكبرى",null,null,null,null,null,44,"مدرسة امنة بنت وهب "]
["مدرسة بشير السعداوي ",null,null,null,null,null,45,"مدرسة بدر الكبرى"]
["مدرسة بن عزيز",null,null,null,null,null,46,"مدرسة بشير السعداوي "]
["مدرسة بير حمادي ",null,null,null,null,null,47,"مدرسة بن عزيز"]
["مدرسة بئر الاسطي ميلاد ",null,null,null,null,null,48,"مدرسة بير حمادي "]
["مدرسة تاجوراء الشعبية ",null,null,null,null,null,49,"مدرسة بئر الاسطي ميلاد "]
["مدرسة تاجوراء المركزية ",null,null,null,null,null,50,"مدرسة تاجوراء الشعبية "]
["مدرسة جابر بن حيان ",null,null,null,null,null,51,"مدرسة تاجوراء المركزية "]
["مدرسة حي التضامن ",null,null,null,null,null,52,"مدرسة جابر بن حيان "]
["مدرسة خديجة الكبرى",null,null,null,null,null,53,"مدرسة حي التضامن "]
["مدرسة خلة القمودي ",null,null,null,null,null,54,"مدرسة خديجة الكبرى"]
["مدرسة سيدي عبدالكريم ",null,null,null,null,null,55,"مدرسة خلة القمودي "]
["مدرسة شهداء الانتفاضة ",null,null,null,null,null,56,"مدرسة سيدي عبدالكريم "]
["مدرسة شهداء الحرية",null,null,null,null,null,57,"مدرسة شهداء الانتفاضة "]
["مدرسة شهداء تاجوراء ",null,null,null,null,null,58,"مدرسة شهداء الحرية"]
["مدرسة عبدالرحمن التاجوري",null,null,null,null,null,59,"مدرسة شهداء تاجوراء "]
["مدرسة عبدالله عبدالقادر ",null,null,null,null,null,60,"مدرسة عبدالرحمن التاجوري"]
["مدرسة عبد المطلب بن هاشم ",null,null,null,null,null,61,"مدرسة عبدالله عبدالقادر "]
["مدرسة عقبة بن نافع بنات ",null,null,null,null,null,62,"مدرسة عبد المطلب بن هاشم "]
["مدرسة عقبة بن نافع بنين ",null,null,null,null,null,63,"مدرسة عقبة بن نافع بنات "]
["مدرسة علي النفاتي ",null,null,null,null,null,64,"مدرسة عقبة بن نافع بنين "]
["مدرسة عمر المختار ",null,null,null,null,null,65,"مدرسة علي النفاتي "]
["مدرسة قلعة العلم ",null,null,null,null,null,66,"مدرسة عمر المختار "]
["مدرسة محمد سالم الزروق ",null,null,null,null,null,67,"مدرسة قلعة العلم "]
["مدرسة منارة ابي راوي ",null,null,null,null,null,68,"مدرسة محمد سالم الزروق "]
["مدرسة يحي بن يحي السويدي ",null,null,null,null,null,69,"مدرسة منارة ابي راوي "]
[null,null,null,null,null,null,70,"مدرسة يحي بن يحي السويدي "]
[null,null,null,null,null,null,71]

{"sheet":"المخزن","index":2,"n_rows":15,"n_cols":6,"rows_kept":15,"cut":false,"hidden":false,"merged":[]}
[]
["م","كود الصنف","أسم الصنف","رصيد اول المده","المنصرف","الرصيدالباقي"]
[1,101,"ورق سحب A4",100,{"$f":"SUMIF($C$3:$C$500,$C3,المنصرف!$D$3:$D$500)","v":10},{"$f":"D3-E3","v":90}]
[2,102,"ورق سحب A3",100,{"$f":"SUMIF($C$3:$C$500,$C4,المنصرف!$D$3:$D$500)","v":3},{"$f":"D4-E4","v":97}]
[3,103,"جبر طابعة hd 2015",100,{"$f":"SUMIF($C$3:$C$500,$C5,المنصرف!$D$3:$D$500)","v":10},90]
[4,104,"جبر طابعة hd 2010",100,{"$f":"SUMIF($C$3:$C$500,$C6,المنصرف!$D$3:$D$500)","v":3},97]
[5,105,"حبر آلة تصوير كانون",50,{"$f":"SUMIF($C$3:$C$500,$C7,المنصرف!$D$3:$D$500)","v":10},40]
[6,106,"خطاط سبورة",1500,{"$f":"SUMIF($C$3:$C$500,$C8,المنصرف!$D$3:$D$500)","v":3},1497]
[7,107,"طلاسات",780,{"$f":"SUMIF($C$3:$C$500,$C9,المنصرف!$D$3:$D$500)","v":50},730]
[8,108,null,null,{"$f":"SUMIF($C$3:$C$500,$C10,المنصرف!$D$3:$D$500)","v":0},0]
[9,109,null,null,{"$f":"SUMIF($C$3:$C$500,$C11,المنصرف!$D$3:$D$500)","v":0},0]
[10,110,null,null,{"$f":"SUMIF($C$3:$C$500,$C12,المنصرف!$D$3:$D$500)","v":0},0]
[11,111,null,null,{"$f":"SUMIF($C$3:$C$500,$C13,المنصرف!$D$3:$D$500)","v":0},0]
[12,112,null,null,{"$f":"SUMIF($C$3:$C$500,$C14,المنصرف!$D$3:$D$500)","v":0},0]
[13,113,null,null,{"$f":"SUMIF($C$3:$C$500,$C15,المنصرف!$D$3:$D$500)","v":0},0]

{"sheet":"اذن صرف","index":3,"n_rows":30,"n_cols":8,"rows_kept":30,"cut":false,"hidden":false,"merged":[[5,1,5,2],[3,2,3,3]]}
[]
[null,"التاريخ  :-",{"$f":"TODAY()","v":"2022-03-01"},"رقم اذن الصرف :-",16]
[null,null,null,{"$f":"IF(A3>0,\"1\",\"\")","v":""}]
[null,"المدرسة :-","مدرسة 24 ديسمبر"]
[null,null,null,"عدد الطلبة :-",{"$f":"VLOOKUP(C4,'البيانات الاساسية'!$H$3:$K$79,3,0)","v":1450}]
[null,"المرحلــــــــــة التعـــــــليمية :-",null,"ثانــوي"]
[]
[null,"م","كود الصنف","أسم الصنف","الكمية",null,null,"ملاحظات"]
[null,1,100,"ورق سحب A4",10,{"$f":"IF(D9>=1,$C$4,\"\")","v":"مدرسة 24 ديسمبر"},{"$f":"IF(D9>=1,$E$2,\"\")","v":16}]
[null,2,102,"جبر طابعة hd 2010",3,{"$f":"IF(D10>=1,$C$4,\"\")","v":"مدرسة 24 ديسمبر"},{"$f":"IF(D10>=1,$E$2,\"\")","v":16}]
[null,3,103,"طلاسات",50,"مدرسة 24 ديسمبر",{"$f":"IF(D11>=1,$E$2,\"\")","v":16}]
[null,4,104,"خطاط سبورة",95,"مدرسة 24 ديسمبر",{"$f":"IF(D12>=1,$E$2,\"\")","v":16}]
[null,5,null,null,null,"",{"$f":"IF(D13>=1,$E$2,\"\")","v":""},{"$f":"IF(D13>=1,$C$4,\"\")","v":""}]
[null,6,null,null,null,"",{"$f":"IF(D14>=1,$E$2,\"\")","v":""},""]
[null,7,null,null,null,"",{"$f":"IF(D15>=1,$E$2,\"\")","v":""},""]
[null,8,null,null,null,"",{"$f":"IF(D16>=1,$E$2,\"\")","v":""},""]
[null,9,null,null,null,"",{"$f":"IF(D17>=1,$E$2,\"\")","v":""},""]
[null,10,null,null,null,"",{"$f":"IF(D18>=1,$E$2,\"\")","v":""},""]
[null,11,null,null,null,"",{"$f":"IF(D19>=1,$E$2,\"\")","v":""},""]
[null,12,null,null,null,"",{"$f":"IF(D20>=1,$E$2,\"\")","v":""},""]
[null,13,null,null,null,"",{"$f":"IF(D21>=1,$E$2,\"\")","v":""},""]
[null,14,null,null,null,"",{"$f":"IF(D22>=1,$E$2,\"\")","v":""},""]
[null,15,null,null,null,"",{"$f":"IF(D23>=1,$E$2,\"\")","v":""},""]
[]
[]
[]
[]
[null,"أسم المستم"]
[]
[null,"..............................."]

{"sheet":"المنصرف","index":4,"n_rows":354,"n_cols":7,"rows_kept":354,"cut":false,"hidden":false,"merged":[]}
["البضاعة المنصرفة",null,null,null,null,555]
["م","كود الصنف","أسم الصنف","الكمية","مدرسة 24 ديسمبر","رقم اذن الصرف","ملاحظات"]
[{"$f":"IF(C3=\"\",\"\",SUBTOTAL(3,$C$3:C3))","v":1},100,"ورق سحب A4",10,"مدرسة 24 ديسمبر","1"]
[{"$f":"IF(C4=\"\",\"\",SUBTOTAL(3,$C$3:C4))","v":2},102,"جبر طابعة hd 2010",3,"مدرسة 24 ديسمبر","1"]
[{"$f":"IF(C5=\"\",\"\",SUBTOTAL(3,$C$3:C5))","v":3},100,"ورق سحب A4",10,"مدرسة 24 ديسمبر",13]
[{"$f":"IF(C6=\"\",\"\",SUBTOTAL(3,$C$3:C6))","v":4},102,"جبر طابعة hd 2010",3,"مدرسة 24 ديسمبر",13]
[{"$f":"IF(C7=\"\",\"\",SUBTOTAL(3,$C$3:C7))","v":5},100,"ورق سحب A4",10,"مدرسة 24 ديسمبر",15]
[{"$f":"IF(C8=\"\",\"\",SUBTOTAL(3,$C$3:C8))","v":6},102,"جبر طابعة hd 2010",3,"مدرسة 24 ديسمبر",15]
[{"$f":"IF(C9=\"\",\"\",SUBTOTAL(3,$C$3:C9))","v":7},103,"طلاسات",50,"مدرسة 24 ديسمبر",15]
[null,104,"خطاط سبورة",95,"مدرسة 24 ديسمبر",15]
[]
[]
[]
[]
[]
[]
[]
[]
[]
[]
[]
[]
[]
[]
[]
[]
[]
[]
[]
[]
[]
[]
[]
[]
[]
[]
[]
[]
[]
[]
[]
[]
[]
[]
[]
[]
[]
[]
[]
[]
[]
[]
[]
[]
[]
[]
[]
[]
[]
[]
[]
[]
[]
[]
[]
[]
[]
[]
[]
[]
[]
[]
[]
[]
[]
[]
[]
[]
[]
[]
[]
[]
[]
[]
[]
[]
[]
[]
[]
[]
[]
[]
[]
[]
[]
[]
[]
[]
[]
[]
[]
[]
[]
[{"$f":"IF(C104=\"\",\"\",SUBTOTAL(3,$C$3:C104))","v":""}]
[{"$f":"IF(C105=\"\",\"\",SUBTOTAL(3,$C$3:C105))","v":""}]
[{"$f":"IF(C106=\"\",\"\",SUBTOTAL(3,$C$3:C106))","v":""}]
[{"$f":"IF(C107=\"\",\"\",SUBTOTAL(3,$C$3:C107))","v":""}]
[{"$f":"IF(C108=\"\",\"\",SUBTOTAL(3,$C$3:C108))","v":""}]
[{"$f":"IF(C109=\"\",\"\",SUBTOTAL(3,$C$3:C109))","v":""}]
[{"$f":"IF(C110=\"\",\"\",SUBTOTAL(3,$C$3:C110))","v":""}]
[{"$f":"IF(C111=\"\",\"\",SUBTOTAL(3,$C$3:C111))","v":""}]
[{"$f":"IF(C112=\"\",\"\",SUBTOTAL(3,$C$3:C112))","v":""}]
[{"$f":"IF(C113=\"\",\"\",SUBTOTAL(3,$C$3:C113))","v":""}]
[{"$f":"IF(C114=\"\",\"\",SUBTOTAL(3,$C$3:C114))","v":""}]
[{"$f":"IF(C115=\"\",\"\",SUBTOTAL(3,$C$3:C115))","v":""}]
[{"$f":"IF(C116=\"\",\"\",SUBTOTAL(3,$C$3:C116))","v":""}]
[{"$f":"IF(C117=\"\",\"\",SUBTOTAL(3,$C$3:C117))","v":""}]
[{"$f":"IF(C118=\"\",\"\",SUBTOTAL(3,$C$3:C118))","v":""}]
[{"$f":"IF(C119=\"\",\"\",SUBTOTAL(3,$C$3:C119))","v":""}]
[{"$f":"IF(C120=\"\",\"\",SUBTOTAL(3,$C$3:C120))","v":""}]
[{"$f":"IF(C121=\"\",\"\",SUBTOTAL(3,$C$3:C121))","v":""}]
[{"$f":"IF(C122=\"\",\"\",SUBTOTAL(3,$C$3:C122))","v":""}]
[{"$f":"IF(C123=\"\",\"\",SUBTOTAL(3,$C$3:C123))","v":""}]
[{"$f":"IF(C124=\"\",\"\",SUBTOTAL(3,$C$3:C124))","v":""}]
[{"$f":"IF(C125=\"\",\"\",SUBTOTAL(3,$C$3:C125))","v":""}]
[{"$f":"IF(C126=\"\",\"\",SUBTOTAL(3,$C$3:C126))","v":""}]
[{"$f":"IF(C127=\"\",\"\",SUBTOTAL(3,$C$3:C127))","v":""}]
[{"$f":"IF(C128=\"\",\"\",SUBTOTAL(3,$C$3:C128))","v":""}]
[{"$f":"IF(C129=\"\",\"\",SUBTOTAL(3,$C$3:C129))","v":""}]
[{"$f":"IF(C130=\"\",\"\",SUBTOTAL(3,$C$3:C130))","v":""}]
[{"$f":"IF(C131=\"\",\"\",SUBTOTAL(3,$C$3:C131))","v":""}]
[{"$f":"IF(C132=\"\",\"\",SUBTOTAL(3,$C$3:C132))","v":""}]
[{"$f":"IF(C133=\"\",\"\",SUBTOTAL(3,$C$3:C133))","v":""}]
[{"$f":"IF(C134=\"\",\"\",SUBTOTAL(3,$C$3:C134))","v":""}]
[{"$f":"IF(C135=\"\",\"\",SUBTOTAL(3,$C$3:C135))","v":""}]
[{"$f":"IF(C136=\"\",\"\",SUBTOTAL(3,$C$3:C136))","v":""}]
[{"$f":"IF(C137=\"\",\"\",SUBTOTAL(3,$C$3:C137))","v":""}]
[{"$f":"IF(C138=\"\",\"\",SUBTOTAL(3,$C$3:C138))","v":""}]
[{"$f":"IF(C139=\"\",\"\",SUBTOTAL(3,$C$3:C139))","v":""}]
[{"$f":"IF(C140=\"\",\"\",SUBTOTAL(3,$C$3:C140))","v":""}]
[{"$f":"IF(C141=\"\",\"\",SUBTOTAL(3,$C$3:C141))","v":""}]
[{"$f":"IF(C142=\"\",\"\",SUBTOTAL(3,$C$3:C142))","v":""}]
[{"$f":"IF(C143=\"\",\"\",SUBTOTAL(3,$C$3:C143))","v":""}]
[{"$f":"IF(C144=\"\",\"\",SUBTOTAL(3,$C$3:C144))","v":""}]
[{"$f":"IF(C145=\"\",\"\",SUBTOTAL(3,$C$3:C145))","v":""}]
[{"$f":"IF(C146=\"\",\"\",SUBTOTAL(3,$C$3:C146))","v":""}]
[{"$f":"IF(C147=\"\",\"\",SUBTOTAL(3,$C$3:C147))","v":""}]
[{"$f":"IF(C148=\"\",\"\",SUBTOTAL(3,$C$3:C148))","v":""}]
[{"$f":"IF(C149=\"\",\"\",SUBTOTAL(3,$C$3:C149))","v":""}]
[{"$f":"IF(C150=\"\",\"\",SUBTOTAL(3,$C$3:C150))","v":""}]
[{"$f":"IF(C151=\"\",\"\",SUBTOTAL(3,$C$3:C151))","v":""}]
[{"$f":"IF(C152=\"\",\"\",SUBTOTAL(3,$C$3:C152))","v":""}]
[{"$f":"IF(C153=\"\",\"\",SUBTOTAL(3,$C$3:C153))","v":""}]
[{"$f":"IF(C154=\"\",\"\",SUBTOTAL(3,$C$3:C154))","v":""}]
[{"$f":"IF(C155=\"\",\"\",SUBTOTAL(3,$C$3:C155))","v":""}]
[{"$f":"IF(C156=\"\",\"\",SUBTOTAL(3,$C$3:C156))","v":""}]
[{"$f":"IF(C157=\"\",\"\",SUBTOTAL(3,$C$3:C157))","v":""}]
[{"$f":"IF(C158=\"\",\"\",SUBTOTAL(3,$C$3:C158))","v":""}]
[{"$f":"IF(C159=\"\",\"\",SUBTOTAL(3,$C$3:C159))","v":""}]
[{"$f":"IF(C160=\"\",\"\",SUBTOTAL(3,$C$3:C160))","v":""}]
[{"$f":"IF(C161=\"\",\"\",SUBTOTAL(3,$C$3:C161))","v":""}]
[{"$f":"IF(C162=\"\",\"\",SUBTOTAL(3,$C$3:C162))","v":""}]
[{"$f":"IF(C163=\"\",\"\",SUBTOTAL(3,$C$3:C163))","v":""}]
[{"$f":"IF(C164=\"\",\"\",SUBTOTAL(3,$C$3:C164))","v":""}]
[{"$f":"IF(C165=\"\",\"\",SUBTOTAL(3,$C$3:C165))","v":""}]
[{"$f":"IF(C166=\"\",\"\",SUBTOTAL(3,$C$3:C166))","v":""}]
[{"$f":"IF(C167=\"\",\"\",SUBTOTAL(3,$C$3:C167))","v":""}]
[{"$f":"IF(C168=\"\",\"\",SUBTOTAL(3,$C$3:C168))","v":""}]
[{"$f":"IF(C169=\"\",\"\",SUBTOTAL(3,$C$3:C169))","v":""}]
[{"$f":"IF(C170=\"\",\"\",SUBTOTAL(3,$C$3:C170))","v":""}]
[{"$f":"IF(C171=\"\",\"\",SUBTOTAL(3,$C$3:C171))","v":""}]
[{"$f":"IF(C172=\"\",\"\",SUBTOTAL(3,$C$3:C172))","v":""}]
[{"$f":"IF(C173=\"\",\"\",SUBTOTAL(3,$C$3:C173))","v":""}]
[{"$f":"IF(C174=\"\",\"\",SUBTOTAL(3,$C$3:C174))","v":""}]
[{"$f":"IF(C175=\"\",\"\",SUBTOTAL(3,$C$3:C175))","v":""}]
[{"$f":"IF(C176=\"\",\"\",SUBTOTAL(3,$C$3:C176))","v":""}]
[{"$f":"IF(C177=\"\",\"\",SUBTOTAL(3,$C$3:C177))","v":""}]
[{"$f":"IF(C178=\"\",\"\",SUBTOTAL(3,$C$3:C178))","v":""}]
[{"$f":"IF(C179=\"\",\"\",SUBTOTAL(3,$C$3:C179))","v":""}]
[{"$f":"IF(C180=\"\",\"\",SUBTOTAL(3,$C$3:C180))","v":""}]
[{"$f":"IF(C181=\"\",\"\",SUBTOTAL(3,$C$3:C181))","v":""}]
[{"$f":"IF(C182=\"\",\"\",SUBTOTAL(3,$C$3:C182))","v":""}]
[{"$f":"IF(C183=\"\",\"\",SUBTOTAL(3,$C$3:C183))","v":""}]
[{"$f":"IF(C184=\"\",\"\",SUBTOTAL(3,$C$3:C184))","v":""}]
[{"$f":"IF(C185=\"\",\"\",SUBTOTAL(3,$C$3:C185))","v":""}]
[{"$f":"IF(C186=\"\",\"\",SUBTOTAL(3,$C$3:C186))","v":""}]
[{"$f":"IF(C187=\"\",\"\",SUBTOTAL(3,$C$3:C187))","v":""}]
[{"$f":"IF(C188=\"\",\"\",SUBTOTAL(3,$C$3:C188))","v":""}]
[{"$f":"IF(C189=\"\",\"\",SUBTOTAL(3,$C$3:C189))","v":""}]
[{"$f":"IF(C190=\"\",\"\",SUBTOTAL(3,$C$3:C190))","v":""}]
[{"$f":"IF(C191=\"\",\"\",SUBTOTAL(3,$C$3:C191))","v":""}]
[{"$f":"IF(C192=\"\",\"\",SUBTOTAL(3,$C$3:C192))","v":""}]
[{"$f":"IF(C193=\"\",\"\",SUBTOTAL(3,$C$3:C193))","v":""}]
[{"$f":"IF(C194=\"\",\"\",SUBTOTAL(3,$C$3:C194))","v":""}]
[{"$f":"IF(C195=\"\",\"\",SUBTOTAL(3,$C$3:C195))","v":""}]
[{"$f":"IF(C196=\"\",\"\",SUBTOTAL(3,$C$3:C196))","v":""}]
[{"$f":"IF(C197=\"\",\"\",SUBTOTAL(3,$C$3:C197))","v":""}]
[{"$f":"IF(C198=\"\",\"\",SUBTOTAL(3,$C$3:C198))","v":""}]
[{"$f":"IF(C199=\"\",\"\",SUBTOTAL(3,$C$3:C199))","v":""}]
[{"$f":"IF(C200=\"\",\"\",SUBTOTAL(3,$C$3:C200))","v":""}]
[{"$f":"IF(C201=\"\",\"\",SUBTOTAL(3,$C$3:C201))","v":""}]
[{"$f":"IF(C202=\"\",\"\",SUBTOTAL(3,$C$3:C202))","v":""}]
[{"$f":"IF(C203=\"\",\"\",SUBTOTAL(3,$C$3:C203))","v":""}]
[{"$f":"IF(C204=\"\",\"\",SUBTOTAL(3,$C$3:C204))","v":""}]
[{"$f":"IF(C205=\"\",\"\",SUBTOTAL(3,$C$3:C205))","v":""}]
[{"$f":"IF(C206=\"\",\"\",SUBTOTAL(3,$C$3:C206))","v":""}]
[{"$f":"IF(C207=\"\",\"\",SUBTOTAL(3,$C$3:C207))","v":""}]
[{"$f":"IF(C208=\"\",\"\",SUBTOTAL(3,$C$3:C208))","v":""}]
[{"$f":"IF(C209=\"\",\"\",SUBTOTAL(3,$C$3:C209))","v":""}]
[{"$f":"IF(C210=\"\",\"\",SUBTOTAL(3,$C$3:C210))","v":""}]
[{"$f":"IF(C211=\"\",\"\",SUBTOTAL(3,$C$3:C211))","v":""}]
[{"$f":"IF(C212=\"\",\"\",SUBTOTAL(3,$C$3:C212))","v":""}]
[{"$f":"IF(C213=\"\",\"\",SUBTOTAL(3,$C$3:C213))","v":""}]
[{"$f":"IF(C214=\"\",\"\",SUBTOTAL(3,$C$3:C214))","v":""}]
[{"$f":"IF(C215=\"\",\"\",SUBTOTAL(3,$C$3:C215))","v":""}]
[{"$f":"IF(C216=\"\",\"\",SUBTOTAL(3,$C$3:C216))","v":""}]
[{"$f":"IF(C217=\"\",\"\",SUBTOTAL(3,$C$3:C217))","v":""}]
[{"$f":"IF(C218=\"\",\"\",SUBTOTAL(3,$C$3:C218))","v":""}]
[{"$f":"IF(C219=\"\",\"\",SUBTOTAL(3,$C$3:C219))","v":""}]
[{"$f":"IF(C220=\"\",\"\",SUBTOTAL(3,$C$3:C220))","v":""}]
[{"$f":"IF(C221=\"\",\"\",SUBTOTAL(3,$C$3:C221))","v":""}]
[{"$f":"IF(C222=\"\",\"\",SUBTOTAL(3,$C$3:C222))","v":""}]
[{"$f":"IF(C223=\"\",\"\",SUBTOTAL(3,$C$3:C223))","v":""}]
[{"$f":"IF(C224=\"\",\"\",SUBTOTAL(3,$C$3:C224))","v":""}]
[{"$f":"IF(C225=\"\",\"\",SUBTOTAL(3,$C$3:C225))","v":""}]
[{"$f":"IF(C226=\"\",\"\",SUBTOTAL(3,$C$3:C226))","v":""}]
[{"$f":"IF(C227=\"\",\"\",SUBTOTAL(3,$C$3:C227))","v":""}]
[{"$f":"IF(C228=\"\",\"\",SUBTOTAL(3,$C$3:C228))","v":""}]
[{"$f":"IF(C229=\"\",\"\",SUBTOTAL(3,$C$3:C229))","v":""}]
[{"$f":"IF(C230=\"\",\"\",SUBTOTAL(3,$C$3:C230))","v":""}]
[{"$f":"IF(C231=\"\",\"\",SUBTOTAL(3,$C$3:C231))","v":""}]
[{"$f":"IF(C232=\"\",\"\",SUBTOTAL(3,$C$3:C232))","v":""}]
[{"$f":"IF(C233=\"\",\"\",SUBTOTAL(3,$C$3:C233))","v":""}]
[{"$f":"IF(C234=\"\",\"\",SUBTOTAL(3,$C$3:C234))","v":""}]
[{"$f":"IF(C235=\"\",\"\",SUBTOTAL(3,$C$3:C235))","v":""}]
[{"$f":"IF(C236=\"\",\"\",SUBTOTAL(3,$C$3:C236))","v":""}]
[{"$f":"IF(C237=\"\",\"\",SUBTOTAL(3,$C$3:C237))","v":""}]
[{"$f":"IF(C238=\"\",\"\",SUBTOTAL(3,$C$3:C238))","v":""}]
[{"$f":"IF(C239=\"\",\"\",SUBTOTAL(3,$C$3:C239))","v":""}]
[{"$f":"IF(C240=\"\",\"\",SUBTOTAL(3,$C$3:C240))","v":""}]
[{"$f":"IF(C241=\"\",\"\",SUBTOTAL(3,$C$3:C241))","v":""}]
[{"$f":"IF(C242=\"\",\"\",SUBTOTAL(3,$C$3:C242))","v":""}]
[{"$f":"IF(C243=\"\",\"\",SUBTOTAL(3,$C$3:C243))","v":""}]
[{"$f":"IF(C244=\"\",\"\",SUBTOTAL(3,$C$3:C244))","v":""}]
[{"$f":"IF(C245=\"\",\"\",SUBTOTAL(3,$C$3:C245))","v":""}]
[{"$f":"IF(C246=\"\",\"\",SUBTOTAL(3,$C$3:C246))","v":""}]
[{"$f":"IF(C247=\"\",\"\",SUBTOTAL(3,$C$3:C247))","v":""}]
[{"$f":"IF(C248=\"\",\"\",SUBTOTAL(3,$C$3:C248))","v":""}]
[{"$f":"IF(C249=\"\",\"\",SUBTOTAL(3,$C$3:C249))","v":""}]
[{"$f":"IF(C250=\"\",\"\",SUBTOTAL(3,$C$3:C250))","v":""}]
[{"$f":"IF(C251=\"\",\"\",SUBTOTAL(3,$C$3:C251))","v":""}]
[{"$f":"IF(C252=\"\",\"\",SUBTOTAL(3,$C$3:C252))","v":""}]
[{"$f":"IF(C253=\"\",\"\",SUBTOTAL(3,$C$3:C253))","v":""}]
[{"$f":"IF(C254=\"\",\"\",SUBTOTAL(3,$C$3:C254))","v":""}]
[{"$f":"IF(C255=\"\",\"\",SUBTOTAL(3,$C$3:C255))","v":""}]
[{"$f":"IF(C256=\"\",\"\",SUBTOTAL(3,$C$3:C256))","v":""}]
[{"$f":"IF(C257=\"\",\"\",SUBTOTAL(3,$C$3:C257))","v":""}]
[{"$f":"IF(C258=\"\",\"\",SUBTOTAL(3,$C$3:C258))","v":""}]
[{"$f":"IF(C259=\"\",\"\",SUBTOTAL(3,$C$3:C259))","v":""}]
[{"$f":"IF(C260=\"\",\"\",SUBTOTAL(3,$C$3:C260))","v":""}]
[{"$f":"IF(C261=\"\",\"\",SUBTOTAL(3,$C$3:C261))","v":""}]
[{"$f":"IF(C262=\"\",\"\",SUBTOTAL(3,$C$3:C262))","v":""}]
[{"$f":"IF(C263=\"\",\"\",SUBTOTAL(3,$C$3:C263))","v":""}]
[{"$f":"IF(C264=\"\",\"\",SUBTOTAL(3,$C$3:C264))","v":""}]
[{"$f":"IF(C265=\"\",\"\",SUBTOTAL(3,$C$3:C265))","v":""}]
[{"$f":"IF(C266=\"\",\"\",SUBTOTAL(3,$C$3:C266))","v":""}]
[{"$f":"IF(C267=\"\",\"\",SUBTOTAL(3,$C$3:C267))","v":""}]
[{"$f":"IF(C268=\"\",\"\",SUBTOTAL(3,$C$3:C268))","v":""}]
[{"$f":"IF(C269=\"\",\"\",SUBTOTAL(3,$C$3:C269))","v":""}]
[{"$f":"IF(C270=\"\",\"\",SUBTOTAL(3,$C$3:C270))","v":""}]
[{"$f":"IF(C271=\"\",\"\",SUBTOTAL(3,$C$3:C271))","v":""}]
[{"$f":"IF(C272=\"\",\"\",SUBTOTAL(3,$C$3:C272))","v":""}]
[{"$f":"IF(C273=\"\",\"\",SUBTOTAL(3,$C$3:C273))","v":""}]
[{"$f":"IF(C274=\"\",\"\",SUBTOTAL(3,$C$3:C274))","v":""}]
[{"$f":"IF(C275=\"\",\"\",SUBTOTAL(3,$C$3:C275))","v":""}]
[{"$f":"IF(C276=\"\",\"\",SUBTOTAL(3,$C$3:C276))","v":""}]
[{"$f":"IF(C277=\"\",\"\",SUBTOTAL(3,$C$3:C277))","v":""}]
[{"$f":"IF(C278=\"\",\"\",SUBTOTAL(3,$C$3:C278))","v":""}]
[{"$f":"IF(C279=\"\",\"\",SUBTOTAL(3,$C$3:C279))","v":""}]
[{"$f":"IF(C280=\"\",\"\",SUBTOTAL(3,$C$3:C280))","v":""}]
[{"$f":"IF(C281=\"\",\"\",SUBTOTAL(3,$C$3:C281))","v":""}]
[{"$f":"IF(C282=\"\",\"\",SUBTOTAL(3,$C$3:C282))","v":""}]
[{"$f":"IF(C283=\"\",\"\",SUBTOTAL(3,$C$3:C283))","v":""}]
[{"$f":"IF(C284=\"\",\"\",SUBTOTAL(3,$C$3:C284))","v":""}]
[{"$f":"IF(C285=\"\",\"\",SUBTOTAL(3,$C$3:C285))","v":""}]
[{"$f":"IF(C286=\"\",\"\",SUBTOTAL(3,$C$3:C286))","v":""}]
[{"$f":"IF(C287=\"\",\"\",SUBTOTAL(3,$C$3:C287))","v":""}]
[{"$f":"IF(C288=\"\",\"\",SUBTOTAL(3,$C$3:C288))","v":""}]
[{"$f":"IF(C289=\"\",\"\",SUBTOTAL(3,$C$3:C289))","v":""}]
[{"$f":"IF(C290=\"\",\"\",SUBTOTAL(3,$C$3:C290))","v":""}]
[{"$f":"IF(C291=\"\",\"\",SUBTOTAL(3,$C$3:C291))","v":""}]
[{"$f":"IF(C292=\"\",\"\",SUBTOTAL(3,$C$3:C292))","v":""}]
[{"$f":"IF(C293=\"\",\"\",SUBTOTAL(3,$C$3:C293))","v":""}]
[{"$f":"IF(C294=\"\",\"\",SUBTOTAL(3,$C$3:C294))","v":""}]
[{"$f":"IF(C295=\"\",\"\",SUBTOTAL(3,$C$3:C295))","v":""}]
[{"$f":"IF(C296=\"\",\"\",SUBTOTAL(3,$C$3:C296))","v":""}]
[{"$f":"IF(C297=\"\",\"\",SUBTOTAL(3,$C$3:C297))","v":""}]
[{"$f":"IF(C298=\"\",\"\",SUBTOTAL(3,$C$3:C298))","v":""}]
[{"$f":"IF(C299=\"\",\"\",SUBTOTAL(3,$C$3:C299))","v":""}]
["1"]
["1"]
["1"]
["1"]
["1"]
["1"]
["1"]
["1"]
["1"]
["1"]
[""]
[""]
[""]
[""]
[""]
["1"]
["1"]
["1"]
["1"]
["1"]
["1"]
["1"]
["1"]
["1"]
["1"]
[""]
[""]
[""]
[""]
[""]
["1"]
["1"]
["1"]
["1"]
["1"]
["1"]
["1"]
["1"]
["1"]
["1"]
[""]
[""]
[""]
[""]
[""]
["1"]
["1"]
["1"]
["1"]
["1"]
["1"]
["1"]
["1"]
["1"]
["1"]