{"text_format":"1","workbook":"xlsx","n_sheets":3,"sheets":["A","B","Sheet1"],"not_rendered":{"charts":0,"images":0,"macros":0,"external_links":0,"defined_names":0,"comments":0,"pivot_tables":0},"unopened":[],"bounds":{"document_bytes":16777216,"sheet_cells":100000,"rows_first":2000,"rows_last":500,"rows_between":2000,"halvings":0,"cell_chars":16384,"cell_head_chars":4096},"cells_cut":0,"cells_raw":0,"read":"whole","date_system":"1900"}

{"sheet":"A","index":0,"n_rows":18,"n_cols":14,"rows_kept":18,"cut":false,"hidden":false,"merged":[[1,1,1,2]]}
[]
[null,"المدة",null,"النوع","التفصيل",null,null,null,null,null,null,null,null,"ورقة الإضافة"]
[1,"2022-01-04","2022-01-11","AAAA",1245,null,null,null,null,null,null,null,null,"المضاف ينتقل مباشرة للورقة \"B\" تحت القسم الخاص به"]
[2,"2022-01-04","2022-01-11","AAAA",1264]
[3,"2022-01-04","2022-01-11","AAAA",1283,null,null,null,null,null,null,null,null,"الإضافة التي ليس لديها قسم خاص ينشأ لها قسم بشكل آلي"]
[4,"2022-01-04","2022-01-11","BBBB",1302]
[5,"2022-01-04","2022-01-11","AAAA",1321]
[6,"2022-01-04","2022-01-11","BBBB",1340]
[7,"2022-01-04","2022-01-18","AAAA",1359]
[8,"2022-02-01","2022-02-08","AAAA",1378]
[9,"2022-02-01","2022-02-08","BBBB",1397]
[10,"2022-02-01","2022-02-08","CCCC",1416]
[11,"2022-02-04","2022-02-11","BBBB",1435]
[12,"2022-02-04","2022-02-11","BBBB",1454]
[13,"2022-02-04","2022-02-18","CCCC",1473]
[14]
[15]
[16]

{"sheet":"B","index":1,"n_rows":136,"n_cols":15,"rows_kept":136,"cut":false,"hidden":false,"merged":[[6,11,11,11],[4,7,4,8],[4,9,4,10],[2,8,2,9],[3,8,3,9]]}
[]
[]
[null,"م",null,"AAAA",null,"التفصيل",null,"من التاريخ :","2022-01-01",null,null,null,null,{"$f":"IF(AND(NOT(ISERR(FIND(B!$J$5,D2))),D3>=B!$I$3,D3<=B!$I$4),COUNT($N2:N$3)+1,\"\")","v":""}]
[1,1,"AAAA","2022-01-04","2022-01-11",1245,null,"الى التاريخ :","2022-02-28",null,null,null,null,{"$f":"IF(AND(NOT(ISERR(FIND(B!$J$5,C4))),D4>=B!$I$3,D4<=B!$I$4),COUNT($N3:N$3)+1,\"\")","v":1},"AAAA"]
[2,2,"AAAA","2022-01-04","2022-01-11",1264,null,"النوع",null,"AAAA",null,null,null,{"$f":"IF(AND(NOT(ISERR(FIND(B!$J$5,C5))),D5>=B!$I$3,D5<=B!$I$4),COUNT($N$3:N4)+1,\"\")","v":2},"BBBB"]
[3,3,"AAAA","2022-01-04","2022-01-11",1283,null,"م ","التاريخ من","التاريخ الي","التفاصيل",null,null,{"$f":"IF(AND(NOT(ISERR(FIND(B!$J$5,C6))),D6>=B!$I$3,D6<=B!$I$4),COUNT($N$3:N5)+1,\"\")","v":3},"CCCC"]
[4,4,"AAAA","2022-01-04","2022-01-11",1321,null,{"$f":"IFERROR(INDEX(B!$A$3:$F$4768,MATCH(B!$A4,B!$N$3:$N$4278,0),1),\"\")","v":1},{"$f":"IFERROR(INDEX(B!$A$3:$F$4768,MATCH(B!$A4,B!$N$3:$N$4278,0),2),\"\")","v":"1900-01-01"},{"$f":"IFERROR(INDEX(B!$A$3:$F$4768,MATCH(B!$A4,B!$N$3:$N$4278,0),3),\"\")","v":"AAAA"},{"$f":"IFERROR(INDEX(B!$A$3:$F$4768,MATCH(B!$A4,B!$N$3:$N$4278,0),4),\"\")","v":44565},"معادلات لا يتم اللعب فيها",null,{"$f":"IF(AND(NOT(ISERR(FIND(B!$J$5,C7))),D7>=B!$I$3,D7<=B!$I$4),COUNT($N$3:N6)+1,\"\")","v":4},"DDDD"]
[5,null,null,null,null,null,null,{"$f":"IFERROR(INDEX(B!$A$3:$F$4768,MATCH(B!$A5,B!$N$3:$N$4278,0),1),\"\")","v":2},{"$f":"IFERROR(INDEX(B!$A$3:$F$4768,MATCH(B!$A5,B!$N$3:$N$4278,0),2),\"\")","v":"1900-01-02"},{"$f":"IFERROR(INDEX(B!$A$3:$F$4768,MATCH(B!$A5,B!$N$3:$N$4278,0),3),\"\")","v":"AAAA"},{"$f":"IFERROR(INDEX(B!$A$3:$F$4768,MATCH(B!$A5,B!$N$3:$N$4278,0),4),\"\")","v":44565},null,null,{"$f":"IF(AND(NOT(ISERR(FIND(B!$J$5,C8))),D8>=B!$I$3,D8<=B!$I$4),COUNT($N$3:N7)+1,\"\")","v":""},"EEEE"]
[6,null,null,null,null,null,null,{"$f":"IFERROR(INDEX(B!$A$3:$F$4768,MATCH(B!$A6,B!$N$3:$N$4278,0),1),\"\")","v":3},{"$f":"IFERROR(INDEX(B!$A$3:$F$4768,MATCH(B!$A6,B!$N$3:$N$4278,0),2),\"\")","v":"1900-01-03"},{"$f":"IFERROR(INDEX(B!$A$3:$F$4768,MATCH(B!$A6,B!$N$3:$N$4278,0),3),\"\")","v":"AAAA"},{"$f":"IFERROR(INDEX(B!$A$3:$F$4768,MATCH(B!$A6,B!$N$3:$N$4278,0),4),\"\")","v":44565},null,null,{"$f":"IF(AND(NOT(ISERR(FIND(B!$J$5,C9))),D9>=B!$I$3,D9<=B!$I$4),COUNT($N$3:N8)+1,\"\")","v":""},"FFFF"]
[7,null,null,null,null,null,null,{"$f":"IFERROR(INDEX(B!$A$3:$F$4768,MATCH(B!$A7,B!$N$3:$N$4278,0),1),\"\")","v":4},{"$f":"IFERROR(INDEX(B!$A$3:$F$4768,MATCH(B!$A7,B!$N$3:$N$4278,0),2),\"\")","v":"1900-01-04"},{"$f":"IFERROR(INDEX(B!$A$3:$F$4768,MATCH(B!$A7,B!$N$3:$N$4278,0),3),\"\")","v":"AAAA"},{"$f":"IFERROR(INDEX(B!$A$3:$F$4768,MATCH(B!$A7,B!$N$3:$N$4278,0),4),\"\")","v":44565},null,null,{"$f":"IF(AND(NOT(ISERR(FIND(B!$J$5,C10))),D10>=B!$I$3,D10<=B!$I$4),COUNT($N$3:N9)+1,\"\")","v":""},"GGGG"]
[8,null,null,"BBBB",null,null,null,{"$f":"IFERROR(INDEX(B!$A$3:$F$4768,MATCH(B!$A8,B!$N$3:$N$4278,0),1),\"\")","v":15},{"$f":"IFERROR(INDEX(B!$A$3:$F$4768,MATCH(B!$A8,B!$N$3:$N$4278,0),2),\"\")","v":"1900-01-01"},{"$f":"IFERROR(INDEX(B!$A$3:$F$4768,MATCH(B!$A8,B!$N$3:$N$4278,0),3),\"\")","v":"AAAA"},{"$f":"IFERROR(INDEX(B!$A$3:$F$4768,MATCH(B!$A8,B!$N$3:$N$4278,0),4),\"\")","v":44565},null,null,{"$f":"IF(AND(NOT(ISERR(FIND(B!$J$5,C11))),D11>=B!$I$3,D11<=B!$I$4),COUNT($N$3:N10)+1,\"\")","v":""}]
[9,1,"BBBB","2022-01-04","2022-01-11",1302,null,{"$f":"IFERROR(INDEX(B!$A$3:$F$4768,MATCH(B!$A9,B!$N$3:$N$4278,0),1),\"\")","v":20},{"$f":"IFERROR(INDEX(B!$A$3:$F$4768,MATCH(B!$A9,B!$N$3:$N$4278,0),2),\"\")","v":"1900-01-01"},{"$f":"IFERROR(INDEX(B!$A$3:$F$4768,MATCH(B!$A9,B!$N$3:$N$4278,0),3),\"\")","v":"AAAA"},{"$f":"IFERROR(INDEX(B!$A$3:$F$4768,MATCH(B!$A9,B!$N$3:$N$4278,0),4),\"\")","v":44593},null,null,{"$f":"IF(AND(NOT(ISERR(FIND(B!$J$5,C12))),D12>=B!$I$3,D12<=B!$I$4),COUNT($N$3:N11)+1,\"\")","v":""}]
[10,2,"BBBB","2022-01-04","2022-01-11",1340,null,{"$f":"IFERROR(INDEX(B!$A$3:$F$4768,MATCH(B!$A10,B!$N$3:$N$4278,0),1),\"\")","v":""},{"$f":"IFERROR(INDEX(B!$A$3:$F$4768,MATCH(B!$A10,B!$N$3:$N$4278,0),2),\"\")","v":""},{"$f":"IFERROR(INDEX(B!$A$3:$F$4768,MATCH(B!$A10,B!$N$3:$N$4278,0),3),\"\")","v":""},{"$f":"IFERROR(INDEX(B!$A$3:$F$4768,MATCH(B!$A10,B!$N$3:$N$4278,0),4),\"\")","v":""},null,null,{"$f":"IF(AND(NOT(ISERR(FIND(B!$J$5,C13))),D13>=B!$I$3,D13<=B!$I$4),COUNT($N$3:N12)+1,\"\")","v":""}]
[11,null,null,null,null,null,null,{"$f":"IFERROR(INDEX(B!$A$3:$F$4768,MATCH(B!$A11,B!$N$3:$N$4278,0),1),\"\")","v":""},{"$f":"IFERROR(INDEX(B!$A$3:$F$4768,MATCH(B!$A11,B!$N$3:$N$4278,0),2),\"\")","v":""},{"$f":"IFERROR(INDEX(B!$A$3:$F$4768,MATCH(B!$A11,B!$N$3:$N$4278,0),3),\"\")","v":""},{"$f":"IFERROR(INDEX(B!$A$3:$F$4768,MATCH(B!$A11,B!$N$3:$N$4278,0),4),\"\")","v":""},null,null,{"$f":"IF(AND(NOT(ISERR(FIND(B!$J$5,C14))),D14>=B!$I$3,D14<=B!$I$4),COUNT($N$3:N13)+1,\"\")","v":""}]
[12,null,null,null,null,null,null,{"$f":"IFERROR(INDEX(B!$A$3:$F$4768,MATCH(B!$A12,B!$N$3:$N$4278,0),1),\"\")","v":""},{"$f":"IFERROR(INDEX(B!$A$3:$F$4768,MATCH(B!$A12,B!$N$3:$N$4278,0),2),\"\")","v":""},{"$f":"IFERROR(INDEX(B!$A$3:$F$4768,MATCH(B!$A12,B!$N$3:$N$4278,0),3),\"\")","v":""},{"$f":"IFERROR(INDEX(B!$A$3:$F$4768,MATCH(B!$A12,B!$N$3:$N$4278,0),4),\"\")","v":""},null,null,{"$f":"IF(AND(NOT(ISERR(FIND(B!$J$5,C15))),D15>=B!$I$3,D15<=B!$I$4),COUNT($N$3:N14)+1,\"\")","v":""}]
[13,null,null,null,null,null,null,{"$f":"IFERROR(INDEX(B!$A$3:$F$4768,MATCH(B!$A13,B!$N$3:$N$4278,0),1),\"\")","v":""},{"$f":"IFERROR(INDEX(B!$A$3:$F$4768,MATCH(B!$A13,B!$N$3:$N$4278,0),2),\"\")","v":""},{"$f":"IFERROR(INDEX(B!$A$3:$F$4768,MATCH(B!$A13,B!$N$3:$N$4278,0),3),\"\")","v":""},{"$f":"IFERROR(INDEX(B!$A$3:$F$4768,MATCH(B!$A13,B!$N$3:$N$4278,0),4),\"\")","v":""},null,null,{"$f":"IF(AND(NOT(ISERR(FIND(B!$J$5,C16))),D16>=B!$I$3,D16<=B!$I$4),COUNT($N$3:N15)+1,\"\")","v":""}]
[14,null,null,"AAAA",null,null,null,{"$f":"IFERROR(INDEX(B!$A$3:$F$4768,MATCH(B!$A14,B!$N$3:$N$4278,0),1),\"\")","v":""},{"$f":"IFERROR(INDEX(B!$A$3:$F$4768,MATCH(B!$A14,B!$N$3:$N$4278,0),2),\"\")","v":""},{"$f":"IFERROR(INDEX(B!$A$3:$F$4768,MATCH(B!$A14,B!$N$3:$N$4278,0),3),\"\")","v":""},{"$f":"IFERROR(INDEX(B!$A$3:$F$4768,MATCH(B!$A14,B!$N$3:$N$4278,0),4),\"\")","v":""},null,null,{"$f":"IF(AND(NOT(ISERR(FIND(B!$J$5,C17))),D17>=B!$I$3,D17<=B!$I$4),COUNT($N$3:N16)+1,\"\")","v":""}]
[15,1,"AAAA","2022-01-04","2022-01-18",1359,null,{"$f":"IFERROR(INDEX(B!$A$3:$F$4768,MATCH(B!$A15,B!$N$3:$N$4278,0),1),\"\")","v":""},{"$f":"IFERROR(INDEX(B!$A$3:$F$4768,MATCH(B!$A15,B!$N$3:$N$4278,0),2),\"\")","v":""},{"$f":"IFERROR(INDEX(B!$A$3:$F$4768,MATCH(B!$A15,B!$N$3:$N$4278,0),3),\"\")","v":""},{"$f":"IFERROR(INDEX(B!$A$3:$F$4768,MATCH(B!$A15,B!$N$3:$N$4278,0),4),\"\")","v":""},null,null,{"$f":"IF(AND(NOT(ISERR(FIND(B!$J$5,C18))),D18>=B!$I$3,D18<=B!$I$4),COUNT($N$3:N17)+1,\"\")","v":5}]
[16,null,null,null,null,null,null,{"$f":"IFERROR(INDEX(B!$A$3:$F$4768,MATCH(B!$A16,B!$N$3:$N$4278,0),1),\"\")","v":""},{"$f":"IFERROR(INDEX(B!$A$3:$F$4768,MATCH(B!$A16,B!$N$3:$N$4278,0),2),\"\")","v":""},{"$f":"IFERROR(INDEX(B!$A$3:$F$4768,MATCH(B!$A16,B!$N$3:$N$4278,0),3),\"\")","v":""},{"$f":"IFERROR(INDEX(B!$A$3:$F$4768,MATCH(B!$A16,B!$N$3:$N$4278,0),4),\"\")","v":""},null,null,{"$f":"IF(AND(NOT(ISERR(FIND(B!$J$5,C19))),D19>=B!$I$3,D19<=B!$I$4),COUNT($N$3:N18)+1,\"\")","v":""}]
[17,null,null,null,null,null,null,{"$f":"IFERROR(INDEX(B!$A$3:$F$4768,MATCH(B!$A17,B!$N$3:$N$4278,0),1),\"\")","v":""},{"$f":"IFERROR(INDEX(B!$A$3:$F$4768,MATCH(B!$A17,B!$N$3:$N$4278,0),2),\"\")","v":""},{"$f":"IFERROR(INDEX(B!$A$3:$F$4768,MATCH(B!$A17,B!$N$3:$N$4278,0),3),\"\")","v":""},{"$f":"IFERROR(INDEX(B!$A$3:$F$4768,MATCH(B!$A17,B!$N$3:$N$4278,0),4),\"\")","v":""},null,null,{"$f":"IF(AND(NOT(ISERR(FIND(B!$J$5,C20))),D20>=B!$I$3,D20<=B!$I$4),COUNT($N$3:N19)+1,\"\")","v":""}]
[18,null,null,null,null,null,null,{"$f":"IFERROR(INDEX(B!$A$3:$F$4768,MATCH(B!$A18,B!$N$3:$N$4278,0),1),\"\")","v":""},{"$f":"IFERROR(INDEX(B!$A$3:$F$4768,MATCH(B!$A18,B!$N$3:$N$4278,0),2),\"\")","v":""},{"$f":"IFERROR(INDEX(B!$A$3:$F$4768,MATCH(B!$A18,B!$N$3:$N$4278,0),3),\"\")","v":""},{"$f":"IFERROR(INDEX(B!$A$3:$F$4768,MATCH(B!$A18,B!$N$3:$N$4278,0),4),\"\")","v":""},null,null,{"$f":"IF(AND(NOT(ISERR(FIND(B!$J$5,C21))),D21>=B!$I$3,D21<=B!$I$4),COUNT($N$3:N20)+1,\"\")","v":""}]
[19,null,null,"AAAA",null,null,null,{"$f":"IFERROR(INDEX(B!$A$3:$F$4768,MATCH(B!$A19,B!$N$3:$N$4278,0),1),\"\")","v":""},{"$f":"IFERROR(INDEX(B!$A$3:$F$4768,MATCH(B!$A19,B!$N$3:$N$4278,0),2),\"\")","v":""},{"$f":"IFERROR(INDEX(B!$A$3:$F$4768,MATCH(B!$A19,B!$N$3:$N$4278,0),3),\"\")","v":""},{"$f":"IFERROR(INDEX(B!$A$3:$F$4768,MATCH(B!$A19,B!$N$3:$N$4278,0),4),\"\")","v":""},null,null,{"$f":"IF(AND(NOT(ISERR(FIND(B!$J$5,C22))),D22>=B!$I$3,D22<=B!$I$4),COUNT($N$3:N21)+1,\"\")","v":""}]
[20,1,"AAAA","2022-02-01","2022-02-08",1378,null,{"$f":"IFERROR(INDEX(B!$A$3:$F$4768,MATCH(B!$A20,B!$N$3:$N$4278,0),1),\"\")","v":""},{"$f":"IFERROR(INDEX(B!$A$3:$F$4768,MATCH(B!$A20,B!$N$3:$N$4278,0),2),\"\")","v":""},{"$f":"IFERROR(INDEX(B!$A$3:$F$4768,MATCH(B!$A20,B!$N$3:$N$4278,0),3),\"\")","v":""},{"$f":"IFERROR(INDEX(B!$A$3:$F$4768,MATCH(B!$A20,B!$N$3:$N$4278,0),4),\"\")","v":""},null,null,{"$f":"IF(AND(NOT(ISERR(FIND(B!$J$5,C23))),D23>=B!$I$3,D23<=B!$I$4),COUNT($N$3:N22)+1,\"\")","v":6}]
[21,null,null,null,null,null,null,{"$f":"IFERROR(INDEX(B!$A$3:$F$4768,MATCH(B!$A21,B!$N$3:$N$4278,0),1),\"\")","v":""},{"$f":"IFERROR(INDEX(B!$A$3:$F$4768,MATCH(B!$A21,B!$N$3:$N$4278,0),2),\"\")","v":""},{"$f":"IFERROR(INDEX(B!$A$3:$F$4768,MATCH(B!$A21,B!$N$3:$N$4278,0),3),\"\")","v":""},{"$f":"IFERROR(INDEX(B!$A$3:$F$4768,MATCH(B!$A21,B!$N$3:$N$4278,0),4),\"\")","v":""},null,null,{"$f":"IF(AND(NOT(ISERR(FIND(B!$J$5,C24))),D24>=B!$I$3,D24<=B!$I$4),COUNT($N$3:N23)+1,\"\")","v":""}]
[22,null,null,null,null,null,null,{"$f":"IFERROR(INDEX(B!$A$3:$F$4768,MATCH(B!$A22,B!$N$3:$N$4278,0),1),\"\")","v":""},{"$f":"IFERROR(INDEX(B!$A$3:$F$4768,MATCH(B!$A22,B!$N$3:$N$4278,0),2),\"\")","v":""},{"$f":"IFERROR(INDEX(B!$A$3:$F$4768,MATCH(B!$A22,B!$N$3:$N$4278,0),3),\"\")","v":""},{"$f":"IFERROR(INDEX(B!$A$3:$F$4768,MATCH(B!$A22,B!$N$3:$N$4278,0),4),\"\")","v":""},null,null,{"$f":"IF(AND(NOT(ISERR(FIND(B!$J$5,C25))),D25>=B!$I$3,D25<=B!$I$4),COUNT($N$3:N24)+1,\"\")","v":""}]
[23,null,null,null,null,null,null,{"$f":"IFERROR(INDEX(B!$A$3:$F$4768,MATCH(B!$A23,B!$N$3:$N$4278,0),1),\"\")","v":""},{"$f":"IFERROR(INDEX(B!$A$3:$F$4768,MATCH(B!$A23,B!$N$3:$N$4278,0),2),\"\")","v":""},{"$f":"IFERROR(INDEX(B!$A$3:$F$4768,MATCH(B!$A23,B!$N$3:$N$4278,0),3),\"\")","v":""},{"$f":"IFERROR(INDEX(B!$A$3:$F$4768,MATCH(B!$A23,B!$N$3:$N$4278,0),4),\"\")","v":""},null,null,{"$f":"IF(AND(NOT(ISERR(FIND(B!$J$5,C26))),D26>=B!$I$3,D26<=B!$I$4),COUNT($N$3:N25)+1,\"\")","v":""}]
[24,null,null,"BBBB",null,null,null,{"$f":"IFERROR(INDEX(B!$A$3:$F$4768,MATCH(B!$A24,B!$N$3:$N$4278,0),1),\"\")","v":""},{"$f":"IFERROR(INDEX(B!$A$3:$F$4768,MATCH(B!$A24,B!$N$3:$N$4278,0),2),\"\")","v":""},{"$f":"IFERROR(INDEX(B!$A$3:$F$4768,MATCH(B!$A24,B!$N$3:$N$4278,0),3),\"\")","v":""},{"$f":"IFERROR(INDEX(B!$A$3:$F$4768,MATCH(B!$A24,B!$N$3:$N$4278,0),4),\"\")","v":""},null,null,{"$f":"IF(AND(NOT(ISERR(FIND(B!$J$5,C27))),D27>=B!$I$3,D27<=B!$I$4),COUNT($N$3:N26)+1,\"\")","v":""}]
[25,1,"BBBB","2022-02-01","2022-02-08",1397,null,{"$f":"IFERROR(INDEX(B!$A$3:$F$4768,MATCH(B!$A25,B!$N$3:$N$4278,0),1),\"\")","v":""},{"$f":"IFERROR(INDEX(B!$A$3:$F$4768,MATCH(B!$A25,B!$N$3:$N$4278,0),2),\"\")","v":""},{"$f":"IFERROR(INDEX(B!$A$3:$F$4768,MATCH(B!$A25,B!$N$3:$N$4278,0),3),\"\")","v":""},{"$f":"IFERROR(INDEX(B!$A$3:$F$4768,MATCH(B!$A25,B!$N$3:$N$4278,0),4),\"\")","v":""},null,null,{"$f":"IF(AND(NOT(ISERR(FIND(B!$J$5,C28))),D28>=B!$I$3,D28<=B!$I$4),COUNT($N$3:N27)+1,\"\")","v":""}]
[26,null,null,null,null,null,null,{"$f":"IFERROR(INDEX(B!$A$3:$F$4768,MATCH(B!$A26,B!$N$3:$N$4278,0),1),\"\")","v":""},{"$f":"IFERROR(INDEX(B!$A$3:$F$4768,MATCH(B!$A26,B!$N$3:$N$4278,0),2),\"\")","v":""},{"$f":"IFERROR(INDEX(B!$A$3:$F$4768,MATCH(B!$A26,B!$N$3:$N$4278,0),3),\"\")","v":""},{"$f":"IFERROR(INDEX(B!$A$3:$F$4768,MATCH(B!$A26,B!$N$3:$N$4278,0),4),\"\")","v":""},null,null,{"$f":"IF(AND(NOT(ISERR(FIND(B!$J$5,C29))),D29>=B!$I$3,D29<=B!$I$4),COUNT($N$3:N28)+1,\"\")","v":""}]
[27,null,null,null,null,null,null,{"$f":"IFERROR(INDEX(B!$A$3:$F$4768,MATCH(B!$A27,B!$N$3:$N$4278,0),1),\"\")","v":""},{"$f":"IFERROR(INDEX(B!$A$3:$F$4768,MATCH(B!$A27,B!$N$3:$N$4278,0),2),\"\")","v":""},{"$f":"IFERROR(INDEX(B!$A$3:$F$4768,MATCH(B!$A27,B!$N$3:$N$4278,0),3),\"\")","v":""},{"$f":"IFERROR(INDEX(B!$A$3:$F$4768,MATCH(B!$A27,B!$N$3:$N$4278,0),4),\"\")","v":""},null,null,{"$f":"IF(AND(NOT(ISERR(FIND(B!$J$5,C30))),D30>=B!$I$3,D30<=B!$I$4),COUNT($N$3:N29)+1,\"\")","v":""}]
[28,null,null,null,null,null,null,{"$f":"IFERROR(INDEX(B!$A$3:$F$4768,MATCH(B!$A28,B!$N$3:$N$4278,0),1),\"\")","v":""},{"$f":"IFERROR(INDEX(B!$A$3:$F$4768,MATCH(B!$A28,B!$N$3:$N$4278,0),2),\"\")","v":""},{"$f":"IFERROR(INDEX(B!$A$3:$F$4768,MATCH(B!$A28,B!$N$3:$N$4278,0),3),\"\")","v":""},{"$f":"IFERROR(INDEX(B!$A$3:$F$4768,MATCH(B!$A28,B!$N$3:$N$4278,0),4),\"\")","v":""},null,null,{"$f":"IF(AND(NOT(ISERR(FIND(B!$J$5,C31))),D31>=B!$I$3,D31<=B!$I$4),COUNT($N$3:N30)+1,\"\")","v":""}]
[29,null,null,"CCCC",null,null,null,{"$f":"IFERROR(INDEX(B!$A$3:$F$4768,MATCH(B!$A29,B!$N$3:$N$4278,0),1),\"\")","v":""},{"$f":"IFERROR(INDEX(B!$A$3:$F$4768,MATCH(B!$A29,B!$N$3:$N$4278,0),2),\"\")","v":""},{"$f":"IFERROR(INDEX(B!$A$3:$F$4768,MATCH(B!$A29,B!$N$3:$N$4278,0),3),\"\")","v":""},{"$f":"IFERROR(INDEX(B!$A$3:$F$4768,MATCH(B!$A29,B!$N$3:$N$4278,0),4),\"\")","v":""},null,null,{"$f":"IF(AND(NOT(ISERR(FIND(B!$J$5,C32))),D32>=B!$I$3,D32<=B!$I$4),COUNT($N$3:N31)+1,\"\")","v":""}]
[30,1,null,"2022-02-01","2022-02-08",1416,null,{"$f":"IFERROR(INDEX(B!$A$3:$F$4768,MATCH(B!$A30,B!$N$3:$N$4278,0),1),\"\")","v":""},{"$f":"IFERROR(INDEX(B!$A$3:$F$4768,MATCH(B!$A30,B!$N$3:$N$4278,0),2),\"\")","v":""},{"$f":"IFERROR(INDEX(B!$A$3:$F$4768,MATCH(B!$A30,B!$N$3:$N$4278,0),3),\"\")","v":""},{"$f":"IFERROR(INDEX(B!$A$3:$F$4768,MATCH(B!$A30,B!$N$3:$N$4278,0),4),\"\")","v":""},null,null,{"$f":"IF(AND(NOT(ISERR(FIND(B!$J$5,C33))),D33>=B!$I$3,D33<=B!$I$4),COUNT($N$3:N32)+1,\"\")","v":""}]
[31,null,null,null,null,null,null,{"$f":"IFERROR(INDEX(B!$A$3:$F$4768,MATCH(B!$A31,B!$N$3:$N$4278,0),1),\"\")","v":""},{"$f":"IFERROR(INDEX(B!$A$3:$F$4768,MATCH(B!$A31,B!$N$3:$N$4278,0),2),\"\")","v":""},{"$f":"IFERROR(INDEX(B!$A$3:$F$4768,MATCH(B!$A31,B!$N$3:$N$4278,0),3),\"\")","v":""},{"$f":"IFERROR(INDEX(B!$A$3:$F$4768,MATCH(B!$A31,B!$N$3:$N$4278,0),4),\"\")","v":""},null,null,{"$f":"IF(AND(NOT(ISERR(FIND(B!$J$5,C34))),D34>=B!$I$3,D34<=B!$I$4),COUNT($N$3:N33)+1,\"\")","v":""}]
[32,null,null,null,null,null,null,{"$f":"IFERROR(INDEX(B!$A$3:$F$4768,MATCH(B!$A32,B!$N$3:$N$4278,0),1),\"\")","v":""},{"$f":"IFERROR(INDEX(B!$A$3:$F$4768,MATCH(B!$A32,B!$N$3:$N$4278,0),2),\"\")","v":""},{"$f":"IFERROR(INDEX(B!$A$3:$F$4768,MATCH(B!$A32,B!$N$3:$N$4278,0),3),\"\")","v":""},{"$f":"IFERROR(INDEX(B!$A$3:$F$4768,MATCH(B!$A32,B!$N$3:$N$4278,0),4),\"\")","v":""},null,null,{"$f":"IF(AND(NOT(ISERR(FIND(B!$J$5,C35))),D35>=B!$I$3,D35<=B!$I$4),COUNT($N$3:N34)+1,\"\")","v":""}]
[33,null,null,null,null,null,null,{"$f":"IFERROR(INDEX(B!$A$3:$F$4768,MATCH(B!$A33,B!$N$3:$N$4278,0),1),\"\")","v":""},{"$f":"IFERROR(INDEX(B!$A$3:$F$4768,MATCH(B!$A33,B!$N$3:$N$4278,0),2),\"\")","v":""},{"$f":"IFERROR(INDEX(B!$A$3:$F$4768,MATCH(B!$A33,B!$N$3:$N$4278,0),3),\"\")","v":""},{"$f":"IFERROR(INDEX(B!$A$3:$F$4768,MATCH(B!$A33,B!$N$3:$N$4278,0),4),\"\")","v":""},null,null,{"$f":"IF(AND(NOT(ISERR(FIND(B!$J$5,C36))),D36>=B!$I$3,D36<=B!$I$4),COUNT($N$3:N35)+1,\"\")","v":""}]
[34,null,null,"BBBB",null,null,null,{"$f":"IFERROR(INDEX(B!$A$3:$F$4768,MATCH(B!$A34,B!$N$3:$N$4278,0),1),\"\")","v":""},{"$f":"IFERROR(INDEX(B!$A$3:$F$4768,MATCH(B!$A34,B!$N$3:$N$4278,0),2),\"\")","v":""},{"$f":"IFERROR(INDEX(B!$A$3:$F$4768,MATCH(B!$A34,B!$N$3:$N$4278,0),3),\"\")","v":""},{"$f":"IFERROR(INDEX(B!$A$3:$F$4768,MATCH(B!$A34,B!$N$3:$N$4278,0),4),\"\")","v":""},null,null,{"$f":"IF(AND(NOT(ISERR(FIND(B!$J$5,C37))),D37>=B!$I$3,D37<=B!$I$4),COUNT($N$3:N36)+1,\"\")","v":""}]
[35,1,"BBBB","2022-02-04","2022-02-11",1435,null,{"$f":"IFERROR(INDEX(B!$A$3:$F$4768,MATCH(B!$A35,B!$N$3:$N$4278,0),1),\"\")","v":""},{"$f":"IFERROR(INDEX(B!$A$3:$F$4768,MATCH(B!$A35,B!$N$3:$N$4278,0),2),\"\")","v":""},{"$f":"IFERROR(INDEX(B!$A$3:$F$4768,MATCH(B!$A35,B!$N$3:$N$4278,0),3),\"\")","v":""},{"$f":"IFERROR(INDEX(B!$A$3:$F$4768,MATCH(B!$A35,B!$N$3:$N$4278,0),4),\"\")","v":""},null,null,{"$f":"IF(AND(NOT(ISERR(FIND(B!$J$5,C38))),D38>=B!$I$3,D38<=B!$I$4),COUNT($N$3:N37)+1,\"\")","v":""}]
[36,2,"BBBB","2022-02-04","2022-02-11",1454,null,{"$f":"IFERROR(INDEX(B!$A$3:$F$4768,MATCH(B!$A36,B!$N$3:$N$4278,0),1),\"\")","v":""},{"$f":"IFERROR(INDEX(B!$A$3:$F$4768,MATCH(B!$A36,B!$N$3:$N$4278,0),2),\"\")","v":""},{"$f":"IFERROR(INDEX(B!$A$3:$F$4768,MATCH(B!$A36,B!$N$3:$N$4278,0),3),\"\")","v":""},{"$f":"IFERROR(INDEX(B!$A$3:$F$4768,MATCH(B!$A36,B!$N$3:$N$4278,0),4),\"\")","v":""},null,null,{"$f":"IF(AND(NOT(ISERR(FIND(B!$J$5,C39))),D39>=B!$I$3,D39<=B!$I$4),COUNT($N$3:N38)+1,\"\")","v":""}]
[37,null,null,null,null,null,null,{"$f":"IFERROR(INDEX(B!$A$3:$F$4768,MATCH(B!$A37,B!$N$3:$N$4278,0),1),\"\")","v":""},{"$f":"IFERROR(INDEX(B!$A$3:$F$4768,MATCH(B!$A37,B!$N$3:$N$4278,0),2),\"\")","v":""},{"$f":"IFERROR(INDEX(B!$A$3:$F$4768,MATCH(B!$A37,B!$N$3:$N$4278,0),3),\"\")","v":""},{"$f":"IFERROR(INDEX(B!$A$3:$F$4768,MATCH(B!$A37,B!$N$3:$N$4278,0),4),\"\")","v":""},null,null,{"$f":"IF(AND(NOT(ISERR(FIND(B!$J$5,C40))),D40>=B!$I$3,D40<=B!$I$4),COUNT($N$3:N39)+1,\"\")","v":""}]
[38,null,null,null,null,null,null,{"$f":"IFERROR(INDEX(B!$A$3:$F$4768,MATCH(B!$A38,B!$N$3:$N$4278,0),1),\"\")","v":""},{"$f":"IFERROR(INDEX(B!$A$3:$F$4768,MATCH(B!$A38,B!$N$3:$N$4278,0),2),\"\")","v":""},{"$f":"IFERROR(INDEX(B!$A$3:$F$4768,MATCH(B!$A38,B!$N$3:$N$4278,0),3),\"\")","v":""},{"$f":"IFERROR(INDEX(B!$A$3:$F$4768,MATCH(B!$A38,B!$N$3:$N$4278,0),4),\"\")","v":""},null,null,{"$f":"IF(AND(NOT(ISERR(FIND(B!$J$5,C41))),D41>=B!$I$3,D41<=B!$I$4),COUNT($N$3:N40)+1,\"\")","v":""}]
[39,null,null,null,null,null,null,{"$f":"IFERROR(INDEX(B!$A$3:$F$4768,MATCH(B!$A39,B!$N$3:$N$4278,0),1),\"\")","v":""},{"$f":"IFERROR(INDEX(B!$A$3:$F$4768,MATCH(B!$A39,B!$N$3:$N$4278,0),2),\"\")","v":""},{"$f":"IFERROR(INDEX(B!$A$3:$F$4768,MATCH(B!$A39,B!$N$3:$N$4278,0),3),\"\")","v":""},{"$f":"IFERROR(INDEX(B!$A$3:$F$4768,MATCH(B!$A39,B!$N$3:$N$4278,0),4),\"\")","v":""},null,null,{"$f":"IF(AND(NOT(ISERR(FIND(B!$J$5,C42))),D42>=B!$I$3,D42<=B!$I$4),COUNT($N$3:N41)+1,\"\")","v":""}]
[40,null,null,"CCCC",null,null,null,{"$f":"IFERROR(INDEX(B!$A$3:$F$4768,MATCH(B!$A40,B!$N$3:$N$4278,0),1),\"\")","v":""},{"$f":"IFERROR(INDEX(B!$A$3:$F$4768,MATCH(B!$A40,B!$N$3:$N$4278,0),2),\"\")","v":""},{"$f":"IFERROR(INDEX(B!$A$3:$F$4768,MATCH(B!$A40,B!$N$3:$N$4278,0),3),\"\")","v":""},{"$f":"IFERROR(INDEX(B!$A$3:$F$4768,MATCH(B!$A40,B!$N$3:$N$4278,0),4),\"\")","v":""},null,null,{"$f":"IF(AND(NOT(ISERR(FIND(B!$J$5,C43))),D43>=B!$I$3,D43<=B!$I$4),COUNT($N$3:N42)+1,\"\")","v":""}]
[41,1,"CCCC","2022-02-04","2022-02-18",1473,null,{"$f":"IFERROR(INDEX(B!$A$3:$F$4768,MATCH(B!$A41,B!$N$3:$N$4278,0),1),\"\")","v":""},{"$f":"IFERROR(INDEX(B!$A$3:$F$4768,MATCH(B!$A41,B!$N$3:$N$4278,0),2),\"\")","v":""},{"$f":"IFERROR(INDEX(B!$A$3:$F$4768,MATCH(B!$A41,B!$N$3:$N$4278,0),3),\"\")","v":""},{"$f":"IFERROR(INDEX(B!$A$3:$F$4768,MATCH(B!$A41,B!$N$3:$N$4278,0),4),\"\")","v":""},null,null,{"$f":"IF(AND(NOT(ISERR(FIND(B!$J$5,C44))),D44>=B!$I$3,D44<=B!$I$4),COUNT($N$3:N43)+1,\"\")","v":""}]
[42,null,null,null,null,null,null,{"$f":"IFERROR(INDEX(B!$A$3:$F$4768,MATCH(B!$A42,B!$N$3:$N$4278,0),1),\"\")","v":""},{"$f":"IFERROR(INDEX(B!$A$3:$F$4768,MATCH(B!$A42,B!$N$3:$N$4278,0),2),\"\")","v":""},{"$f":"IFERROR(INDEX(B!$A$3:$F$4768,MATCH(B!$A42,B!$N$3:$N$4278,0),3),\"\")","v":""},{"$f":"IFERROR(INDEX(B!$A$3:$F$4768,MATCH(B!$A42,B!$N$3:$N$4278,0),4),\"\")","v":""},null,null,{"$f":"IF(AND(NOT(ISERR(FIND(B!$J$5,C45))),D45>=B!$I$3,D45<=B!$I$4),COUNT($N$3:N44)+1,\"\")","v":""}]
[43,null,null,null,null,null,null,{"$f":"IFERROR(INDEX(B!$A$3:$F$4768,MATCH(B!$A43,B!$N$3:$N$4278,0),1),\"\")","v":""},{"$f":"IFERROR(INDEX(B!$A$3:$F$4768,MATCH(B!$A43,B!$N$3:$N$4278,0),2),\"\")","v":""},{"$f":"IFERROR(INDEX(B!$A$3:$F$4768,MATCH(B!$A43,B!$N$3:$N$4278,0),3),\"\")","v":""},{"$f":"IFERROR(INDEX(B!$A$3:$F$4768,MATCH(B!$A43,B!$N$3:$N$4278,0),4),\"\")","v":""},null,null,{"$f":"IF(AND(NOT(ISERR(FIND(B!$J$5,C46))),D46>=B!$I$3,D46<=B!$I$4),COUNT($N$3:N45)+1,\"\")","v":""}]
[44,null,null,null,null,null,null,{"$f":"IFERROR(INDEX(B!$A$3:$F$4768,MATCH(B!$A44,B!$N$3:$N$4278,0),1),\"\")","v":""},{"$f":"IFERROR(INDEX(B!$A$3:$F$4768,MATCH(B!$A44,B!$N$3:$N$4278,0),2),\"\")","v":""},{"$f":"IFERROR(INDEX(B!$A$3:$F$4768,MATCH(B!$A44,B!$N$3:$N$4278,0),3),\"\")","v":""},{"$f":"IFERROR(INDEX(B!$A$3:$F$4768,MATCH(B!$A44,B!$N$3:$N$4278,0),4),\"\")","v":""},null,null,{"$f":"IF(AND(NOT(ISERR(FIND(B!$J$5,C47))),D47>=B!$I$3,D47<=B!$I$4),COUNT($N$3:N46)+1,\"\")","v":""}]
[45,null,null,null,null,null,null,{"$f":"IFERROR(INDEX(B!$A$3:$F$4768,MATCH(B!$A45,B!$N$3:$N$4278,0),1),\"\")","v":""},{"$f":"IFERROR(INDEX(B!$A$3:$F$4768,MATCH(B!$A45,B!$N$3:$N$4278,0),2),\"\")","v":""},{"$f":"IFERROR(INDEX(B!$A$3:$F$4768,MATCH(B!$A45,B!$N$3:$N$4278,0),3),\"\")","v":""},{"$f":"IFERROR(INDEX(B!$A$3:$F$4768,MATCH(B!$A45,B!$N$3:$N$4278,0),4),\"\")","v":""},null,null,{"$f":"IF(AND(NOT(ISERR(FIND(B!$J$5,C48))),D48>=B!$I$3,D48<=B!$I$4),COUNT($N$3:N47)+1,\"\")","v":""}]
[46,null,null,null,null,null,null,{"$f":"IFERROR(INDEX(B!$A$3:$F$4768,MATCH(B!$A46,B!$N$3:$N$4278,0),1),\"\")","v":""},{"$f":"IFERROR(INDEX(B!$A$3:$F$4768,MATCH(B!$A46,B!$N$3:$N$4278,0),2),\"\")","v":""},{"$f":"IFERROR(INDEX(B!$A$3:$F$4768,MATCH(B!$A46,B!$N$3:$N$4278,0),3),\"\")","v":""},{"$f":"IFERROR(INDEX(B!$A$3:$F$4768,MATCH(B!$A46,B!$N$3:$N$4278,0),4),\"\")","v":""},null,null,{"$f":"IF(AND(NOT(ISERR(FIND(B!$J$5,C49))),D49>=B!$I$3,D49<=B!$I$4),COUNT($N$3:N48)+1,\"\")","v":""}]
[47,null,null,null,null,null,null,{"$f":"IFERROR(INDEX(B!$A$3:$F$4768,MATCH(B!$A47,B!$N$3:$N$4278,0),1),\"\")","v":""},{"$f":"IFERROR(INDEX(B!$A$3:$F$4768,MATCH(B!$A47,B!$N$3:$N$4278,0),2),\"\")","v":""},{"$f":"IFERROR(INDEX(B!$A$3:$F$4768,MATCH(B!$A47,B!$N$3:$N$4278,0),3),\"\")","v":""},{"$f":"IFERROR(INDEX(B!$A$3:$F$4768,MATCH(B!$A47,B!$N$3:$N$4278,0),4),\"\")","v":""},null,null,{"$f":"IF(AND(NOT(ISERR(FIND(B!$J$5,C50))),D50>=B!$I$3,D50<=B!$I$4),COUNT($N$3:N49)+1,\"\")","v":""}]
[48,null,null,null,null,null,null,{"$f":"IFERROR(INDEX(B!$A$3:$F$4768,MATCH(B!$A48,B!$N$3:$N$4278,0),1),\"\")","v":""},{"$f":"IFERROR(INDEX(B!$A$3:$F$4768,MATCH(B!$A48,B!$N$3:$N$4278,0),2),\"\")","v":""},{"$f":"IFERROR(INDEX(B!$A$3:$F$4768,MATCH(B!$A48,B!$N$3:$N$4278,0),3),\"\")","v":""},{"$f":"IFERROR(INDEX(B!$A$3:$F$4768,MATCH(B!$A48,B!$N$3:$N$4278,0),4),\"\")","v":""},null,null,{"$f":"IF(AND(NOT(ISERR(FIND(B!$J$5,C51))),D51>=B!$I$3,D51<=B!$I$4),COUNT($N$3:N50)+1,\"\")","v":""}]
[49,null,null,null,null,null,null,{"$f":"IFERROR(INDEX(B!$A$3:$F$4768,MATCH(B!$A49,B!$N$3:$N$4278,0),1),\"\")","v":""},{"$f":"IFERROR(INDEX(B!$A$3:$F$4768,MATCH(B!$A49,B!$N$3:$N$4278,0),2),\"\")","v":""},{"$f":"IFERROR(INDEX(B!$A$3:$F$4768,MATCH(B!$A49,B!$N$3:$N$4278,0),3),\"\")","v":""},{"$f":"IFERROR(INDEX(B!$A$3:$F$4768,MATCH(B!$A49,B!$N$3:$N$4278,0),4),\"\")","v":""},null,null,{"$f":"IF(AND(NOT(ISERR(FIND(B!$J$5,C52))),D52>=B!$I$3,D52<=B!$I$4),COUNT($N$3:N51)+1,\"\")","v":""}]
[50,null,null,null,null,null,null,{"$f":"IFERROR(INDEX(B!$A$3:$F$4768,MATCH(B!$A50,B!$N$3:$N$4278,0),1),\"\")","v":""},{"$f":"IFERROR(INDEX(B!$A$3:$F$4768,MATCH(B!$A50,B!$N$3:$N$4278,0),2),\"\")","v":""},{"$f":"IFERROR(INDEX(B!$A$3:$F$4768,MATCH(B!$A50,B!$N$3:$N$4278,0),3),\"\")","v":""},{"$f":"IFERROR(INDEX(B!$A$3:$F$4768,MATCH(B!$A50,B!$N$3:$N$4278,0),4),\"\")","v":""},null,null,{"$f":"IF(AND(NOT(ISERR(FIND(B!$J$5,C53))),D53>=B!$I$3,D53<=B!$I$4),COUNT($N$3:N52)+1,\"\")","v":""}]
[51,null,null,null,null,null,null,{"$f":"IFERROR(INDEX(B!$A$3:$F$4768,MATCH(B!$A51,B!$N$3:$N$4278,0),1),\"\")","v":""},{"$f":"IFERROR(INDEX(B!$A$3:$F$4768,MATCH(B!$A51,B!$N$3:$N$4278,0),2),\"\")","v":""},{"$f":"IFERROR(INDEX(B!$A$3:$F$4768,MATCH(B!$A51,B!$N$3:$N$4278,0),3),\"\")","v":""},{"$f":"IFERROR(INDEX(B!$A$3:$F$4768,MATCH(B!$A51,B!$N$3:$N$4278,0),4),\"\")","v":""},null,null,{"$f":"IF(AND(NOT(ISERR(FIND(B!$J$5,C54))),D54>=B!$I$3,D54<=B!$I$4),COUNT($N$3:N53)+1,\"\")","v":""}]
[52,null,null,null,null,null,null,{"$f":"IFERROR(INDEX(B!$A$3:$F$4768,MATCH(B!$A52,B!$N$3:$N$4278,0),1),\"\")","v":""},{"$f":"IFERROR(INDEX(B!$A$3:$F$4768,MATCH(B!$A52,B!$N$3:$N$4278,0),2),\"\")","v":""},{"$f":"IFERROR(INDEX(B!$A$3:$F$4768,MATCH(B!$A52,B!$N$3:$N$4278,0),3),\"\")","v":""},{"$f":"IFERROR(INDEX(B!$A$3:$F$4768,MATCH(B!$A52,B!$N$3:$N$4278,0),4),\"\")","v":""},null,null,{"$f":"IF(AND(NOT(ISERR(FIND(B!$J$5,C55))),D55>=B!$I$3,D55<=B!$I$4),COUNT($N$3:N54)+1,\"\")","v":""}]
[53,null,null,null,null,null,null,{"$f":"IFERROR(INDEX(B!$A$3:$F$4768,MATCH(B!$A53,B!$N$3:$N$4278,0),1),\"\")","v":""},{"$f":"IFERROR(INDEX(B!$A$3:$F$4768,MATCH(B!$A53,B!$N$3:$N$4278,0),2),\"\")","v":""},{"$f":"IFERROR(INDEX(B!$A$3:$F$4768,MATCH(B!$A53,B!$N$3:$N$4278,0),3),\"\")","v":""},{"$f":"IFERROR(INDEX(B!$A$3:$F$4768,MATCH(B!$A53,B!$N$3:$N$4278,0),4),\"\")","v":""},null,null,{"$f":"IF(AND(NOT(ISERR(FIND(B!$J$5,C56))),D56>=B!$I$3,D56<=B!$I$4),COUNT($N$3:N55)+1,\"\")","v":""}]
[54,null,null,null,null,null,null,{"$f":"IFERROR(INDEX(B!$A$3:$F$4768,MATCH(B!$A54,B!$N$3:$N$4278,0),1),\"\")","v":""},{"$f":"IFERROR(INDEX(B!$A$3:$F$4768,MATCH(B!$A54,B!$N$3:$N$4278,0),2),\"\")","v":""},{"$f":"IFERROR(INDEX(B!$A$3:$F$4768,MATCH(B!$A54,B!$N$3:$N$4278,0),3),\"\")","v":""},{"$f":"IFERROR(INDEX(B!$A$3:$F$4768,MATCH(B!$A54,B!$N$3:$N$4278,0),4),\"\")","v":""},null,null,{"$f":"IF(AND(NOT(ISERR(FIND(B!$J$5,C57))),D57>=B!$I$3,D57<=B!$I$4),COUNT($N$3:N56)+1,\"\")","v":""}]
[55,null,null,null,null,null,null,{"$f":"IFERROR(INDEX(B!$A$3:$F$4768,MATCH(B!$A55,B!$N$3:$N$4278,0),1),\"\")","v":""},{"$f":"IFERROR(INDEX(B!$A$3:$F$4768,MATCH(B!$A55,B!$N$3:$N$4278,0),2),\"\")","v":""},{"$f":"IFERROR(INDEX(B!$A$3:$F$4768,MATCH(B!$A55,B!$N$3:$N$4278,0),3),\"\")","v":""},{"$f":"IFERROR(INDEX(B!$A$3:$F$4768,MATCH(B!$A55,B!$N$3:$N$4278,0),4),\"\")","v":""},null,null,{"$f":"IF(AND(NOT(ISERR(FIND(B!$J$5,C58))),D58>=B!$I$3,D58<=B!$I$4),COUNT($N$3:N57)+1,\"\")","v":""}]
[56,null,null,null,null,null,null,{"$f":"IFERROR(INDEX(B!$A$3:$F$4768,MATCH(B!$A56,B!$N$3:$N$4278,0),1),\"\")","v":""},{"$f":"IFERROR(INDEX(B!$A$3:$F$4768,MATCH(B!$A56,B!$N$3:$N$4278,0),2),\"\")","v":""},{"$f":"IFERROR(INDEX(B!$A$3:$F$4768,MATCH(B!$A56,B!$N$3:$N$4278,0),3),\"\")","v":""},{"$f":"IFERROR(INDEX(B!$A$3:$F$4768,MATCH(B!$A56,B!$N$3:$N$4278,0),4),\"\")","v":""},null,null,{"$f":"IF(AND(NOT(ISERR(FIND(B!$J$5,C59))),D59>=B!$I$3,D59<=B!$I$4),COUNT($N$3:N58)+1,\"\")","v":""}]
[57,null,null,null,null,null,null,{"$f":"IFERROR(INDEX(B!$A$3:$F$4768,MATCH(B!$A57,B!$N$3:$N$4278,0),1),\"\")","v":""},{"$f":"IFERROR(INDEX(B!$A$3:$F$4768,MATCH(B!$A57,B!$N$3:$N$4278,0),2),\"\")","v":""},{"$f":"IFERROR(INDEX(B!$A$3:$F$4768,MATCH(B!$A57,B!$N$3:$N$4278,0),3),\"\")","v":""},{"$f":"IFERROR(INDEX(B!$A$3:$F$4768,MATCH(B!$A57,B!$N$3:$N$4278,0),4),\"\")","v":""},null,null,{"$f":"IF(AND(NOT(ISERR(FIND(B!$J$5,C60))),D60>=B!$I$3,D60<=B!$I$4),COUNT($N$3:N59)+1,\"\")","v":""}]
[58,null,null,null,null,null,null,{"$f":"IFERROR(INDEX(B!$A$3:$F$4768,MATCH(B!$A58,B!$N$3:$N$4278,0),1),\"\")","v":""},{"$f":"IFERROR(INDEX(B!$A$3:$F$4768,MATCH(B!$A58,B!$N$3:$N$4278,0),2),\"\")","v":""},{"$f":"IFERROR(INDEX(B!$A$3:$F$4768,MATCH(B!$A58,B!$N$3:$N$4278,0),3),\"\")","v":""},{"$f":"IFERROR(INDEX(B!$A$3:$F$4768,MATCH(B!$A58,B!$N$3:$N$4278,0),4),\"\")","v":""},null,null,{"$f":"IF(AND(NOT(ISERR(FIND(B!$J$5,C61))),D61>=B!$I$3,D61<=B!$I$4),COUNT($N$3:N60)+1,\"\")","v":""}]
[59,null,null,null,null,null,null,{"$f":"IFERROR(INDEX(B!$A$3:$F$4768,MATCH(B!$A59,B!$N$3:$N$4278,0),1),\"\")","v":""},{"$f":"IFERROR(INDEX(B!$A$3:$F$4768,MATCH(B!$A59,B!$N$3:$N$4278,0),2),\"\")","v":""},{"$f":"IFERROR(INDEX(B!$A$3:$F$4768,MATCH(B!$A59,B!$N$3:$N$4278,0),3),\"\")","v":""},{"$f":"IFERROR(INDEX(B!$A$3:$F$4768,MATCH(B!$A59,B!$N$3:$N$4278,0),4),\"\")","v":""},null,null,{"$f":"IF(AND(NOT(ISERR(FIND(B!$J$5,C62))),D62>=B!$I$3,D62<=B!$I$4),COUNT($N$3:N61)+1,\"\")","v":""}]
[60,null,null,null,null,null,null,{"$f":"IFERROR(INDEX(B!$A$3:$F$4768,MATCH(B!$A60,B!$N$3:$N$4278,0),1),\"\")","v":""},{"$f":"IFERROR(INDEX(B!$A$3:$F$4768,MATCH(B!$A60,B!$N$3:$N$4278,0),2),\"\")","v":""},{"$f":"IFERROR(INDEX(B!$A$3:$F$4768,MATCH(B!$A60,B!$N$3:$N$4278,0),3),\"\")","v":""},{"$f":"IFERROR(INDEX(B!$A$3:$F$4768,MATCH(B!$A60,B!$N$3:$N$4278,0),4),\"\")","v":""},null,null,{"$f":"IF(AND(NOT(ISERR(FIND(B!$J$5,C63))),D63>=B!$I$3,D63<=B!$I$4),COUNT($N$3:N62)+1,\"\")","v":""}]
[61,null,null,null,null,null,null,{"$f":"IFERROR(INDEX(B!$A$3:$F$4768,MATCH(B!$A61,B!$N$3:$N$4278,0),1),\"\")","v":""},{"$f":"IFERROR(INDEX(B!$A$3:$F$4768,MATCH(B!$A61,B!$N$3:$N$4278,0),2),\"\")","v":""},{"$f":"IFERROR(INDEX(B!$A$3:$F$4768,MATCH(B!$A61,B!$N$3:$N$4278,0),3),\"\")","v":""},{"$f":"IFERROR(INDEX(B!$A$3:$F$4768,MATCH(B!$A61,B!$N$3:$N$4278,0),4),\"\")","v":""},null,null,{"$f":"IF(AND(NOT(ISERR(FIND(B!$J$5,C64))),D64>=B!$I$3,D64<=B!$I$4),COUNT($N$3:N63)+1,\"\")","v":""}]
[62,null,null,null,null,null,null,{"$f":"IFERROR(INDEX(B!$A$3:$F$4768,MATCH(B!$A62,B!$N$3:$N$4278,0),1),\"\")","v":""},{"$f":"IFERROR(INDEX(B!$A$3:$F$4768,MATCH(B!$A62,B!$N$3:$N$4278,0),2),\"\")","v":""},{"$f":"IFERROR(INDEX(B!$A$3:$F$4768,MATCH(B!$A62,B!$N$3:$N$4278,0),3),\"\")","v":""},{"$f":"IFERROR(INDEX(B!$A$3:$F$4768,MATCH(B!$A62,B!$N$3:$N$4278,0),4),\"\")","v":""},null,null,{"$f":"IF(AND(NOT(ISERR(FIND(B!$J$5,C65))),D65>=B!$I$3,D65<=B!$I$4),COUNT($N$3:N64)+1,\"\")","v":""}]
[63,null,null,null,null,null,null,{"$f":"IFERROR(INDEX(B!$A$3:$F$4768,MATCH(B!$A63,B!$N$3:$N$4278,0),1),\"\")","v":""},{"$f":"IFERROR(INDEX(B!$A$3:$F$4768,MATCH(B!$A63,B!$N$3:$N$4278,0),2),\"\")","v":""},{"$f":"IFERROR(INDEX(B!$A$3:$F$4768,MATCH(B!$A63,B!$N$3:$N$4278,0),3),\"\")","v":""},{"$f":"IFERROR(INDEX(B!$A$3:$F$4768,MATCH(B!$A63,B!$N$3:$N$4278,0),4),\"\")","v":""},null,null,{"$f":"IF(AND(NOT(ISERR(FIND(B!$J$5,C66))),D66>=B!$I$3,D66<=B!$I$4),COUNT($N$3:N65)+1,\"\")","v":""}]
[64,null,null,null,null,null,null,{"$f":"IFERROR(INDEX(B!$A$3:$F$4768,MATCH(B!$A64,B!$N$3:$N$4278,0),1),\"\")","v":""},{"$f":"IFERROR(INDEX(B!$A$3:$F$4768,MATCH(B!$A64,B!$N$3:$N$4278,0),2),\"\")","v":""},{"$f":"IFERROR(INDEX(B!$A$3:$F$4768,MATCH(B!$A64,B!$N$3:$N$4278,0),3),\"\")","v":""},{"$f":"IFERROR(INDEX(B!$A$3:$F$4768,MATCH(B!$A64,B!$N$3:$N$4278,0),4),\"\")","v":""},null,null,{"$f":"IF(AND(NOT(ISERR(FIND(B!$J$5,C67))),D67>=B!$I$3,D67<=B!$I$4),COUNT($N$3:N66)+1,\"\")","v":""}]
[65,null,null,null,null,null,null,{"$f":"IFERROR(INDEX(B!$A$3:$F$4768,MATCH(B!$A65,B!$N$3:$N$4278,0),1),\"\")","v":""},{"$f":"IFERROR(INDEX(B!$A$3:$F$4768,MATCH(B!$A65,B!$N$3:$N$4278,0),2),\"\")","v":""},{"$f":"IFERROR(INDEX(B!$A$3:$F$4768,MATCH(B!$A65,B!$N$3:$N$4278,0),3),\"\")","v":""},{"$f":"IFERROR(INDEX(B!$A$3:$F$4768,MATCH(B!$A65,B!$N$3:$N$4278,0),4),\"\")","v":""},null,null,{"$f":"IF(AND(NOT(ISERR(FIND(B!$J$5,C68))),D68>=B!$I$3,D68<=B!$I$4),COUNT($N$3:N67)+1,\"\")","v":""}]
[66,null,null,null,null,null,null,{"$f":"IFERROR(INDEX(B!$A$3:$F$4768,MATCH(B!$A66,B!$N$3:$N$4278,0),1),\"\")","v":""},{"$f":"IFERROR(INDEX(B!$A$3:$F$4768,MATCH(B!$A66,B!$N$3:$N$4278,0),2),\"\")","v":""},{"$f":"IFERROR(INDEX(B!$A$3:$F$4768,MATCH(B!$A66,B!$N$3:$N$4278,0),3),\"\")","v":""},{"$f":"IFERROR(INDEX(B!$A$3:$F$4768,MATCH(B!$A66,B!$N$3:$N$4278,0),4),\"\")","v":""},null,null,{"$f":"IF(AND(NOT(ISERR(FIND(B!$J$5,C69))),D69>=B!$I$3,D69<=B!$I$4),COUNT($N$3:N68)+1,\"\")","v":""}]
[67,null,null,null,null,null,null,{"$f":"IFERROR(INDEX(B!$A$3:$F$4768,MATCH(B!$A67,B!$N$3:$N$4278,0),1),\"\")","v":""},{"$f":"IFERROR(INDEX(B!$A$3:$F$4768,MATCH(B!$A67,B!$N$3:$N$4278,0),2),\"\")","v":""},{"$f":"IFERROR(INDEX(B!$A$3:$F$4768,MATCH(B!$A67,B!$N$3:$N$4278,0),3),\"\")","v":""},{"$f":"IFERROR(INDEX(B!$A$3:$F$4768,MATCH(B!$A67,B!$N$3:$N$4278,0),4),\"\")","v":""},null,null,{"$f":"IF(AND(NOT(ISERR(FIND(B!$J$5,C70))),D70>=B!$I$3,D70<=B!$I$4),COUNT($N$3:N69)+1,\"\")","v":""}]
[68,null,null,null,null,null,null,{"$f":"IFERROR(INDEX(B!$A$3:$F$4768,MATCH(B!$A68,B!$N$3:$N$4278,0),1),\"\")","v":""},{"$f":"IFERROR(INDEX(B!$A$3:$F$4768,MATCH(B!$A68,B!$N$3:$N$4278,0),2),\"\")","v":""},{"$f":"IFERROR(INDEX(B!$A$3:$F$4768,MATCH(B!$A68,B!$N$3:$N$4278,0),3),\"\")","v":""},{"$f":"IFERROR(INDEX(B!$A$3:$F$4768,MATCH(B!$A68,B!$N$3:$N$4278,0),4),\"\")","v":""},null,null,{"$f":"IF(AND(NOT(ISERR(FIND(B!$J$5,C71))),D71>=B!$I$3,D71<=B!$I$4),COUNT($N$3:N70)+1,\"\")","v":""}]
[69,null,null,null,null,null,null,{"$f":"IFERROR(INDEX(B!$A$3:$F$4768,MATCH(B!$A69,B!$N$3:$N$4278,0),1),\"\")","v":""},{"$f":"IFERROR(INDEX(B!$A$3:$F$4768,MATCH(B!$A69,B!$N$3:$N$4278,0),2),\"\")","v":""},{"$f":"IFERROR(INDEX(B!$A$3:$F$4768,MATCH(B!$A69,B!$N$3:$N$4278,0),3),\"\")","v":""},{"$f":"IFERROR(INDEX(B!$A$3:$F$4768,MATCH(B!$A69,B!$N$3:$N$4278,0),4),\"\")","v":""},null,null,{"$f":"IF(AND(NOT(ISERR(FIND(B!$J$5,C72))),D72>=B!$I$3,D72<=B!$I$4),COUNT($N$3:N71)+1,\"\")","v":""}]
[70,null,null,null,null,null,null,{"$f":"IFERROR(INDEX(B!$A$3:$F$4768,MATCH(B!$A70,B!$N$3:$N$4278,0),1),\"\")","v":""},{"$f":"IFERROR(INDEX(B!$A$3:$F$4768,MATCH(B!$A70,B!$N$3:$N$4278,0),2),\"\")","v":""},{"$f":"IFERROR(INDEX(B!$A$3:$F$4768,MATCH(B!$A70,B!$N$3:$N$4278,0),3),\"\")","v":""},{"$f":"IFERROR(INDEX(B!$A$3:$F$4768,MATCH(B!$A70,B!$N$3:$N$4278,0),4),\"\")","v":""},null,null,{"$f":"IF(AND(NOT(ISERR(FIND(B!$J$5,C73))),D73>=B!$I$3,D73<=B!$I$4),COUNT($N$3:N72)+1,\"\")","v":""}]
[71,null,null,null,null,null,null,{"$f":"IFERROR(INDEX(B!$A$3:$F$4768,MATCH(B!$A71,B!$N$3:$N$4278,0),1),\"\")","v":""},{"$f":"IFERROR(INDEX(B!$A$3:$F$4768,MATCH(B!$A71,B!$N$3:$N$4278,0),2),\"\")","v":""},{"$f":"IFERROR(INDEX(B!$A$3:$F$4768,MATCH(B!$A71,B!$N$3:$N$4278,0),3),\"\")","v":""},{"$f":"IFERROR(INDEX(B!$A$3:$F$4768,MATCH(B!$A71,B!$N$3:$N$4278,0),4),\"\")","v":""},null,null,{"$f":"IF(AND(NOT(ISERR(FIND(B!$J$5,C74))),D74>=B!$I$3,D74<=B!$I$4),COUNT($N$3:N73)+1,\"\")","v":""}]
[72,null,null,null,null,null,null,{"$f":"IFERROR(INDEX(B!$A$3:$F$4768,MATCH(B!$A72,B!$N$3:$N$4278,0),1),\"\")","v":""},{"$f":"IFERROR(INDEX(B!$A$3:$F$4768,MATCH(B!$A72,B!$N$3:$N$4278,0),2),\"\")","v":""},{"$f":"IFERROR(INDEX(B!$A$3:$F$4768,MATCH(B!$A72,B!$N$3:$N$4278,0),3),\"\")","v":""},{"$f":"IFERROR(INDEX(B!$A$3:$F$4768,MATCH(B!$A72,B!$N$3:$N$4278,0),4),\"\")","v":""},null,null,{"$f":"IF(AND(NOT(ISERR(FIND(B!$J$5,C75))),D75>=B!$I$3,D75<=B!$I$4),COUNT($N$3:N74)+1,\"\")","v":""}]
[73,null,null,null,null,null,null,{"$f":"IFERROR(INDEX(B!$A$3:$F$4768,MATCH(B!$A73,B!$N$3:$N$4278,0),1),\"\")","v":""},{"$f":"IFERROR(INDEX(B!$A$3:$F$4768,MATCH(B!$A73,B!$N$3:$N$4278,0),2),\"\")","v":""},{"$f":"IFERROR(INDEX(B!$A$3:$F$4768,MATCH(B!$A73,B!$N$3:$N$4278,0),3),\"\")","v":""},{"$f":"IFERROR(INDEX(B!$A$3:$F$4768,MATCH(B!$A73,B!$N$3:$N$4278,0),4),\"\")","v":""},null,null,{"$f":"IF(AND(NOT(ISERR(FIND(B!$J$5,C76))),D76>=B!$I$3,D76<=B!$I$4),COUNT($N$3:N75)+1,\"\")","v":""}]
[74,null,null,null,null,null,null,{"$f":"IFERROR(INDEX(B!$A$3:$F$4768,MATCH(B!$A74,B!$N$3:$N$4278,0),1),\"\")","v":""},{"$f":"IFERROR(INDEX(B!$A$3:$F$4768,MATCH(B!$A74,B!$N$3:$N$4278,0),2),\"\")","v":""},{"$f":"IFERROR(INDEX(B!$A$3:$F$4768,MATCH(B!$A74,B!$N$3:$N$4278,0),3),\"\")","v":""},{"$f":"IFERROR(INDEX(B!$A$3:$F$4768,MATCH(B!$A74,B!$N$3:$N$4278,0),4),\"\")","v":""},null,null,{"$f":"IF(AND(NOT(ISERR(FIND(B!$J$5,C77))),D77>=B!$I$3,D77<=B!$I$4),COUNT($N$3:N76)+1,\"\")","v":""}]
[75,null,null,null,null,null,null,{"$f":"IFERROR(INDEX(B!$A$3:$F$4768,MATCH(B!$A75,B!$N$3:$N$4278,0),1),\"\")","v":""},{"$f":"IFERROR(INDEX(B!$A$3:$F$4768,MATCH(B!$A75,B!$N$3:$N$4278,0),2),\"\")","v":""},{"$f":"IFERROR(INDEX(B!$A$3:$F$4768,MATCH(B!$A75,B!$N$3:$N$4278,0),3),\"\")","v":""},{"$f":"IFERROR(INDEX(B!$A$3:$F$4768,MATCH(B!$A75,B!$N$3:$N$4278,0),4),\"\")","v":""},null,null,{"$f":"IF(AND(NOT(ISERR(FIND(B!$J$5,C78))),D78>=B!$I$3,D78<=B!$I$4),COUNT($N$3:N77)+1,\"\")","v":""}]
[76,null,null,null,null,null,null,{"$f":"IFERROR(INDEX(B!$A$3:$F$4768,MATCH(B!$A76,B!$N$3:$N$4278,0),1),\"\")","v":""},{"$f":"IFERROR(INDEX(B!$A$3:$F$4768,MATCH(B!$A76,B!$N$3:$N$4278,0),2),\"\")","v":""},{"$f":"IFERROR(INDEX(B!$A$3:$F$4768,MATCH(B!$A76,B!$N$3:$N$4278,0),3),\"\")","v":""},{"$f":"IFERROR(INDEX(B!$A$3:$F$4768,MATCH(B!$A76,B!$N$3:$N$4278,0),4),\"\")","v":""},null,null,{"$f":"IF(AND(NOT(ISERR(FIND(B!$J$5,C79))),D79>=B!$I$3,D79<=B!$I$4),COUNT($N$3:N78)+1,\"\")","v":""}]
[77,null,null,null,null,null,null,{"$f":"IFERROR(INDEX(B!$A$3:$F$4768,MATCH(B!$A77,B!$N$3:$N$4278,0),1),\"\")","v":""},{"$f":"IFERROR(INDEX(B!$A$3:$F$4768,MATCH(B!$A77,B!$N$3:$N$4278,0),2),\"\")","v":""},{"$f":"IFERROR(INDEX(B!$A$3:$F$4768,MATCH(B!$A77,B!$N$3:$N$4278,0),3),\"\")","v":""},{"$f":"IFERROR(INDEX(B!$A$3:$F$4768,MATCH(B!$A77,B!$N$3:$N$4278,0),4),\"\")","v":""},null,null,{"$f":"IF(AND(NOT(ISERR(FIND(B!$J$5,C80))),D80>=B!$I$3,D80<=B!$I$4),COUNT($N$3:N79)+1,\"\")","v":""}]
[78,null,null,null,null,null,null,{"$f":"IFERROR(INDEX(B!$A$3:$F$4768,MATCH(B!$A78,B!$N$3:$N$4278,0),1),\"\")","v":""},{"$f":"IFERROR(INDEX(B!$A$3:$F$4768,MATCH(B!$A78,B!$N$3:$N$4278,0),2),\"\")","v":""},{"$f":"IFERROR(INDEX(B!$A$3:$F$4768,MATCH(B!$A78,B!$N$3:$N$4278,0),3),\"\")","v":""},{"$f":"IFERROR(INDEX(B!$A$3:$F$4768,MATCH(B!$A78,B!$N$3:$N$4278,0),4),\"\")","v":""},null,null,{"$f":"IF(AND(NOT(ISERR(FIND(B!$J$5,C81))),D81>=B!$I$3,D81<=B!$I$4),COUNT($N$3:N80)+1,\"\")","v":""}]
[79,null,null,null,null,null,null,{"$f":"IFERROR(INDEX(B!$A$3:$F$4768,MATCH(B!$A79,B!$N$3:$N$4278,0),1),\"\")","v":""},{"$f":"IFERROR(INDEX(B!$A$3:$F$4768,MATCH(B!$A79,B!$N$3:$N$4278,0),2),\"\")","v":""},{"$f":"IFERROR(INDEX(B!$A$3:$F$4768,MATCH(B!$A79,B!$N$3:$N$4278,0),3),\"\")","v":""},{"$f":"IFERROR(INDEX(B!$A$3:$F$4768,MATCH(B!$A79,B!$N$3:$N$4278,0),4),\"\")","v":""},null,null,{"$f":"IF(AND(NOT(ISERR(FIND(B!$J$5,C82))),D82>=B!$I$3,D82<=B!$I$4),COUNT($N$3:N81)+1,\"\")","v":""}]
[80,null,null,null,null,null,null,{"$f":"IFERROR(INDEX(B!$A$3:$F$4768,MATCH(B!$A80,B!$N$3:$N$4278,0),1),\"\")","v":""},{"$f":"IFERROR(INDEX(B!$A$3:$F$4768,MATCH(B!$A80,B!$N$3:$N$4278,0),2),\"\")","v":""},{"$f":"IFERROR(INDEX(B!$A$3:$F$4768,MATCH(B!$A80,B!$N$3:$N$4278,0),3),\"\")","v":""},{"$f":"IFERROR(INDEX(B!$A$3:$F$4768,MATCH(B!$A80,B!$N$3:$N$4278,0),4),\"\")","v":""},null,null,{"$f":"IF(AND(NOT(ISERR(FIND(B!$J$5,C83))),D83>=B!$I$3,D83<=B!$I$4),COUNT($N$3:N82)+1,\"\")","v":""}]
[81,null,null,null,null,null,null,{"$f":"IFERROR(INDEX(B!$A$3:$F$4768,MATCH(B!$A81,B!$N$3:$N$4278,0),1),\"\")","v":""},{"$f":"IFERROR(INDEX(B!$A$3:$F$4768,MATCH(B!$A81,B!$N$3:$N$4278,0),2),\"\")","v":""},{"$f":"IFERROR(INDEX(B!$A$3:$F$4768,MATCH(B!$A81,B!$N$3:$N$4278,0),3),\"\")","v":""},{"$f":"IFERROR(INDEX(B!$A$3:$F$4768,MATCH(B!$A81,B!$N$3:$N$4278,0),4),\"\")","v":""},null,null,{"$f":"IF(AND(NOT(ISERR(FIND(B!$J$5,C84))),D84>=B!$I$3,D84<=B!$I$4),COUNT($N$3:N83)+1,\"\")","v":""}]
[82,null,null,null,null,null,null,{"$f":"IFERROR(INDEX(B!$A$3:$F$4768,MATCH(B!$A82,B!$N$3:$N$4278,0),1),\"\")","v":""},{"$f":"IFERROR(INDEX(B!$A$3:$F$4768,MATCH(B!$A82,B!$N$3:$N$4278,0),2),\"\")","v":""},{"$f":"IFERROR(INDEX(B!$A$3:$F$4768,MATCH(B!$A82,B!$N$3:$N$4278,0),3),\"\")","v":""},{"$f":"IFERROR(INDEX(B!$A$3:$F$4768,MATCH(B!$A82,B!$N$3:$N$4278,0),4),\"\")","v":""},null,null,{"$f":"IF(AND(NOT(ISERR(FIND(B!$J$5,C85))),D85>=B!$I$3,D85<=B!$I$4),COUNT($N$3:N84)+1,\"\")","v":""}]
[83,null,null,null,null,null,null,{"$f":"IFERROR(INDEX(B!$A$3:$F$4768,MATCH(B!$A83,B!$N$3:$N$4278,0),1),\"\")","v":""},{"$f":"IFERROR(INDEX(B!$A$3:$F$4768,MATCH(B!$A83,B!$N$3:$N$4278,0),2),\"\")","v":""},{"$f":"IFERROR(INDEX(B!$A$3:$F$4768,MATCH(B!$A83,B!$N$3:$N$4278,0),3),\"\")","v":""},{"$f":"IFERROR(INDEX(B!$A$3:$F$4768,MATCH(B!$A83,B!$N$3:$N$4278,0),4),\"\")","v":""},null,null,{"$f":"IF(AND(NOT(ISERR(FIND(B!$J$5,C86))),D86>=B!$I$3,D86<=B!$I$4),COUNT($N$3:N85)+1,\"\")","v":""}]
[84,null,null,null,null,null,null,{"$f":"IFERROR(INDEX(B!$A$3:$F$4768,MATCH(B!$A84,B!$N$3:$N$4278,0),1),\"\")","v":""},{"$f":"IFERROR(INDEX(B!$A$3:$F$4768,MATCH(B!$A84,B!$N$3:$N$4278,0),2),\"\")","v":""},{"$f":"IFERROR(INDEX(B!$A$3:$F$4768,MATCH(B!$A84,B!$N$3:$N$4278,0),3),\"\")","v":""},{"$f":"IFERROR(INDEX(B!$A$3:$F$4768,MATCH(B!$A84,B!$N$3:$N$4278,0),4),\"\")","v":""},null,null,{"$f":"IF(AND(NOT(ISERR(FIND(B!$J$5,C87))),D87>=B!$I$3,D87<=B!$I$4),COUNT($N$3:N86)+1,\"\")","v":""}]
[85,null,null,null,null,null,null,{"$f":"IFERROR(INDEX(B!$A$3:$F$4768,MATCH(B!$A85,B!$N$3:$N$4278,0),1),\"\")","v":""},{"$f":"IFERROR(INDEX(B!$A$3:$F$4768,MATCH(B!$A85,B!$N$3:$N$4278,0),2),\"\")","v":""},{"$f":"IFERROR(INDEX(B!$A$3:$F$4768,MATCH(B!$A85,B!$N$3:$N$4278,0),3),\"\")","v":""},{"$f":"IFERROR(INDEX(B!$A$3:$F$4768,MATCH(B!$A85,B!$N$3:$N$4278,0),4),\"\")","v":""},null,null,{"$f":"IF(AND(NOT(ISERR(FIND(B!$J$5,C88))),D88>=B!$I$3,D88<=B!$I$4),COUNT($N$3:N87)+1,\"\")","v":""}]
[86,null,null,null,null,null,null,{"$f":"IFERROR(INDEX(B!$A$3:$F$4768,MATCH(B!$A86,B!$N$3:$N$4278,0),1),\"\")","v":""},{"$f":"IFERROR(INDEX(B!$A$3:$F$4768,MATCH(B!$A86,B!$N$3:$N$4278,0),2),\"\")","v":""},{"$f":"IFERROR(INDEX(B!$A$3:$F$4768,MATCH(B!$A86,B!$N$3:$N$4278,0),3),\"\")","v":""},{"$f":"IFERROR(INDEX(B!$A$3:$F$4768,MATCH(B!$A86,B!$N$3:$N$4278,0),4),\"\")","v":""},null,null,{"$f":"IF(AND(NOT(ISERR(FIND(B!$J$5,C89))),D89>=B!$I$3,D89<=B!$I$4),COUNT($N$3:N88)+1,\"\")","v":""}]
[87,null,null,null,null,null,null,{"$f":"IFERROR(INDEX(B!$A$3:$F$4768,MATCH(B!$A87,B!$N$3:$N$4278,0),1),\"\")","v":""},{"$f":"IFERROR(INDEX(B!$A$3:$F$4768,MATCH(B!$A87,B!$N$3:$N$4278,0),2),\"\")","v":""},{"$f":"IFERROR(INDEX(B!$A$3:$F$4768,MATCH(B!$A87,B!$N$3:$N$4278,0),3),\"\")","v":""},{"$f":"IFERROR(INDEX(B!$A$3:$F$4768,MATCH(B!$A87,B!$N$3:$N$4278,0),4),\"\")","v":""},null,null,{"$f":"IF(AND(NOT(ISERR(FIND(B!$J$5,C90))),D90>=B!$I$3,D90<=B!$I$4),COUNT($N$3:N89)+1,\"\")","v":""}]
[88,null,null,null,null,null,null,{"$f":"IFERROR(INDEX(B!$A$3:$F$4768,MATCH(B!$A88,B!$N$3:$N$4278,0),1),\"\")","v":""},{"$f":"IFERROR(INDEX(B!$A$3:$F$4768,MATCH(B!$A88,B!$N$3:$N$4278,0),2),\"\")","v":""},{"$f":"IFERROR(INDEX(B!$A$3:$F$4768,MATCH(B!$A88,B!$N$3:$N$4278,0),3),\"\")","v":""},{"$f":"IFERROR(INDEX(B!$A$3:$F$4768,MATCH(B!$A88,B!$N$3:$N$4278,0),4),\"\")","v":""},null,null,{"$f":"IF(AND(NOT(ISERR(FIND(B!$J$5,C91))),D91>=B!$I$3,D91<=B!$I$4),COUNT($N$3:N90)+1,\"\")","v":""}]
[89,null,null,null,null,null,null,{"$f":"IFERROR(INDEX(B!$A$3:$F$4768,MATCH(B!$A89,B!$N$3:$N$4278,0),1),\"\")","v":""},{"$f":"IFERROR(INDEX(B!$A$3:$F$4768,MATCH(B!$A89,B!$N$3:$N$4278,0),2),\"\")","v":""},{"$f":"IFERROR(INDEX(B!$A$3:$F$4768,MATCH(B!$A89,B!$N$3:$N$4278,0),3),\"\")","v":""},{"$f":"IFERROR(INDEX(B!$A$3:$F$4768,MATCH(B!$A89,B!$N$3:$N$4278,0),4),\"\")","v":""},null,null,{"$f":"IF(AND(NOT(ISERR(FIND(B!$J$5,C92))),D92>=B!$I$3,D92<=B!$I$4),COUNT($N$3:N91)+1,\"\")","v":""}]
[90,null,null,null,null,null,null,{"$f":"IFERROR(INDEX(B!$A$3:$F$4768,MATCH(B!$A90,B!$N$3:$N$4278,0),1),\"\")","v":""},{"$f":"IFERROR(INDEX(B!$A$3:$F$4768,MATCH(B!$A90,B!$N$3:$N$4278,0),2),\"\")","v":""},{"$f":"IFERROR(INDEX(B!$A$3:$F$4768,MATCH(B!$A90,B!$N$3:$N$4278,0),3),\"\")","v":""},{"$f":"IFERROR(INDEX(B!$A$3:$F$4768,MATCH(B!$A90,B!$N$3:$N$4278,0),4),\"\")","v":""},null,null,{"$f":"IF(AND(NOT(ISERR(FIND(B!$J$5,D92))),D93>=B!$I$3,D93<=B!$I$4),COUNT($N$3:N92)+1,\"\")","v":""}]
[91,null,null,null,null,null,null,{"$f":"IFERROR(INDEX(B!$A$3:$F$4768,MATCH(B!$A91,B!$N$3:$N$4278,0),1),\"\")","v":""},{"$f":"IFERROR(INDEX(B!$A$3:$F$4768,MATCH(B!$A91,B!$N$3:$N$4278,0),2),\"\")","v":""},{"$f":"IFERROR(INDEX(B!$A$3:$F$4768,MATCH(B!$A91,B!$N$3:$N$4278,0),3),\"\")","v":""},{"$f":"IFERROR(INDEX(B!$A$3:$F$4768,MATCH(B!$A91,B!$N$3:$N$4278,0),4),\"\")","v":""},null,null,{"$f":"IF(AND(NOT(ISERR(FIND(B!$J$5,D93))),D94>=B!$I$3,D94<=B!$I$4),COUNT($N$3:N93)+1,\"\")","v":""}]
[92,null,null,null,null,null,null,{"$f":"IFERROR(INDEX(B!$A$3:$F$4768,MATCH(B!$A92,B!$N$3:$N$4278,0),1),\"\")","v":""},{"$f":"IFERROR(INDEX(B!$A$3:$F$4768,MATCH(B!$A92,B!$N$3:$N$4278,0),2),\"\")","v":""},{"$f":"IFERROR(INDEX(B!$A$3:$F$4768,MATCH(B!$A92,B!$N$3:$N$4278,0),3),\"\")","v":""},{"$f":"IFERROR(INDEX(B!$A$3:$F$4768,MATCH(B!$A92,B!$N$3:$N$4278,0),4),\"\")","v":""},null,null,{"$f":"IF(AND(NOT(ISERR(FIND(B!$J$5,D94))),D95>=B!$I$3,D95<=B!$I$4),COUNT($N$3:N94)+1,\"\")","v":""}]
[93,null,null,null,null,null,null,{"$f":"IFERROR(INDEX(B!$A$3:$F$4768,MATCH(B!$A93,B!$N$3:$N$4278,0),1),\"\")","v":""},{"$f":"IFERROR(INDEX(B!$A$3:$F$4768,MATCH(B!$A93,B!$N$3:$N$4278,0),2),\"\")","v":""},{"$f":"IFERROR(INDEX(B!$A$3:$F$4768,MATCH(B!$A93,B!$N$3:$N$4278,0),3),\"\")","v":""},{"$f":"IFERROR(INDEX(B!$A$3:$F$4768,MATCH(B!$A93,B!$N$3:$N$4278,0),4),\"\")","v":""},null,null,{"$f":"IF(AND(NOT(ISERR(FIND(B!$J$5,D95))),D96>=B!$I$3,D96<=B!$I$4),COUNT($N$3:N95)+1,\"\")","v":""}]
[94,null,null,null,null,null,null,{"$f":"IFERROR(INDEX(B!$A$3:$F$4768,MATCH(B!$A94,B!$N$3:$N$4278,0),1),\"\")","v":""},{"$f":"IFERROR(INDEX(B!$A$3:$F$4768,MATCH(B!$A94,B!$N$3:$N$4278,0),2),\"\")","v":""},{"$f":"IFERROR(INDEX(B!$A$3:$F$4768,MATCH(B!$A94,B!$N$3:$N$4278,0),3),\"\")","v":""},{"$f":"IFERROR(INDEX(B!$A$3:$F$4768,MATCH(B!$A94,B!$N$3:$N$4278,0),4),\"\")","v":""},null,null,{"$f":"IF(AND(NOT(ISERR(FIND(B!$J$5,D96))),D97>=B!$I$3,D97<=B!$I$4),COUNT($N$3:N96)+1,\"\")","v":""}]
[95,null,null,null,null,null,null,{"$f":"IFERROR(INDEX(B!$A$3:$F$4768,MATCH(B!$A95,B!$N$3:$N$4278,0),1),\"\")","v":""},{"$f":"IFERROR(INDEX(B!$A$3:$F$4768,MATCH(B!$A95,B!$N$3:$N$4278,0),2),\"\")","v":""},{"$f":"IFERROR(INDEX(B!$A$3:$F$4768,MATCH(B!$A95,B!$N$3:$N$4278,0),3),\"\")","v":""},{"$f":"IFERROR(INDEX(B!$A$3:$F$4768,MATCH(B!$A95,B!$N$3:$N$4278,0),4),\"\")","v":""},null,null,{"$f":"IF(AND(NOT(ISERR(FIND(B!$J$5,D97))),D98>=B!$I$3,D98<=B!$I$4),COUNT($N$3:N97)+1,\"\")","v":""}]
[96,null,null,null,null,null,null,{"$f":"IFERROR(INDEX(B!$A$3:$F$4768,MATCH(B!$A96,B!$N$3:$N$4278,0),1),\"\")","v":""},{"$f":"IFERROR(INDEX(B!$A$3:$F$4768,MATCH(B!$A96,B!$N$3:$N$4278,0),2),\"\")","v":""},{"$f":"IFERROR(INDEX(B!$A$3:$F$4768,MATCH(B!$A96,B!$N$3:$N$4278,0),3),\"\")","v":""},{"$f":"IFERROR(INDEX(B!$A$3:$F$4768,MATCH(B!$A96,B!$N$3:$N$4278,0),4),\"\")","v":""},null,null,{"$f":"IF(AND(NOT(ISERR(FIND(B!$J$5,D98))),D99>=B!$I$3,D99<=B!$I$4),COUNT($N$3:N98)+1,\"\")","v":""}]
[97,null,null,null,null,null,null,{"$f":"IFERROR(INDEX(B!$A$3:$F$4768,MATCH(B!$A97,B!$N$3:$N$4278,0),1),\"\")","v":""},{"$f":"IFERROR(INDEX(B!$A$3:$F$4768,MATCH(B!$A97,B!$N$3:$N$4278,0),2),\"\")","v":""},{"$f":"IFERROR(INDEX(B!$A$3:$F$4768,MATCH(B!$A97,B!$N$3:$N$4278,0),3),\"\")","v":""},{"$f":"IFERROR(INDEX(B!$A$3:$F$4768,MATCH(B!$A97,B!$N$3:$N$4278,0),4),\"\")","v":""},null,null,{"$f":"IF(AND(NOT(ISERR(FIND(B!$J$5,D99))),D100>=B!$I$3,D100<=B!$I$4),COUNT($N$3:N99)+1,\"\")","v":""}]
[98,null,null,null,null,null,null,{"$f":"IFERROR(INDEX(B!$A$3:$F$4768,MATCH(B!$A98,B!$N$3:$N$4278,0),1),\"\")","v":""},{"$f":"IFERROR(INDEX(B!$A$3:$F$4768,MATCH(B!$A98,B!$N$3:$N$4278,0),2),\"\")","v":""},{"$f":"IFERROR(INDEX(B!$A$3:$F$4768,MATCH(B!$A98,B!$N$3:$N$4278,0),3),\"\")","v":""},{"$f":"IFERROR(INDEX(B!$A$3:$F$4768,MATCH(B!$A98,B!$N$3:$N$4278,0),4),\"\")","v":""},null,null,{"$f":"IF(AND(NOT(ISERR(FIND(B!$J$5,D100))),D101>=B!$I$3,D101<=B!$I$4),COUNT($N$3:N100)+1,\"\")","v":""}]
[99,null,null,null,null,null,null,{"$f":"IFERROR(INDEX(B!$A$3:$F$4768,MATCH(B!$A99,B!$N$3:$N$4278,0),1),\"\")","v":""},{"$f":"IFERROR(INDEX(B!$A$3:$F$4768,MATCH(B!$A99,B!$N$3:$N$4278,0),2),\"\")","v":""},{"$f":"IFERROR(INDEX(B!$A$3:$F$4768,MATCH(B!$A99,B!$N$3:$N$4278,0),3),\"\")","v":""},{"$f":"IFERROR(INDEX(B!$A$3:$F$4768,MATCH(B!$A99,B!$N$3:$N$4278,0),4),\"\")","v":""},null,null,{"$f":"IF(AND(NOT(ISERR(FIND(B!$J$5,D101))),D102>=B!$I$3,D102<=B!$I$4),COUNT($N$3:N101)+1,\"\")","v":""}]
[100,null,null,null,null,null,null,{"$f":"IFERROR(INDEX(B!$A$3:$F$4768,MATCH(B!$A100,B!$N$3:$N$4278,0),1),\"\")","v":""},{"$f":"IFERROR(INDEX(B!$A$3:$F$4768,MATCH(B!$A100,B!$N$3:$N$4278,0),2),\"\")","v":""},{"$f":"IFERROR(INDEX(B!$A$3:$F$4768,MATCH(B!$A100,B!$N$3:$N$4278,0),3),\"\")","v":""},{"$f":"IFERROR(INDEX(B!$A$3:$F$4768,MATCH(B!$A100,B!$N$3:$N$4278,0),4),\"\")","v":""},null,null,{"$f":"IF(AND(NOT(ISERR(FIND(B!$J$5,D102))),D103>=B!$I$3,D103<=B!$I$4),COUNT($N$3:N102)+1,\"\")","v":""}]
[101,null,null,null,null,null,null,{"$f":"IFERROR(INDEX(B!$A$3:$F$4768,MATCH(B!$A101,B!$N$3:$N$4278,0),1),\"\")","v":""},{"$f":"IFERROR(INDEX(B!$A$3:$F$4768,MATCH(B!$A101,B!$N$3:$N$4278,0),2),\"\")","v":""},{"$f":"IFERROR(INDEX(B!$A$3:$F$4768,MATCH(B!$A101,B!$N$3:$N$4278,0),3),\"\")","v":""},{"$f":"IFERROR(INDEX(B!$A$3:$F$4768,MATCH(B!$A101,B!$N$3:$N$4278,0),4),\"\")","v":""},null,null,{"$f":"IF(AND(NOT(ISERR(FIND(B!$J$5,D103))),D104>=B!$I$3,D104<=B!$I$4),COUNT($N$3:N103)+1,\"\")","v":""}]
[102,null,null,null,null,null,null,{"$f":"IFERROR(INDEX(B!$A$3:$F$4768,MATCH(B!$A102,B!$N$3:$N$4278,0),1),\"\")","v":""},{"$f":"IFERROR(INDEX(B!$A$3:$F$4768,MATCH(B!$A102,B!$N$3:$N$4278,0),2),\"\")","v":""},{"$f":"IFERROR(INDEX(B!$A$3:$F$4768,MATCH(B!$A102,B!$N$3:$N$4278,0),3),\"\")","v":""},{"$f":"IFERROR(INDEX(B!$A$3:$F$4768,MATCH(B!$A102,B!$N$3:$N$4278,0),4),\"\")","v":""},null,null,{"$f":"IF(AND(NOT(ISERR(FIND(B!$J$5,D104))),D105>=B!$I$3,D105<=B!$I$4),COUNT($N$3:N104)+1,\"\")","v":""}]
[103,null,null,null,null,null,null,{"$f":"IFERROR(INDEX(B!$A$3:$F$4768,MATCH(B!$A103,B!$N$3:$N$4278,0),1),\"\")","v":""},{"$f":"IFERROR(INDEX(B!$A$3:$F$4768,MATCH(B!$A103,B!$N$3:$N$4278,0),2),\"\")","v":""},{"$f":"IFERROR(INDEX(B!$A$3:$F$4768,MATCH(B!$A103,B!$N$3:$N$4278,0),3),\"\")","v":""},{"$f":"IFERROR(INDEX(B!$A$3:$F$4768,MATCH(B!$A103,B!$N$3:$N$4278,0),4),\"\")","v":""},null,null,{"$f":"IF(AND(NOT(ISERR(FIND(B!$J$5,D105))),D106>=B!$I$3,D106<=B!$I$4),COUNT($N$3:N105)+1,\"\")","v":""}]
[104,null,null,null,null,null,null,{"$f":"IFERROR(INDEX(B!$A$3:$F$4768,MATCH(B!$A104,B!$N$3:$N$4278,0),1),\"\")","v":""},{"$f":"IFERROR(INDEX(B!$A$3:$F$4768,MATCH(B!$A104,B!$N$3:$N$4278,0),2),\"\")","v":""},{"$f":"IFERROR(INDEX(B!$A$3:$F$4768,MATCH(B!$A104,B!$N$3:$N$4278,0),3),\"\")","v":""},{"$f":"IFERROR(INDEX(B!$A$3:$F$4768,MATCH(B!$A104,B!$N$3:$N$4278,0),4),\"\")","v":""},null,null,{"$f":"IF(AND(NOT(ISERR(FIND(B!$J$5,D106))),D107>=B!$I$3,D107<=B!$I$4),COUNT($N$3:N106)+1,\"\")","v":""}]
[105,null,null,null,null,null,null,{"$f":"IFERROR(INDEX(B!$A$3:$F$4768,MATCH(B!$A105,B!$N$3:$N$4278,0),1),\"\")","v":""},{"$f":"IFERROR(INDEX(B!$A$3:$F$4768,MATCH(B!$A105,B!$N$3:$N$4278,0),2),\"\")","v":""},{"$f":"IFERROR(INDEX(B!$A$3:$F$4768,MATCH(B!$A105,B!$N$3:$N$4278,0),3),\"\")","v":""},{"$f":"IFERROR(INDEX(B!$A$3:$F$4768,MATCH(B!$A105,B!$N$3:$N$4278,0),4),\"\")","v":""},null,null,{"$f":"IF(AND(NOT(ISERR(FIND(B!$J$5,D107))),D108>=B!$I$3,D108<=B!$I$4),COUNT($N$3:N107)+1,\"\")","v":""}]
[106,null,null,null,null,null,null,{"$f":"IFERROR(INDEX(B!$A$3:$F$4768,MATCH(B!$A106,B!$N$3:$N$4278,0),1),\"\")","v":""},{"$f":"IFERROR(INDEX(B!$A$3:$F$4768,MATCH(B!$A106,B!$N$3:$N$4278,0),2),\"\")","v":""},{"$f":"IFERROR(INDEX(B!$A$3:$F$4768,MATCH(B!$A106,B!$N$3:$N$4278,0),3),\"\")","v":""},{"$f":"IFERROR(INDEX(B!$A$3:$F$4768,MATCH(B!$A106,B!$N$3:$N$4278,0),4),\"\")","v":""},null,null,{"$f":"IF(AND(NOT(ISERR(FIND(B!$J$5,D108))),D109>=B!$I$3,D109<=B!$I$4),COUNT($N$3:N108)+1,\"\")","v":""}]
[107,null,null,null,null,null,null,{"$f":"IFERROR(INDEX(B!$A$3:$F$4768,MATCH(B!$A107,B!$N$3:$N$4278,0),1),\"\")","v":""},{"$f":"IFERROR(INDEX(B!$A$3:$F$4768,MATCH(B!$A107,B!$N$3:$N$4278,0),2),\"\")","v":""},{"$f":"IFERROR(INDEX(B!$A$3:$F$4768,MATCH(B!$A107,B!$N$3:$N$4278,0),3),\"\")","v":""},{"$f":"IFERROR(INDEX(B!$A$3:$F$4768,MATCH(B!$A107,B!$N$3:$N$4278,0),4),\"\")","v":""},null,null,{"$f":"IF(AND(NOT(ISERR(FIND(B!$J$5,D109))),D110>=B!$I$3,D110<=B!$I$4),COUNT($N$3:N109)+1,\"\")","v":""}]
[108,null,null,null,null,null,null,{"$f":"IFERROR(INDEX(B!$A$3:$F$4768,MATCH(B!$A108,B!$N$3:$N$4278,0),1),\"\")","v":""},{"$f":"IFERROR(INDEX(B!$A$3:$F$4768,MATCH(B!$A108,B!$N$3:$N$4278,0),2),\"\")","v":""},{"$f":"IFERROR(INDEX(B!$A$3:$F$4768,MATCH(B!$A108,B!$N$3:$N$4278,0),3),\"\")","v":""},{"$f":"IFERROR(INDEX(B!$A$3:$F$4768,MATCH(B!$A108,B!$N$3:$N$4278,0),4),\"\")","v":""},null,null,{"$f":"IF(AND(NOT(ISERR(FIND(B!$J$5,D110))),D111>=B!$I$3,D111<=B!$I$4),COUNT($N$3:N110)+1,\"\")","v":""}]
[109,null,null,null,null,null,null,{"$f":"IFERROR(INDEX(B!$A$3:$F$4768,MATCH(B!$A109,B!$N$3:$N$4278,0),1),\"\")","v":""},{"$f":"IFERROR(INDEX(B!$A$3:$F$4768,MATCH(B!$A109,B!$N$3:$N$4278,0),2),\"\")","v":""},{"$f":"IFERROR(INDEX(B!$A$3:$F$4768,MATCH(B!$A109,B!$N$3:$N$4278,0),3),\"\")","v":""},{"$f":"IFERROR(INDEX(B!$A$3:$F$4768,MATCH(B!$A109,B!$N$3:$N$4278,0),4),\"\")","v":""},null,null,{"$f":"IF(AND(NOT(ISERR(FIND(B!$J$5,D111))),D112>=B!$I$3,D112<=B!$I$4),COUNT($N$3:N111)+1,\"\")","v":""}]
[110,null,null,null,null,null,null,{"$f":"IFERROR(INDEX(B!$A$3:$F$4768,MATCH(B!$A110,B!$N$3:$N$4278,0),1),\"\")","v":""},{"$f":"IFERROR(INDEX(B!$A$3:$F$4768,MATCH(B!$A110,B!$N$3:$N$4278,0),2),\"\")","v":""},{"$f":"IFERROR(INDEX(B!$A$3:$F$4768,MATCH(B!$A110,B!$N$3:$N$4278,0),3),\"\")","v":""},{"$f":"IFERROR(INDEX(B!$A$3:$F$4768,MATCH(B!$A110,B!$N$3:$N$4278,0),4),\"\")","v":""},null,null,{"$f":"IF(AND(NOT(ISERR(FIND(B!$J$5,D112))),D113>=B!$I$3,D113<=B!$I$4),COUNT($N$3:N112)+1,\"\")","v":""}]
[111,null,null,null,null,null,null,{"$f":"IFERROR(INDEX(B!$A$3:$F$4768,MATCH(B!$A111,B!$N$3:$N$4278,0),1),\"\")","v":""},{"$f":"IFERROR(INDEX(B!$A$3:$F$4768,MATCH(B!$A111,B!$N$3:$N$4278,0),2),\"\")","v":""},{"$f":"IFERROR(INDEX(B!$A$3:$F$4768,MATCH(B!$A111,B!$N$3:$N$4278,0),3),\"\")","v":""},{"$f":"IFERROR(INDEX(B!$A$3:$F$4768,MATCH(B!$A111,B!$N$3:$N$4278,0),4),\"\")","v":""},null,null,{"$f":"IF(AND(NOT(ISERR(FIND(B!$J$5,D113))),D114>=B!$I$3,D114<=B!$I$4),COUNT($N$3:N113)+1,\"\")","v":""}]
[112,null,null,null,null,null,null,{"$f":"IFERROR(INDEX(B!$A$3:$F$4768,MATCH(B!$A112,B!$N$3:$N$4278,0),1),\"\")","v":""},{"$f":"IFERROR(INDEX(B!$A$3:$F$4768,MATCH(B!$A112,B!$N$3:$N$4278,0),2),\"\")","v":""},{"$f":"IFERROR(INDEX(B!$A$3:$F$4768,MATCH(B!$A112,B!$N$3:$N$4278,0),3),\"\")","v":""},{"$f":"IFERROR(INDEX(B!$A$3:$F$4768,MATCH(B!$A112,B!$N$3:$N$4278,0),4),\"\")","v":""},null,null,{"$f":"IF(AND(NOT(ISERR(FIND(B!$J$5,D114))),D115>=B!$I$3,D115<=B!$I$4),COUNT($N$3:N114)+1,\"\")","v":""}]
[113,null,null,null,null,null,null,{"$f":"IFERROR(INDEX(B!$A$3:$F$4768,MATCH(B!$A113,B!$N$3:$N$4278,0),1),\"\")","v":""},{"$f":"IFERROR(INDEX(B!$A$3:$F$4768,MATCH(B!$A113,B!$N$3:$N$4278,0),2),\"\")","v":""},{"$f":"IFERROR(INDEX(B!$A$3:$F$4768,MATCH(B!$A113,B!$N$3:$N$4278,0),3),\"\")","v":""},{"$f":"IFERROR(INDEX(B!$A$3:$F$4768,MATCH(B!$A113,B!$N$3:$N$4278,0),4),\"\")","v":""},null,null,{"$f":"IF(AND(NOT(ISERR(FIND(B!$J$5,D115))),D116>=B!$I$3,D116<=B!$I$4),COUNT($N$3:N115)+1,\"\")","v":""}]
[114,null,null,null,null,null,null,{"$f":"IFERROR(INDEX(B!$A$3:$F$4768,MATCH(B!$A114,B!$N$3:$N$4278,0),1),\"\")","v":""},{"$f":"IFERROR(INDEX(B!$A$3:$F$4768,MATCH(B!$A114,B!$N$3:$N$4278,0),2),\"\")","v":""},{"$f":"IFERROR(INDEX(B!$A$3:$F$4768,MATCH(B!$A114,B!$N$3:$N$4278,0),3),\"\")","v":""},{"$f":"IFERROR(INDEX(B!$A$3:$F$4768,MATCH(B!$A114,B!$N$3:$N$4278,0),4),\"\")","v":""},null,null,{"$f":"IF(AND(NOT(ISERR(FIND(B!$J$5,D116))),D117>=B!$I$3,D117<=B!$I$4),COUNT($N$3:N116)+1,\"\")","v":""}]
[115,null,null,null,null,null,null,{"$f":"IFERROR(INDEX(B!$A$3:$F$4768,MATCH(B!$A115,B!$N$3:$N$4278,0),1),\"\")","v":""},{"$f":"IFERROR(INDEX(B!$A$3:$F$4768,MATCH(B!$A115,B!$N$3:$N$4278,0),2),\"\")","v":""},{"$f":"IFERROR(INDEX(B!$A$3:$F$4768,MATCH(B!$A115,B!$N$3:$N$4278,0),3),\"\")","v":""},{"$f":"IFERROR(INDEX(B!$A$3:$F$4768,MATCH(B!$A115,B!$N$3:$N$4278,0),4),\"\")","v":""},null,null,{"$f":"IF(AND(NOT(ISERR(FIND(B!$J$5,D117))),D118>=B!$I$3,D118<=B!$I$4),COUNT($N$3:N117)+1,\"\")","v":""}]
[116,null,null,null,null,null,null,{"$f":"IFERROR(INDEX(B!$A$3:$F$4768,MATCH(B!$A116,B!$N$3:$N$4278,0),1),\"\")","v":""},{"$f":"IFERROR(INDEX(B!$A$3:$F$4768,MATCH(B!$A116,B!$N$3:$N$4278,0),2),\"\")","v":""},{"$f":"IFERROR(INDEX(B!$A$3:$F$4768,MATCH(B!$A116,B!$N$3:$N$4278,0),3),\"\")","v":""},{"$f":"IFERROR(INDEX(B!$A$3:$F$4768,MATCH(B!$A116,B!$N$3:$N$4278,0),4),\"\")","v":""},null,null,{"$f":"IF(AND(NOT(ISERR(FIND(B!$J$5,D118))),D119>=B!$I$3,D119<=B!$I$4),COUNT($N$3:N118)+1,\"\")","v":""}]
[117,null,null,null,null,null,null,{"$f":"IFERROR(INDEX(B!$A$3:$F$4768,MATCH(B!$A117,B!$N$3:$N$4278,0),1),\"\")","v":""},{"$f":"IFERROR(INDEX(B!$A$3:$F$4768,MATCH(B!$A117,B!$N$3:$N$4278,0),2),\"\")","v":""},{"$f":"IFERROR(INDEX(B!$A$3:$F$4768,MATCH(B!$A117,B!$N$3:$N$4278,0),3),\"\")","v":""},{"$f":"IFERROR(INDEX(B!$A$3:$F$4768,MATCH(B!$A117,B!$N$3:$N$4278,0),4),\"\")","v":""},null,null,{"$f":"IF(AND(NOT(ISERR(FIND(B!$J$5,D119))),D120>=B!$I$3,D120<=B!$I$4),COUNT($N$3:N119)+1,\"\")","v":""}]
[118,null,null,null,null,null,null,{"$f":"IFERROR(INDEX(B!$B$3:$G$4768,MATCH(B!$G118,B!$N$3:$N$4278,0),1),\"\")","v":""},{"$f":"IFERROR(INDEX(B!$B$3:$G$4768,MATCH(B!$G118,B!$N$3:$N$4278,0),2),\"\")","v":""},{"$f":"IFERROR(INDEX(B!$B$3:$G$4768,MATCH(B!$G118,B!$N$3:$N$4278,0),3),\"\")","v":""},{"$f":"IFERROR(INDEX(B!$B$3:$G$4768,MATCH(B!$G118,B!$N$3:$N$4278,0),4),\"\")","v":""},null,null,{"$f":"IF(AND(NOT(ISERR(FIND(B!$J$5,D120))),D121>=B!$I$3,D121<=B!$I$4),COUNT($N$3:N120)+1,\"\")","v":""}]
[119,null,null,null,null,null,null,{"$f":"IFERROR(INDEX(B!$B$3:$G$4768,MATCH(B!$G119,B!$N$3:$N$4278,0),1),\"\")","v":""},{"$f":"IFERROR(INDEX(B!$B$3:$G$4768,MATCH(B!$G119,B!$N$3:$N$4278,0),2),\"\")","v":""},{"$f":"IFERROR(INDEX(B!$B$3:$G$4768,MATCH(B!$G119,B!$N$3:$N$4278,0),3),\"\")","v":""},{"$f":"IFERROR(INDEX(B!$B$3:$G$4768,MATCH(B!$G119,B!$N$3:$N$4278,0),4),\"\")","v":""},null,null,{"$f":"IF(AND(NOT(ISERR(FIND(B!$J$5,D121))),D122>=B!$I$3,D122<=B!$I$4),COUNT($N$3:N121)+1,\"\")","v":""}]
[120,null,null,null,null,null,null,{"$f":"IFERROR(INDEX(B!$B$3:$G$4768,MATCH(B!$G120,B!$N$3:$N$4278,0),1),\"\")","v":""},{"$f":"IFERROR(INDEX(B!$B$3:$G$4768,MATCH(B!$G120,B!$N$3:$N$4278,0),2),\"\")","v":""},{"$f":"IFERROR(INDEX(B!$B$3:$G$4768,MATCH(B!$G120,B!$N$3:$N$4278,0),3),\"\")","v":""},{"$f":"IFERROR(INDEX(B!$B$3:$G$4768,MATCH(B!$G120,B!$N$3:$N$4278,0),4),\"\")","v":""},null,null,{"$f":"IF(AND(NOT(ISERR(FIND(B!$J$5,D122))),D123>=B!$I$3,D123<=B!$I$4),COUNT($N$3:N122)+1,\"\")","v":""}]
[121,null,null,null,null,null,null,{"$f":"IFERROR(INDEX(B!$B$3:$G$4768,MATCH(B!$G121,B!$N$3:$N$4278,0),1),\"\")","v":""},{"$f":"IFERROR(INDEX(B!$B$3:$G$4768,MATCH(B!$G121,B!$N$3:$N$4278,0),2),\"\")","v":""},{"$f":"IFERROR(INDEX(B!$B$3:$G$4768,MATCH(B!$G121,B!$N$3:$N$4278,0),3),\"\")","v":""},{"$f":"IFERROR(INDEX(B!$B$3:$G$4768,MATCH(B!$G121,B!$N$3:$N$4278,0),4),\"\")","v":""},null,null,{"$f":"IF(AND(NOT(ISERR(FIND(B!$J$5,D123))),D124>=B!$I$3,D124<=B!$I$4),COUNT($N$3:N123)+1,\"\")","v":""}]
[null,null,null,null,null,null,null,{"$f":"IFERROR(INDEX(B!$B$3:$F$4768,MATCH(B!$B122,B!$N$3:$N$4278,0),1),\"\")","v":""},{"$f":"IFERROR(INDEX(B!$B$3:$F$4768,MATCH(B!$B122,B!$N$3:$N$4278,0),2),\"\")","v":""},{"$f":"IFERROR(INDEX(B!$B$3:$F$4768,MATCH(B!$B122,B!$N$3:$N$4278,0),3),\"\")","v":""},{"$f":"IFERROR(INDEX(B!$B$3:$F$4768,MATCH(B!$B122,B!$N$3:$N$4278,0),4),\"\")","v":""},null,null,{"$f":"IF(AND(NOT(ISERR(FIND(B!$J$5,D124))),D125>=B!$I$3,D125<=B!$I$4),COUNT($N$3:N124)+1,\"\")","v":""}]
[null,null,null,null,null,null,null,{"$f":"IFERROR(INDEX(B!$B$3:$F$4768,MATCH(B!$B123,B!$N$3:$N$4278,0),1),\"\")","v":""},{"$f":"IFERROR(INDEX(B!$B$3:$F$4768,MATCH(B!$B123,B!$N$3:$N$4278,0),2),\"\")","v":""},{"$f":"IFERROR(INDEX(B!$B$3:$F$4768,MATCH(B!$B123,B!$N$3:$N$4278,0),3),\"\")","v":""},{"$f":"IFERROR(INDEX(B!$B$3:$F$4768,MATCH(B!$B123,B!$N$3:$N$4278,0),4),\"\")","v":""},null,null,{"$f":"IF(AND(NOT(ISERR(FIND(B!$J$5,D125))),D126>=B!$I$3,D126<=B!$I$4),COUNT($N$3:N125)+1,\"\")","v":""}]
[null,null,null,null,null,null,null,{"$f":"IFERROR(INDEX(B!$B$3:$F$4768,MATCH(B!$B124,B!$N$3:$N$4278,0),1),\"\")","v":""},{"$f":"IFERROR(INDEX(B!$B$3:$F$4768,MATCH(B!$B124,B!$N$3:$N$4278,0),2),\"\")","v":""},{"$f":"IFERROR(INDEX(B!$B$3:$F$4768,MATCH(B!$B124,B!$N$3:$N$4278,0),3),\"\")","v":""},{"$f":"IFERROR(INDEX(B!$B$3:$F$4768,MATCH(B!$B124,B!$N$3:$N$4278,0),4),\"\")","v":""},null,null,{"$f":"IF(AND(NOT(ISERR(FIND(B!$J$5,D126))),D127>=B!$I$3,D127<=B!$I$4),COUNT($N$3:N126)+1,\"\")","v":""}]
[null,null,null,null,null,null,null,{"$f":"IFERROR(INDEX(B!$B$3:$F$4768,MATCH(B!$B125,B!$N$3:$N$4278,0),1),\"\")","v":""},{"$f":"IFERROR(INDEX(B!$B$3:$F$4768,MATCH(B!$B125,B!$N$3:$N$4278,0),2),\"\")","v":""},{"$f":"IFERROR(INDEX(B!$B$3:$F$4768,MATCH(B!$B125,B!$N$3:$N$4278,0),3),\"\")","v":""},{"$f":"IFERROR(INDEX(B!$B$3:$F$4768,MATCH(B!$B125,B!$N$3:$N$4278,0),4),\"\")","v":""},null,null,{"$f":"IF(AND(NOT(ISERR(FIND(B!$J$5,D127))),D128>=B!$I$3,D128<=B!$I$4),COUNT($N$3:N127)+1,\"\")","v":""}]
[null,null,null,null,null,null,null,{"$f":"IFERROR(INDEX(B!$B$3:$F$4768,MATCH(B!$B126,B!$N$3:$N$4278,0),1),\"\")","v":""},{"$f":"IFERROR(INDEX(B!$B$3:$F$4768,MATCH(B!$B126,B!$N$3:$N$4278,0),2),\"\")","v":""},{"$f":"IFERROR(INDEX(B!$B$3:$F$4768,MATCH(B!$B126,B!$N$3:$N$4278,0),3),\"\")","v":""},{"$f":"IFERROR(INDEX(B!$B$3:$F$4768,MATCH(B!$B126,B!$N$3:$N$4278,0),4),\"\")","v":""},null,null,{"$f":"IF(AND(NOT(ISERR(FIND(B!$J$5,D128))),D129>=B!$I$3,D129<=B!$I$4),COUNT($N$3:N128)+1,\"\")","v":""}]
[null,null,null,null,null,null,null,{"$f":"IFERROR(INDEX(B!$B$3:$F$4768,MATCH(B!$B127,B!$N$3:$N$4278,0),1),\"\")","v":""},{"$f":"IFERROR(INDEX(B!$B$3:$F$4768,MATCH(B!$B127,B!$N$3:$N$4278,0),2),\"\")","v":""},{"$f":"IFERROR(INDEX(B!$B$3:$F$4768,MATCH(B!$B127,B!$N$3:$N$4278,0),3),\"\")","v":""},{"$f":"IFERROR(INDEX(B!$B$3:$F$4768,MATCH(B!$B127,B!$N$3:$N$4278,0),4),\"\")","v":""},null,null,{"$f":"IF(AND(NOT(ISERR(FIND(B!$J$5,D129))),D130>=B!$I$3,D130<=B!$I$4),COUNT($N$3:N129)+1,\"\")","v":""}]
[null,null,null,null,null,null,null,null,null,null,null,null,null,{"$f":"IF(AND(NOT(ISERR(FIND(B!$J$5,D130))),D131>=B!$I$3,D131<=B!$I$4),COUNT($N$3:N130)+1,\"\")","v":""}]
[null,null,null,null,null,null,null,null,null,null,null,null,null,{"$f":"IF(AND(NOT(ISERR(FIND(B!$J$5,D131))),D132>=B!$I$3,D132<=B!$I$4),COUNT($N$3:N131)+1,\"\")","v":""}]
[null,null,null,null,null,null,null,null,null,null,null,null,null,{"$f":"IF(AND(NOT(ISERR(FIND(B!$J$5,D132))),D133>=B!$I$3,D133<=B!$I$4),COUNT($AI$3:AI144)+1,\"\")","v":""}]
[null,null,null,null,null,null,null,null,null,null,null,null,null,{"$f":"IF(AND(NOT(ISERR(FIND(B!$J$5,D133))),D134>=B!$I$3,D134<=B!$I$4),COUNT($AI$3:AI145)+1,\"\")","v":""}]
[null,null,null,null,null,null,null,null,null,null,null,null,null,{"$f":"IF(AND(NOT(ISERR(FIND(B!$J$5,D134))),D135>=B!$I$3,D135<=B!$I$4),COUNT($AI$3:AI146)+1,\"\")","v":""}]
[null,null,null,null,null,null,null,null,null,null,null,null,null,{"$f":"IF(AND(NOT(ISERR(FIND(B!$J$5,D135))),D136>=B!$I$3,D136<=B!$I$4),COUNT($AI$3:AI147)+1,\"\")","v":""}]

{"sheet":"Sheet1","index":2,"n_rows":0,"n_cols":0,"rows_kept":0,"cut":false,"hidden":false,"merged":[]}