{"text_format":"1","workbook":"xlsx","n_sheets":4,"sheets":["المبيعات ","المشتريات ","المخزن","العملاء"],"not_rendered":{"charts":0,"images":0,"macros":0,"external_links":1,"defined_names":0,"comments":0,"pivot_tables":0},"unopened":[],"bounds":{"document_bytes":16777216,"sheet_cells":100000,"rows_first":2000,"rows_last":500,"rows_between":2000,"halvings":0,"cell_chars":16384,"cell_head_chars":4096},"cells_cut":0,"cells_raw":0,"read":"whole","date_system":"1900"}

{"sheet":"المبيعات ","index":0,"n_rows":10,"n_cols":12,"rows_kept":10,"cut":false,"hidden":false,"merged":[[0,0,1,0],[0,1,1,1],[0,2,1,2],[0,4,1,4],[0,5,1,5]]}
["تاريخ","كود العميل","أسم العميل","كود الصنف","الصنف","كمية","سعر البيع",null,null,null,null,"باقي"]
[null,null,null,null,null,null,null,"قيمة المباع ","الشراء ","الجملة ","الربح ","الصنف"]
["2022-03-10",1,{"$f":"IF(B3=\"\",\"\",VLOOKUP(B3,العملاء!A:B,2,0))","v":"نقدى 1"},621,{"$f":"IF(D3=\"\",\"\",VLOOKUP(D3,المخزن!A:B,2,0))","v":"شبسى 5 ج بالشطة * 12"},15,10,10,{"$f":"IF(D3=\"\",\"\",VLOOKUP(D3,المخزن!A:D,4,0))","v":1.6666666666666667},{"$f":"IF(D3>0,I3*F3,\"  \")","v":25},{"$f":"IF(E3=\"\",\"\",H3-J3)","v":-15},{"$f":"IF(D3=\"\",\"\",VLOOKUP(D3,المخزن!A:K,8,0))","v":47}]
["2022-03-10",1,{"$f":"IF(B4=\"\",\"\",VLOOKUP(B4,العملاء!A:B,2,0))","v":"نقدى 1"},508,{"$f":"IF(D4=\"\",\"\",VLOOKUP(D4,المخزن!A:B,2,0))","v":"شيكولاته اتش دى 1 ج * 12"},2,11,11,{"$f":"IF(D4=\"\",\"\",VLOOKUP(D4,المخزن!A:D,4,0))","v":3},6,{"$f":"IF(E4=\"\",\"\",H4-J4)","v":5},{"$f":"IF(D4=\"\",\"\",VLOOKUP(D4,المخزن!A:K,8,0))","v":39}]
["2022-03-10",1,{"$f":"IF(B5=\"\",\"\",VLOOKUP(B5,العملاء!A:B,2,0))","v":"نقدى 1"},201,{"$f":"IF(D5=\"\",\"\",VLOOKUP(D5,المخزن!A:B,2,0))","v":"يسكويت فرى 2 ج ك 6 علبة   * 12"},3,12,12,{"$f":"IF(D5=\"\",\"\",VLOOKUP(D5,المخزن!A:D,4,0))","v":4},12,{"$f":"IF(E5=\"\",\"\",H5-J5)","v":0},{"$f":"IF(D5=\"\",\"\",VLOOKUP(D5,المخزن!A:K,8,0))","v":40}]
["2022-03-10",1,{"$f":"IF(B6=\"\",\"\",VLOOKUP(B6,العملاء!A:B,2,0))","v":"نقدى 1"},191,{"$f":"IF(D6=\"\",\"\",VLOOKUP(D6,المخزن!A:B,2,0))","v":"بسكويت  فيرى 5 ج *6 "},4,13,13,{"$f":"IF(D6=\"\",\"\",VLOOKUP(D6,المخزن!A:D,4,0))","v":7.083333333333333},28.333333333333332,{"$f":"IF(E6=\"\",\"\",H6-J6)","v":-15.333333333333332},{"$f":"IF(D6=\"\",\"\",VLOOKUP(D6,المخزن!A:K,8,0))","v":47}]
["2022-03-10",1,{"$f":"IF(B7=\"\",\"\",VLOOKUP(B7,العملاء!A:B,2,0))","v":"نقدى 1"},559,{"$f":"IF(D7=\"\",\"\",VLOOKUP(D7,المخزن!A:B,2,0))","v":"لبان نيمو*48"},5,14,14,{"$f":"IF(D7=\"\",\"\",VLOOKUP(D7,المخزن!A:D,4,0))","v":12.5},62.5,{"$f":"IF(E7=\"\",\"\",H7-J7)","v":-48.5},{"$f":"IF(D7=\"\",\"\",VLOOKUP(D7,المخزن!A:K,8,0))","v":6}]
["2022-03-10",1,{"$f":"IF(B8=\"\",\"\",VLOOKUP(B8,'[1]العملاء '!A:B,2,0))","v":"نقدى"},482,{"$f":"IF(D8=\"\",\"\",VLOOKUP(D8,المخزن!A:B,2,0))","v":"سجائر يوكس "},6,15,15,{"$f":"IF(D8=\"\",\"\",VLOOKUP(D8,المخزن!A:D,4,0))","v":21.25},127.5,-112.5,{"$f":"IF(D8=\"\",\"\",VLOOKUP(D8,المخزن!A:K,8,0))","v":16}]
["2022-03-10",1,{"$f":"IF(B9=\"\",\"\",VLOOKUP(B9,'[1]العملاء '!A:B,2,0))","v":"نقدى"},682,{"$f":"IF(D9=\"\",\"\",VLOOKUP(D9,المخزن!A:B,2,0))","v":"شبسى جبنه متبلة 2ج * 15"},7,16,16,{"$f":"IF(D9=\"\",\"\",VLOOKUP(D9,المخزن!A:D,4,0))","v":1.5833333333333333},11.083333333333332,4.9166666666666679,{"$f":"IF(D9=\"\",\"\",VLOOKUP(D9,المخزن!A:K,8,0))","v":56}]
["2022-03-10",1,{"$f":"IF(B10=\"\",\"\",VLOOKUP(B10,'[1]العملاء '!A:B,2,0))","v":"نقدى"},726,{"$f":"IF(D10=\"\",\"\",VLOOKUP(D10,المخزن!A:B,2,0))","v":"شبسى طماطم 1 ج * 24"},8,17,17,{"$f":"IF(D10=\"\",\"\",VLOOKUP(D10,المخزن!A:D,4,0))","v":2.4166666666666665},{"$f":"IF(D10>0,I10*F10,\"  \")","v":19.333333333333332},-2.3333333333333321,{"$f":"IF(D10=\"\",\"\",VLOOKUP(D10,المخزن!A:K,8,0))","v":9}]

{"sheet":"المشتريات ","index":1,"n_rows":10,"n_cols":9,"rows_kept":10,"cut":false,"hidden":false,"merged":[[0,0,1,0],[0,1,1,1],[0,2,1,2],[0,3,1,3],[0,5,1,5],[0,7,1,7]]}
["تاريخ","بيــــــــــــــــــان","كود المورد","أسم المورد","كود الصنف","أسم الصنف",null,"سعرالشراء ","قيمة"]
[null,null,null,null,null,null,"كمية",null,{"$f":"SUM(I3:I999)","v":1567.5}]
["2022-03-01",null,null,null,621,{"$f":"IF(E3=\"\",\"\",VLOOKUP(E3,المخزن!A:B,2,0))","v":"شبسى 5 ج بالشطة * 12"},24,{"$f":"IF(E3=\"\",\"\",VLOOKUP(E3,المخزن!A:D,4,0))","v":1.6666666666666667},{"$f":"IF(F3=\"\",\"\",H3*G3)","v":40}]
["2022-03-01",null,null,null,508,{"$f":"IF(E4=\"\",\"\",VLOOKUP(E4,المخزن!A:B,2,0))","v":"شيكولاته اتش دى 1 ج * 12"},12,{"$f":"IF(E4=\"\",\"\",VLOOKUP(E4,المخزن!A:D,4,0))","v":3},{"$f":"IF(F4=\"\",\"\",H4*G4)","v":36}]
["2022-03-01",null,null,null,201,{"$f":"IF(E5=\"\",\"\",VLOOKUP(E5,المخزن!A:B,2,0))","v":"يسكويت فرى 2 ج ك 6 علبة   * 12"},12,{"$f":"IF(E5=\"\",\"\",VLOOKUP(E5,المخزن!A:D,4,0))","v":4},48]
["2022-03-01",null,null,null,191,{"$f":"IF(E6=\"\",\"\",VLOOKUP(E6,المخزن!A:B,2,0))","v":"بسكويت  فيرى 5 ج *6 "},15,{"$f":"IF(E6=\"\",\"\",VLOOKUP(E6,المخزن!A:D,4,0))","v":7.083333333333333},106.25]
["2022-03-01",null,null,null,559,{"$f":"IF(E7=\"\",\"\",VLOOKUP(E7,المخزن!A:B,2,0))","v":"لبان نيمو*48"},15,{"$f":"IF(E7=\"\",\"\",VLOOKUP(E7,المخزن!A:D,4,0))","v":12.5},187.5]
["2022-03-11",null,null,null,482,{"$f":"IF(E8=\"\",\"\",VLOOKUP(E8,المخزن!A:B,2,0))","v":"سجائر يوكس "},27,{"$f":"IF(E8=\"\",\"\",VLOOKUP(E8,المخزن!A:D,4,0))","v":21.25},573.75]
["2022-03-11",null,null,null,682,{"$f":"IF(E9=\"\",\"\",VLOOKUP(E9,المخزن!A:B,2,0))","v":"شبسى جبنه متبلة 2ج * 15"},144,{"$f":"IF(E9=\"\",\"\",VLOOKUP(E9,المخزن!A:D,4,0))","v":1.5833333333333333},228]
["2022-03-11",null,null,null,726,{"$f":"IF(E10=\"\",\"\",VLOOKUP(E10,المخزن!A:B,2,0))","v":"شبسى طماطم 1 ج * 24"},144,{"$f":"IF(E10=\"\",\"\",VLOOKUP(E10,المخزن!A:D,4,0))","v":2.4166666666666665},348]

{"sheet":"المخزن","index":2,"n_rows":9,"n_cols":13,"rows_kept":9,"cut":false,"hidden":false,"merged":[]}
["الصنف","اسم الصنف       ","رصيد أول المدة","سعر المفرد","قيمة","وارد ","صادر","رصيد أخرالمدة","جملة المخزن ","متوسط سعر الوحدة   ","ربح الصنف",null,"البيع"]
[621,"شبسى 5 ج بالشطة * 12",50,1.6666666666666667,{"$f":"IF(C2+D2>0,D2*C2,\"  \")","v":83.333333333333343},{"$f":"SUMIF([1]المشتريات!E:E,A2,[1]المشتريات!G:G)","v":12},{"$f":"SUMIF('المبيعات '!D:D,A2,'المبيعات '!F:F)","v":15},{"$f":"(C2++F2)-(G2)","v":47},{"$f":"H2*D2","v":78.333333333333343},{"$f":"IF(C2<>0,D2/1,\"\")","v":1.6666666666666667},{"$f":"SUMIF('[1]المبيعات '!D:D,A2,'[1]المبيعات '!K:K)","v":5.4166666666666714},null,2]
[508,"شيكولاته اتش دى 1 ج * 12",51,3,153,{"$f":"SUMIF([1]المشتريات!E:E,A3,[1]المشتريات!G:G)","v":0},{"$f":"SUMIF('[1]المبيعات '!D:D,A3,'[1]المبيعات '!F:F)","v":12},{"$f":"(C3++F3)-(G3)","v":39},{"$f":"H3*D3","v":117},{"$f":"IF(C3<>0,D3/1,\"\")","v":3},{"$f":"SUMIF('[1]المبيعات '!D:D,A3,'[1]المبيعات '!K:K)","v":2},null,3]
[201,"يسكويت فرى 2 ج ك 6 علبة   * 12",52,4,208,{"$f":"SUMIF([1]المشتريات!E:E,A4,[1]المشتريات!G:G)","v":0},{"$f":"SUMIF('[1]المبيعات '!D:D,A4,'[1]المبيعات '!F:F)","v":12},40,160,4,{"$f":"SUMIF('[1]المبيعات '!D:D,A4,'[1]المبيعات '!K:K)","v":3.1666666666666679},null,5]
[191,"بسكويت  فيرى 5 ج *6 ",53,7.083333333333333,375.41666666666663,{"$f":"SUMIF([1]المشتريات!E:E,A5,[1]المشتريات!G:G)","v":0},{"$f":"SUMIF('[1]المبيعات '!D:D,A5,'[1]المبيعات '!F:F)","v":6},47,332.91666666666663,7.083333333333333,{"$f":"SUMIF('[1]المبيعات '!D:D,A5,'[1]المبيعات '!K:K)","v":5},null,10]
[559,"لبان نيمو*48",54,12.5,675,{"$f":"SUMIF([1]المشتريات!E:E,A6,[1]المشتريات!G:G)","v":0},{"$f":"SUMIF('[1]المبيعات '!D:D,A6,'[1]المبيعات '!F:F)","v":48},6,75,12.5,{"$f":"SUMIF('[1]المبيعات '!D:D,A6,'[1]المبيعات '!K:K)","v":2},null,15]
[482,"سجائر يوكس ",55,21.25,1168.75,{"$f":"SUMIF([1]المشتريات!E:E,A7,[1]المشتريات!G:G)","v":0},{"$f":"SUMIF('[1]المبيعات '!D:D,A7,'[1]المبيعات '!F:F)","v":39},16,340,21.25,{"$f":"SUMIF('[1]المبيعات '!D:D,A7,'[1]المبيعات '!K:K)","v":31.200000000000017},null,25]
[682,"شبسى جبنه متبلة 2ج * 15",56,1.5833333333333333,88.666666666666657,{"$f":"SUMIF([1]المشتريات!E:E,A8,[1]المشتريات!G:G)","v":15},{"$f":"SUMIF('[1]المبيعات '!D:D,A8,'[1]المبيعات '!F:F)","v":15},56,88.666666666666657,1.5833333333333333,{"$f":"SUMIF('[1]المبيعات '!D:D,A8,'[1]المبيعات '!K:K)","v":3.5},null,2]
[726,"شبسى طماطم 1 ج * 24",57,2.4166666666666665,137.75,{"$f":"SUMIF([1]المشتريات!E:E,A9,[1]المشتريات!G:G)","v":0},{"$f":"SUMIF('[1]المبيعات '!D:D,A9,'[1]المبيعات '!F:F)","v":48},9,21.75,2.4166666666666665,{"$f":"SUMIF('[1]المبيعات '!D:D,A9,'[1]المبيعات '!K:K)","v":6},null,3]

{"sheet":"العملاء","index":3,"n_rows":9,"n_cols":5,"rows_kept":9,"cut":false,"hidden":false,"merged":[[0,0,2,0],[0,1,2,1],[0,2,0,3]]}
["كود العميل ","أسم العميل      ","حركة الفترة           ",null,"رصيد أخر المدة   "]
[null,null,{"$f":"SUM(C4:C2001)","v":5077.25},0,{"$f":"SUM(E4:E150)","v":5077.25}]
[null,null,"مبيعات ","سدد","الباقى "]
[1,"نقدى 1",{"$f":"SUMIF('[1]المبيعات '!B:B,A4,'[1]المبيعات '!H:H)","v":4907},{"$f":"SUMIF('[1]متحصلات العملاء'!C:C,A4,'[1]متحصلات العملاء'!E:E)","v":0},{"$f":"C4-D4","v":4907}]
[2,"نقدى 2",{"$f":"SUMIF('[1]المبيعات '!B:B,A5,'[1]المبيعات '!H:H)","v":0},{"$f":"SUMIF('[1]متحصلات العملاء'!C:C,A5,'[1]متحصلات العملاء'!E:E)","v":0},{"$f":"C5-D5","v":0}]
[3,"نقدى 3",{"$f":"SUMIF('[1]المبيعات '!B:B,A6,'[1]المبيعات '!H:H)","v":15.25},{"$f":"SUMIF('[1]متحصلات العملاء'!C:C,A6,'[1]متحصلات العملاء'!E:E)","v":0},15.25]
[4,"نقدى 4",{"$f":"SUMIF('[1]المبيعات '!B:B,A7,'[1]المبيعات '!H:H)","v":0},{"$f":"SUMIF('[1]متحصلات العملاء'!C:C,A7,'[1]متحصلات العملاء'!E:E)","v":0},0]
[5,"نقدى 5",{"$f":"SUMIF('[1]المبيعات '!B:B,A8,'[1]المبيعات '!H:H)","v":0},{"$f":"SUMIF('[1]متحصلات العملاء'!C:C,A8,'[1]متحصلات العملاء'!E:E)","v":0},0]
[6,"نقدى 6",{"$f":"SUMIF('[1]المبيعات '!B:B,A9,'[1]المبيعات '!H:H)","v":155},{"$f":"SUMIF('[1]متحصلات العملاء'!C:C,A9,'[1]متحصلات العملاء'!E:E)","v":0},155]