{"text_format":"1","workbook":"xlsx","n_sheets":3,"sheets":["Mowazaf","Absent","Bulletin"],"not_rendered":{"charts":0,"images":1,"macros":1,"external_links":1,"defined_names":7,"comments":0,"pivot_tables":0},"unopened":[],"bounds":{"document_bytes":16777216,"sheet_cells":100000,"rows_first":2000,"rows_last":500,"rows_between":2000,"halvings":0,"cell_chars":16384,"cell_head_chars":4096},"cells_cut":0,"cells_raw":0,"read":"whole","date_system":"1900"}

{"sheet":"Mowazaf","index":0,"n_rows":108,"n_cols":8,"rows_kept":108,"cut":false,"hidden":false,"merged":[]}
[]
[]
[]
[]
[]
[]
[]
["الترتيب","كود الموظف","الاسم","اللقب","الجنس","تاريخ الميلاد","الوظيفة"]
[1,11243970,"محمد","الجزائر","ذكر","1986-07-12","كاتب",{"$f":"C9&\"  \"&D9","v":"محمد  الجزائر"}]
[2,11243971,"الوليد","تونس ","ذكر","1986-07-13","مراقب",{"$f":"C10&\"  \"&D10","v":"الوليد  تونس "}]
[3,11243972,"أحمد","المغرب","ذكر","1986-07-14","مهندس","أحمد  المغرب"]
[4,null,null,null,null,null,null,"  "]
[5,null,null,null,null,null,null,"  "]
[6,null,null,null,null,null,null,"  "]
[7,null,null,null,null,null,null,"  "]
[8,null,null,null,null,null,null,"  "]
[9,null,null,null,null,null,null,"  "]
[10,null,null,null,null,null,null,"  "]
[11,null,null,null,null,null,null,"  "]
[12,null,null,null,null,null,null,"  "]
[13,null,null,null,null,null,null,"  "]
[14,null,null,null,null,null,null,"  "]
[15,null,null,null,null,null,null,"  "]
[16,null,null,null,null,null,null,"  "]
[17,null,null,null,null,null,null,"  "]
[18,null,null,null,null,null,null,"  "]
[19,null,null,null,null,null,null,"  "]
[20,null,null,null,null,null,null,"  "]
[21,null,null,null,null,null,null,"  "]
[22,null,null,null,null,null,null,"  "]
[23,null,null,null,null,null,null,"  "]
[24,null,null,null,null,null,null,"  "]
[25,null,null,null,null,null,null,"  "]
[26,null,null,null,null,null,null,"  "]
[27,null,null,null,null,null,null,"  "]
[28,null,null,null,null,null,null,"  "]
[29,null,null,null,null,null,null,"  "]
[30,null,null,null,null,null,null,"  "]
[31,null,null,null,null,null,null,"  "]
[32,null,null,null,null,null,null,"  "]
{"$rows_left_out":69}
{"sheet":"Absent","index":1,"n_rows":107,"n_cols":14,"rows_kept":107,"cut":false,"hidden":false,"merged":[[0,4,0,11],[1,4,1,11],[5,6,5,13],[5,0,5,5]]}
[]
[]
[]
[]
[]
["البحث عن موظف",null,null,null,null,null,"رصــــــــــــــد الغــــــــــــــــــــــــياب أو التأخـــــــــــــــــــــــــر"]
["الترتيب","كود الموظف","الاسم و اللقب","الجنس","تاريخ الميلاد","الوظيفة","غياب شهر","تاريخ الغياب / تأخر","التوقيت","العودة من الغياب/ تأخر","التوقيت","المدة","تبرير","قرار المدير"]
[2,{"$f":"IFERROR(\" \"&VLOOKUP($A8,Mowazaf!$A$9:$H$11,2,FALSE),\"\")","v":" 11243971"},{"$f":"IFERROR(\" \"&VLOOKUP($A8,Mowazaf!$A$9:$H$11,8,FALSE),\"\")","v":" الوليد  تونس "},{"$f":"IFERROR(\" \"&VLOOKUP($A8,Mowazaf!$A$9:$H$11,5,FALSE),\"\")","v":" ذكر"},{"$f":"IFERROR(VLOOKUP($A8,Mowazaf!$A$9:$H$11,6,FALSE),\"\")","v":"1986-07-13"},{"$f":"IFERROR(\" \"&VLOOKUP($A8,Mowazaf!$A$9:$H$11,7,FALSE),\"\")","v":" مراقب"},"مارس","2022-03-03","08:00:00","2022-03-03","12:00:00","نصف يوم","أمر شخصي","خصم"]
[1,{"$f":"IFERROR(\" \"&VLOOKUP($A9,Mowazaf!$A$9:$H$11,2,FALSE),\"\")","v":" 11243970"},{"$f":"IFERROR(\" \"&VLOOKUP($A9,Mowazaf!$A$9:$H$11,8,FALSE),\"\")","v":" محمد  الجزائر"},{"$f":"IFERROR(\" \"&VLOOKUP($A9,Mowazaf!$A$9:$H$11,5,FALSE),\"\")","v":" ذكر"},{"$f":"IFERROR(VLOOKUP($A9,Mowazaf!$A$9:$H$11,6,FALSE),\"\")","v":"1986-07-12"},{"$f":"IFERROR(\" \"&VLOOKUP($A9,Mowazaf!$A$9:$H$11,7,FALSE),\"\")","v":" كاتب"},"مارس","2022-03-04","09:00:00","2022-03-06","09:00:00","2 يوم","عطلة مرضية","بدون خصم"]
[3,{"$f":"IFERROR(\" \"&VLOOKUP($A10,Mowazaf!$A$9:$H$11,2,FALSE),\"\")","v":" 11243972"},{"$f":"IFERROR(\" \"&VLOOKUP($A10,Mowazaf!$A$9:$H$11,8,FALSE),\"\")","v":" أحمد  المغرب"},{"$f":"IFERROR(\" \"&VLOOKUP($A10,Mowazaf!$A$9:$H$11,5,FALSE),\"\")","v":" ذكر"},{"$f":"IFERROR(VLOOKUP($A10,Mowazaf!$A$9:$H$11,6,FALSE),\"\")","v":"1986-07-14"},{"$f":"IFERROR(\" \"&VLOOKUP($A10,Mowazaf!$A$9:$H$11,7,FALSE),\"\")","v":" مهندس"},"مارس","2022-03-05","10:00:00","2022-03-06","10:00:00","1 يوم","سفــــــر","خصم"]
[3,{"$f":"IFERROR(\" \"&VLOOKUP($A11,Mowazaf!$A$9:$H$11,2,FALSE),\"\")","v":" 11243972"},{"$f":"IFERROR(\" \"&VLOOKUP($A11,Mowazaf!$A$9:$H$11,8,FALSE),\"\")","v":" أحمد  المغرب"},{"$f":"IFERROR(\" \"&VLOOKUP($A11,Mowazaf!$A$9:$H$11,5,FALSE),\"\")","v":" ذكر"},{"$f":"IFERROR(VLOOKUP($A11,Mowazaf!$A$9:$H$11,6,FALSE),\"\")","v":"1986-07-14"},{"$f":"IFERROR(\" \"&VLOOKUP($A11,Mowazaf!$A$9:$H$11,7,FALSE),\"\")","v":" مهندس"},"مارس","2022-03-06","11:00:00","2022-03-07","11:00:00","1 يوم","سفــــــر","خصم"]
[2,{"$f":"IFERROR(\" \"&VLOOKUP($A12,Mowazaf!$A$9:$H$11,2,FALSE),\"\")","v":" 11243971"},{"$f":"IFERROR(\" \"&VLOOKUP($A12,Mowazaf!$A$9:$H$11,8,FALSE),\"\")","v":" الوليد  تونس "},{"$f":"IFERROR(\" \"&VLOOKUP($A12,Mowazaf!$A$9:$H$11,5,FALSE),\"\")","v":" ذكر"},{"$f":"IFERROR(VLOOKUP($A12,Mowazaf!$A$9:$H$11,6,FALSE),\"\")","v":"1986-07-13"},{"$f":"IFERROR(\" \"&VLOOKUP($A12,Mowazaf!$A$9:$H$11,7,FALSE),\"\")","v":" مراقب"},"أبريل","2022-04-07","12:00:00","2022-04-08","12:00:00","1 يوم","سفــــــر","خصم"]
[1,{"$f":"IFERROR(\" \"&VLOOKUP($A13,Mowazaf!$A$9:$H$11,2,FALSE),\"\")","v":" 11243970"},{"$f":"IFERROR(\" \"&VLOOKUP($A13,Mowazaf!$A$9:$H$11,8,FALSE),\"\")","v":" محمد  الجزائر"},{"$f":"IFERROR(\" \"&VLOOKUP($A13,Mowazaf!$A$9:$H$11,5,FALSE),\"\")","v":" ذكر"},{"$f":"IFERROR(VLOOKUP($A13,Mowazaf!$A$9:$H$11,6,FALSE),\"\")","v":"1986-07-12"},{"$f":"IFERROR(\" \"&VLOOKUP($A13,Mowazaf!$A$9:$H$11,7,FALSE),\"\")","v":" كاتب"},"أبريل","2022-04-08","13:00:00","2022-04-09","13:00:00","1 يوم","عطلة مرضية","بدون خصم"]
[null,{"$f":"IFERROR(\" \"&VLOOKUP($A14,Mowazaf!$A$9:$H$11,2,FALSE),\"\")","v":""},{"$f":"IFERROR(\" \"&VLOOKUP($A14,Mowazaf!$A$9:$H$11,8,FALSE),\"\")","v":""},{"$f":"IFERROR(\" \"&VLOOKUP($A14,Mowazaf!$A$9:$H$11,5,FALSE),\"\")","v":""},{"$f":"IFERROR(VLOOKUP($A14,Mowazaf!$A$9:$H$11,6,FALSE),\"\")","v":""},{"$f":"IFERROR(\" \"&VLOOKUP($A14,Mowazaf!$A$9:$H$11,7,FALSE),\"\")","v":""},null,null,null,null,null,null,null,{"$f":"IF(ISBLANK(H14),\"\",(YEAR(NOW())-(YEAR(H14))))","v":""}]
[null,{"$f":"IFERROR(\" \"&VLOOKUP($A15,Mowazaf!$A$9:$H$11,2,FALSE),\"\")","v":""},{"$f":"IFERROR(\" \"&VLOOKUP($A15,Mowazaf!$A$9:$H$11,8,FALSE),\"\")","v":""},{"$f":"IFERROR(\" \"&VLOOKUP($A15,Mowazaf!$A$9:$H$11,5,FALSE),\"\")","v":""},{"$f":"IFERROR(VLOOKUP($A15,Mowazaf!$A$9:$H$11,6,FALSE),\"\")","v":""},{"$f":"IFERROR(\" \"&VLOOKUP($A15,Mowazaf!$A$9:$H$11,7,FALSE),\"\")","v":""},null,null,null,null,null,null,null,""]
[null,{"$f":"IFERROR(\" \"&VLOOKUP($A16,Mowazaf!$A$9:$H$11,2,FALSE),\"\")","v":""},{"$f":"IFERROR(\" \"&VLOOKUP($A16,Mowazaf!$A$9:$H$11,8,FALSE),\"\")","v":""},{"$f":"IFERROR(\" \"&VLOOKUP($A16,Mowazaf!$A$9:$H$11,5,FALSE),\"\")","v":""},{"$f":"IFERROR(VLOOKUP($A16,Mowazaf!$A$9:$H$11,6,FALSE),\"\")","v":""},{"$f":"IFERROR(\" \"&VLOOKUP($A16,Mowazaf!$A$9:$H$11,7,FALSE),\"\")","v":""},null,null,null,null,null,null,null,""]
[null,{"$f":"IFERROR(\" \"&VLOOKUP($A17,Mowazaf!$A$9:$H$11,2,FALSE),\"\")","v":""},{"$f":"IFERROR(\" \"&VLOOKUP($A17,Mowazaf!$A$9:$H$11,8,FALSE),\"\")","v":""},{"$f":"IFERROR(\" \"&VLOOKUP($A17,Mowazaf!$A$9:$H$11,5,FALSE),\"\")","v":""},{"$f":"IFERROR(VLOOKUP($A17,Mowazaf!$A$9:$H$11,6,FALSE),\"\")","v":""},{"$f":"IFERROR(\" \"&VLOOKUP($A17,Mowazaf!$A$9:$H$11,7,FALSE),\"\")","v":""},null,null,null,null,null,null,null,""]
[null,{"$f":"IFERROR(\" \"&VLOOKUP($A18,Mowazaf!$A$9:$H$11,2,FALSE),\"\")","v":""},{"$f":"IFERROR(\" \"&VLOOKUP($A18,Mowazaf!$A$9:$H$11,8,FALSE),\"\")","v":""},{"$f":"IFERROR(\" \"&VLOOKUP($A18,Mowazaf!$A$9:$H$11,5,FALSE),\"\")","v":""},{"$f":"IFERROR(VLOOKUP($A18,Mowazaf!$A$9:$H$11,6,FALSE),\"\")","v":""},{"$f":"IFERROR(\" \"&VLOOKUP($A18,Mowazaf!$A$9:$H$11,7,FALSE),\"\")","v":""},null,null,null,null,null,null,null,""]
[null,{"$f":"IFERROR(\" \"&VLOOKUP($A19,Mowazaf!$A$9:$H$11,2,FALSE),\"\")","v":""},{"$f":"IFERROR(\" \"&VLOOKUP($A19,Mowazaf!$A$9:$H$11,8,FALSE),\"\")","v":""},{"$f":"IFERROR(\" \"&VLOOKUP($A19,Mowazaf!$A$9:$H$11,5,FALSE),\"\")","v":""},{"$f":"IFERROR(VLOOKUP($A19,Mowazaf!$A$9:$H$11,6,FALSE),\"\")","v":""},{"$f":"IFERROR(\" \"&VLOOKUP($A19,Mowazaf!$A$9:$H$11,7,FALSE),\"\")","v":""},null,null,null,null,null,null,null,""]
[null,{"$f":"IFERROR(\" \"&VLOOKUP($A20,Mowazaf!$A$9:$H$11,2,FALSE),\"\")","v":""},{"$f":"IFERROR(\" \"&VLOOKUP($A20,Mowazaf!$A$9:$H$11,8,FALSE),\"\")","v":""},{"$f":"IFERROR(\" \"&VLOOKUP($A20,Mowazaf!$A$9:$H$11,5,FALSE),\"\")","v":""},{"$f":"IFERROR(VLOOKUP($A20,Mowazaf!$A$9:$H$11,6,FALSE),\"\")","v":""},{"$f":"IFERROR(\" \"&VLOOKUP($A20,Mowazaf!$A$9:$H$11,7,FALSE),\"\")","v":""},null,null,null,null,null,null,null,""]
[null,{"$f":"IFERROR(\" \"&VLOOKUP($A21,Mowazaf!$A$9:$H$11,2,FALSE),\"\")","v":""},{"$f":"IFERROR(\" \"&VLOOKUP($A21,Mowazaf!$A$9:$H$11,8,FALSE),\"\")","v":""},{"$f":"IFERROR(\" \"&VLOOKUP($A21,Mowazaf!$A$9:$H$11,5,FALSE),\"\")","v":""},{"$f":"IFERROR(VLOOKUP($A21,Mowazaf!$A$9:$H$11,6,FALSE),\"\")","v":""},{"$f":"IFERROR(\" \"&VLOOKUP($A21,Mowazaf!$A$9:$H$11,7,FALSE),\"\")","v":""},null,null,null,null,null,null,null,""]
[null,{"$f":"IFERROR(\" \"&VLOOKUP($A22,Mowazaf!$A$9:$H$11,2,FALSE),\"\")","v":""},{"$f":"IFERROR(\" \"&VLOOKUP($A22,Mowazaf!$A$9:$H$11,8,FALSE),\"\")","v":""},{"$f":"IFERROR(\" \"&VLOOKUP($A22,Mowazaf!$A$9:$H$11,5,FALSE),\"\")","v":""},{"$f":"IFERROR(VLOOKUP($A22,Mowazaf!$A$9:$H$11,6,FALSE),\"\")","v":""},{"$f":"IFERROR(\" \"&VLOOKUP($A22,Mowazaf!$A$9:$H$11,7,FALSE),\"\")","v":""},null,null,null,null,null,null,null,""]
[null,{"$f":"IFERROR(\" \"&VLOOKUP($A23,Mowazaf!$A$9:$H$11,2,FALSE),\"\")","v":""},{"$f":"IFERROR(\" \"&VLOOKUP($A23,Mowazaf!$A$9:$H$11,8,FALSE),\"\")","v":""},{"$f":"IFERROR(\" \"&VLOOKUP($A23,Mowazaf!$A$9:$H$11,5,FALSE),\"\")","v":""},{"$f":"IFERROR(VLOOKUP($A23,Mowazaf!$A$9:$H$11,6,FALSE),\"\")","v":""},{"$f":"IFERROR(\" \"&VLOOKUP($A23,Mowazaf!$A$9:$H$11,7,FALSE),\"\")","v":""},null,null,null,null,null,null,null,""]
[null,{"$f":"IFERROR(\" \"&VLOOKUP($A24,Mowazaf!$A$9:$H$11,2,FALSE),\"\")","v":""},{"$f":"IFERROR(\" \"&VLOOKUP($A24,Mowazaf!$A$9:$H$11,8,FALSE),\"\")","v":""},{"$f":"IFERROR(\" \"&VLOOKUP($A24,Mowazaf!$A$9:$H$11,5,FALSE),\"\")","v":""},{"$f":"IFERROR(VLOOKUP($A24,Mowazaf!$A$9:$H$11,6,FALSE),\"\")","v":""},{"$f":"IFERROR(\" \"&VLOOKUP($A24,Mowazaf!$A$9:$H$11,7,FALSE),\"\")","v":""},null,null,null,null,null,null,null,""]
[null,{"$f":"IFERROR(\" \"&VLOOKUP($A25,Mowazaf!$A$9:$H$11,2,FALSE),\"\")","v":""},{"$f":"IFERROR(\" \"&VLOOKUP($A25,Mowazaf!$A$9:$H$11,8,FALSE),\"\")","v":""},{"$f":"IFERROR(\" \"&VLOOKUP($A25,Mowazaf!$A$9:$H$11,5,FALSE),\"\")","v":""},{"$f":"IFERROR(VLOOKUP($A25,Mowazaf!$A$9:$H$11,6,FALSE),\"\")","v":""},{"$f":"IFERROR(\" \"&VLOOKUP($A25,Mowazaf!$A$9:$H$11,7,FALSE),\"\")","v":""},null,null,null,null,null,null,null,""]
[null,{"$f":"IFERROR(\" \"&VLOOKUP($A26,Mowazaf!$A$9:$H$11,2,FALSE),\"\")","v":""},{"$f":"IFERROR(\" \"&VLOOKUP($A26,Mowazaf!$A$9:$H$11,8,FALSE),\"\")","v":""},{"$f":"IFERROR(\" \"&VLOOKUP($A26,Mowazaf!$A$9:$H$11,5,FALSE),\"\")","v":""},{"$f":"IFERROR(VLOOKUP($A26,Mowazaf!$A$9:$H$11,6,FALSE),\"\")","v":""},{"$f":"IFERROR(\" \"&VLOOKUP($A26,Mowazaf!$A$9:$H$11,7,FALSE),\"\")","v":""},null,null,null,null,null,null,null,""]
[null,{"$f":"IFERROR(\" \"&VLOOKUP($A27,Mowazaf!$A$9:$H$11,2,FALSE),\"\")","v":""},{"$f":"IFERROR(\" \"&VLOOKUP($A27,Mowazaf!$A$9:$H$11,8,FALSE),\"\")","v":""},{"$f":"IFERROR(\" \"&VLOOKUP($A27,Mowazaf!$A$9:$H$11,5,FALSE),\"\")","v":""},{"$f":"IFERROR(VLOOKUP($A27,Mowazaf!$A$9:$H$11,6,FALSE),\"\")","v":""},{"$f":"IFERROR(\" \"&VLOOKUP($A27,Mowazaf!$A$9:$H$11,7,FALSE),\"\")","v":""},null,null,null,null,null,null,null,""]
[null,{"$f":"IFERROR(\" \"&VLOOKUP($A28,Mowazaf!$A$9:$H$11,2,FALSE),\"\")","v":""},{"$f":"IFERROR(\" \"&VLOOKUP($A28,Mowazaf!$A$9:$H$11,8,FALSE),\"\")","v":""},{"$f":"IFERROR(\" \"&VLOOKUP($A28,Mowazaf!$A$9:$H$11,5,FALSE),\"\")","v":""},{"$f":"IFERROR(VLOOKUP($A28,Mowazaf!$A$9:$H$11,6,FALSE),\"\")","v":""},{"$f":"IFERROR(\" \"&VLOOKUP($A28,Mowazaf!$A$9:$H$11,7,FALSE),\"\")","v":""},null,null,null,null,null,null,null,""]
[null,{"$f":"IFERROR(\" \"&VLOOKUP($A29,Mowazaf!$A$9:$H$11,2,FALSE),\"\")","v":""},{"$f":"IFERROR(\" \"&VLOOKUP($A29,Mowazaf!$A$9:$H$11,8,FALSE),\"\")","v":""},{"$f":"IFERROR(\" \"&VLOOKUP($A29,Mowazaf!$A$9:$H$11,5,FALSE),\"\")","v":""},{"$f":"IFERROR(VLOOKUP($A29,Mowazaf!$A$9:$H$11,6,FALSE),\"\")","v":""},{"$f":"IFERROR(\" \"&VLOOKUP($A29,Mowazaf!$A$9:$H$11,7,FALSE),\"\")","v":""},null,null,null,null,null,null,null,""]
[null,{"$f":"IFERROR(\" \"&VLOOKUP($A30,Mowazaf!$A$9:$H$11,2,FALSE),\"\")","v":""},{"$f":"IFERROR(\" \"&VLOOKUP($A30,Mowazaf!$A$9:$H$11,8,FALSE),\"\")","v":""},{"$f":"IFERROR(\" \"&VLOOKUP($A30,Mowazaf!$A$9:$H$11,5,FALSE),\"\")","v":""},{"$f":"IFERROR(VLOOKUP($A30,Mowazaf!$A$9:$H$11,6,FALSE),\"\")","v":""},{"$f":"IFERROR(\" \"&VLOOKUP($A30,Mowazaf!$A$9:$H$11,7,FALSE),\"\")","v":""},null,null,null,null,null,null,null,""]
[null,{"$f":"IFERROR(\" \"&VLOOKUP($A31,Mowazaf!$A$9:$H$11,2,FALSE),\"\")","v":""},{"$f":"IFERROR(\" \"&VLOOKUP($A31,Mowazaf!$A$9:$H$11,8,FALSE),\"\")","v":""},{"$f":"IFERROR(\" \"&VLOOKUP($A31,Mowazaf!$A$9:$H$11,5,FALSE),\"\")","v":""},{"$f":"IFERROR(VLOOKUP($A31,Mowazaf!$A$9:$H$11,6,FALSE),\"\")","v":""},{"$f":"IFERROR(\" \"&VLOOKUP($A31,Mowazaf!$A$9:$H$11,7,FALSE),\"\")","v":""},null,null,null,null,null,null,null,""]
[null,{"$f":"IFERROR(\" \"&VLOOKUP($A32,Mowazaf!$A$9:$H$11,2,FALSE),\"\")","v":""},{"$f":"IFERROR(\" \"&VLOOKUP($A32,Mowazaf!$A$9:$H$11,8,FALSE),\"\")","v":""},{"$f":"IFERROR(\" \"&VLOOKUP($A32,Mowazaf!$A$9:$H$11,5,FALSE),\"\")","v":""},{"$f":"IFERROR(VLOOKUP($A32,Mowazaf!$A$9:$H$11,6,FALSE),\"\")","v":""},{"$f":"IFERROR(\" \"&VLOOKUP($A32,Mowazaf!$A$9:$H$11,7,FALSE),\"\")","v":""},null,null,null,null,null,null,null,""]
[null,{"$f":"IFERROR(\" \"&VLOOKUP($A33,Mowazaf!$A$9:$H$11,2,FALSE),\"\")","v":""},{"$f":"IFERROR(\" \"&VLOOKUP($A33,Mowazaf!$A$9:$H$11,8,FALSE),\"\")","v":""},{"$f":"IFERROR(\" \"&VLOOKUP($A33,Mowazaf!$A$9:$H$11,5,FALSE),\"\")","v":""},{"$f":"IFERROR(VLOOKUP($A33,Mowazaf!$A$9:$H$11,6,FALSE),\"\")","v":""},{"$f":"IFERROR(\" \"&VLOOKUP($A33,Mowazaf!$A$9:$H$11,7,FALSE),\"\")","v":""},null,null,null,null,null,null,null,""]
[null,{"$f":"IFERROR(\" \"&VLOOKUP($A34,Mowazaf!$A$9:$H$11,2,FALSE),\"\")","v":""},{"$f":"IFERROR(\" \"&VLOOKUP($A34,Mowazaf!$A$9:$H$11,8,FALSE),\"\")","v":""},{"$f":"IFERROR(\" \"&VLOOKUP($A34,Mowazaf!$A$9:$H$11,5,FALSE),\"\")","v":""},{"$f":"IFERROR(VLOOKUP($A34,Mowazaf!$A$9:$H$11,6,FALSE),\"\")","v":""},{"$f":"IFERROR(\" \"&VLOOKUP($A34,Mowazaf!$A$9:$H$11,7,FALSE),\"\")","v":""},null,null,null,null,null,null,null,""]
[null,{"$f":"IFERROR(\" \"&VLOOKUP($A35,Mowazaf!$A$9:$H$11,2,FALSE),\"\")","v":""},{"$f":"IFERROR(\" \"&VLOOKUP($A35,Mowazaf!$A$9:$H$11,8,FALSE),\"\")","v":""},{"$f":"IFERROR(\" \"&VLOOKUP($A35,Mowazaf!$A$9:$H$11,5,FALSE),\"\")","v":""},{"$f":"IFERROR(VLOOKUP($A35,Mowazaf!$A$9:$H$11,6,FALSE),\"\")","v":""},{"$f":"IFERROR(\" \"&VLOOKUP($A35,Mowazaf!$A$9:$H$11,7,FALSE),\"\")","v":""},null,null,null,null,null,null,null,""]
[null,{"$f":"IFERROR(\" \"&VLOOKUP($A36,Mowazaf!$A$9:$H$11,2,FALSE),\"\")","v":""},{"$f":"IFERROR(\" \"&VLOOKUP($A36,Mowazaf!$A$9:$H$11,8,FALSE),\"\")","v":""},{"$f":"IFERROR(\" \"&VLOOKUP($A36,Mowazaf!$A$9:$H$11,5,FALSE),\"\")","v":""},{"$f":"IFERROR(VLOOKUP($A36,Mowazaf!$A$9:$H$11,6,FALSE),\"\")","v":""},{"$f":"IFERROR(\" \"&VLOOKUP($A36,Mowazaf!$A$9:$H$11,7,FALSE),\"\")","v":""},null,null,null,null,null,null,null,""]
[null,{"$f":"IFERROR(\" \"&VLOOKUP($A37,Mowazaf!$A$9:$H$11,2,FALSE),\"\")","v":""},{"$f":"IFERROR(\" \"&VLOOKUP($A37,Mowazaf!$A$9:$H$11,8,FALSE),\"\")","v":""},{"$f":"IFERROR(\" \"&VLOOKUP($A37,Mowazaf!$A$9:$H$11,5,FALSE),\"\")","v":""},{"$f":"IFERROR(VLOOKUP($A37,Mowazaf!$A$9:$H$11,6,FALSE),\"\")","v":""},{"$f":"IFERROR(\" \"&VLOOKUP($A37,Mowazaf!$A$9:$H$11,7,FALSE),\"\")","v":""},null,null,null,null,null,null,null,""]
[null,{"$f":"IFERROR(\" \"&VLOOKUP($A38,Mowazaf!$A$9:$H$11,2,FALSE),\"\")","v":""},{"$f":"IFERROR(\" \"&VLOOKUP($A38,Mowazaf!$A$9:$H$11,8,FALSE),\"\")","v":""},{"$f":"IFERROR(\" \"&VLOOKUP($A38,Mowazaf!$A$9:$H$11,5,FALSE),\"\")","v":""},{"$f":"IFERROR(VLOOKUP($A38,Mowazaf!$A$9:$H$11,6,FALSE),\"\")","v":""},{"$f":"IFERROR(\" \"&VLOOKUP($A38,Mowazaf!$A$9:$H$11,7,FALSE),\"\")","v":""},null,null,null,null,null,null,null,""]
[null,{"$f":"IFERROR(\" \"&VLOOKUP($A39,Mowazaf!$A$9:$H$11,2,FALSE),\"\")","v":""},{"$f":"IFERROR(\" \"&VLOOKUP($A39,Mowazaf!$A$9:$H$11,8,FALSE),\"\")","v":""},{"$f":"IFERROR(\" \"&VLOOKUP($A39,Mowazaf!$A$9:$H$11,5,FALSE),\"\")","v":""},{"$f":"IFERROR(VLOOKUP($A39,Mowazaf!$A$9:$H$11,6,FALSE),\"\")","v":""},{"$f":"IFERROR(\" \"&VLOOKUP($A39,Mowazaf!$A$9:$H$11,7,FALSE),\"\")","v":""},null,null,null,null,null,null,null,""]
[null,{"$f":"IFERROR(\" \"&VLOOKUP($A40,Mowazaf!$A$9:$H$11,2,FALSE),\"\")","v":""},{"$f":"IFERROR(\" \"&VLOOKUP($A40,Mowazaf!$A$9:$H$11,8,FALSE),\"\")","v":""},{"$f":"IFERROR(\" \"&VLOOKUP($A40,Mowazaf!$A$9:$H$11,5,FALSE),\"\")","v":""},{"$f":"IFERROR(VLOOKUP($A40,Mowazaf!$A$9:$H$11,6,FALSE),\"\")","v":""},{"$f":"IFERROR(\" \"&VLOOKUP($A40,Mowazaf!$A$9:$H$11,7,FALSE),\"\")","v":""},null,null,null,null,null,null,null,""]
{"$rows_left_out":68}
{"sheet":"Bulletin","index":2,"n_rows":12,"n_cols":11,"rows_kept":12,"cut":false,"hidden":false,"merged":[[3,3,3,4]]}
[null,null,null,null,null,null,null,null,null,null,"يناير"]
[null,null,null,null,null,null,null,null,null,null,"فبراير"]
[null,null,null,null,null,"غياب شهر",null,null,null,null,"مارس"]
[null,null,null,"كشف الغياب لشـــهـر:",null,"مارس",null,null,null,null,"أبريل"]
[null,null,null,null,null,null,null,null,null,null,"مايو"]
[null,null,null,null,null,null,null,null,null,null,"يونيو"]
[null,"الترتيب","كود الموظف","الاسم و اللقب","تاريخ الميلاد","الوظيفة","المدة","قرار المدير",null,null,"يوليه"]
[null,2," 11243971"," الوليد  تونس ","1986-07-13"," مراقب","نصف يوم","خصم",null,null,"أغسطس"]
[null,1," 11243970"," محمد  الجزائر","1986-07-12"," كاتب","2 يوم","بدون خصم",null,null,"سبتمبر"]
[null,3," 11243972"," أحمد  المغرب","1986-07-14"," مهندس","1 يوم","خصم",null,null,"أكتوبر"]
[null,3," 11243972"," أحمد  المغرب","1986-07-14"," مهندس","1 يوم","خصم",null,null,"نوفمبر"]
[null,null,null,null,null,null,null,null,null,null,"ديسمبر"]