{"text_format":"1","workbook":"xlsx","n_sheets":2,"sheets":["Feuil2","Feuil1"],"not_rendered":{"charts":0,"images":1,"macros":1,"external_links":1,"defined_names":12,"comments":0,"pivot_tables":0},"unopened":[],"bounds":{"document_bytes":16777216,"sheet_cells":100000,"rows_first":2000,"rows_last":500,"rows_between":2000,"halvings":0,"cell_chars":16384,"cell_head_chars":4096},"cells_cut":0,"cells_raw":0,"read":"whole","date_system":"1900"}

{"sheet":"Feuil2","index":0,"n_rows":1,"n_cols":7,"rows_kept":1,"cut":false,"hidden":false,"merged":[]}
["الرقم","تاريخ العملية","اسم المنتوج","الكمية","سعر البيع","خصم","المجموع"]

{"sheet":"Feuil1","index":1,"n_rows":14,"n_cols":8,"rows_kept":14,"cut":false,"hidden":false,"merged":[]}
["الرقم","تاريخ العملية","اسم المنتوج","الكمية","سعر البيع","خصم","المجموع","2022-03-29"]
[{"$f":"IF(C2<>0,1,\"\")","v":1},{"$f":"IF(C2<>0,TODAY(),\"\")","v":"2022-03-29"},"فيلتر 1000 ل",1,{"$f":"IF(C2<>0,(VLOOKUP(C2,[1]Feuil2!$B$3:$E$271,4,0)),\"\")","v":1300},100,{"$f":"IF(C2<>0,((E2*D2)-F2),\"\")","v":1200}]
[{"$f":"IF(C3<>0,A2+1,\"\")","v":2},"2022-03-29","فايتر 1",1,{"$f":"IF(C3<>0,(VLOOKUP(C3,[1]Feuil2!$B$3:$E$271,4,0)),\"\")","v":600},null,600]
[3,"2022-03-29","فايتر 3",1,{"$f":"IF(C4<>0,(VLOOKUP(C4,[1]Feuil2!$B$3:$E$271,4,0)),\"\")","v":350},null,350]
[4,"2022-03-29","سخان 100w",1,{"$f":"IF(C5<>0,(VLOOKUP(C5,[1]Feuil2!$B$3:$E$271,4,0)),\"\")","v":850},50,800]
[5,"2022-03-29","فيلتر  صغير ",1,{"$f":"IF(C6<>0,(VLOOKUP(C6,[1]Feuil2!$B$3:$E$271,4,0)),\"\")","v":750},50,700]
[6,"2022-03-29","سخان ماء",1,{"$f":"IF(C7<>0,(VLOOKUP(C7,[1]Feuil2!$B$3:$E$271,4,0)),\"\")","v":250},50,200]
[7,"2022-03-29","ديفيزور",2,{"$f":"IF(C8<>0,(VLOOKUP(C8,[1]Feuil2!$B$3:$E$271,4,0)),\"\")","v":30},null,60]
[8,"2022-03-29","بوقال 2",1,{"$f":"IF(C9<>0,(VLOOKUP(C9,[1]Feuil2!$B$3:$E$271,4,0)),\"\")","v":1450},50,1400]
[9,"2022-03-29","فايتر 1",1,{"$f":"IF(C10<>0,(VLOOKUP(C10,[1]Feuil2!$B$3:$E$271,4,0)),\"\")","v":600},null,600]
[10,"2022-03-29","اكل اسماك كبيرة",1,{"$f":"IF(C11<>0,(VLOOKUP(C11,[1]Feuil2!$B$3:$E$271,4,0)),\"\")","v":150},50,100]
[11,"2022-03-29","اعشاب اصطناعية ك",2,{"$f":"IF(C12<>0,(VLOOKUP(C12,[1]Feuil2!$B$3:$E$271,4,0)),\"\")","v":150},null,300]
[12,"2022-03-29","كيم برايقة",1,{"$f":"IF(C13<>0,(VLOOKUP(C13,[1]Feuil2!$B$3:$E$271,4,0)),\"\")","v":200},null,200]
[13,"2022-03-29","صابل حجارة رفيعة",1,{"$f":"IF(C14<>0,VLOOKUP(C14,[1]Feuil2!$B$3:$E$271,4,0),\"\")","v":250},50,200]