{"text_format":"1","workbook":"xlsx","n_sheets":3,"sheets":["ورقة1","setup","loans"],"not_rendered":{"charts":0,"images":0,"macros":1,"external_links":2,"defined_names":37,"comments":0,"pivot_tables":0},"unopened":[],"bounds":{"document_bytes":16777216,"sheet_cells":100000,"rows_first":2000,"rows_last":500,"rows_between":2000,"halvings":0,"cell_chars":16384,"cell_head_chars":4096},"cells_cut":0,"cells_raw":0,"read":"whole","date_system":"1900"}

{"sheet":"ورقة1","index":0,"n_rows":20,"n_cols":2,"rows_kept":20,"cut":false,"hidden":false,"merged":[]}
[]
[]
[null,"https://www.officena.net/ib/topic/113773-%D9%85%D8%A7-%D8%A7%D9%84%D8%AE%D8%B7%D8%A3-%D9%81%D9%8A-%D8%A7%D9%84%D9%83%D9%88%D8%AF/"]
[]
[]
[null,"فورم لعرض التسهيلات والاستحقاقات "]
[]
[null,"وفي اسفل اربع خانات لتلخص النتئج المعروضه "]
[]
[null,"الخانة الاولى اجمالي التسهيلات المعروضه الخانة الثانية يفترض ان تعرض التسهيلات اللي تاريخ حقها اقل من او يساوي التاريخ في تكست بوكس 5 اعلى الفورم ولا اعلم ما الخطأ في الكود لا تعمل بشكل جيد "]
[]
[null,"و خانة رقم 4 تعرض المستحق خلال الشهر وتعمل جيد"]
[]
[null,"وهل يمكن تغيير فورمات التاريخ المعروض في لليست بوكس عمود 1؟"]
[]
[null,"وهل يمكن تظليل سطور الليست بوكس اذا وافقت شرط معين مثلا اذا كان تاريخ الاستحقاق اقل من او يساوي التاريخ في تكست 5 ؟"]
[]
[null,"اخيرا هل يمكن كتابة عناوين للاعمده في الليست بوكس ؟"]
[]
[null,"وهل يمكن طباعة النموذج او التحكم في طباعة البيانات المعروضه فيه "]

{"sheet":"setup","index":1,"n_rows":65535,"n_cols":19,"rows_kept":65535,"cut":false,"hidden":false,"merged":[[0,4,0,5],[0,7,0,8],[0,12,0,13],[1,7,1,8]]}
[null,"new","old",null,"الموردين",null,null,"التسهيلات",null,null,null,null,"الشركة",null,null,"ائتمان المورد","الحالة",null,"نوع التغيير"]
["رقم المتابعة",{"$f":"C2+1","v":7},6,null,"كود المورد","اسم المورد",null,"البنوك",null,{"$f":"SUM(J4:J15)","v":12000000},null,null,"كود الشركة","اسم الشركة",null,"نوع السداد","تسهيل",null,"تدبير"]
["رقم السداد",null,null,null,1,"simon","china","كود البنك","اسم البنك","التسهيل","نسبة العمولة",null,1,"اكاي للصناعة",null,0,"سداد",null,"تسهيل"]
[null,null,null,null,2,"samir","china",1,"ابوظبي",5000000,0.05,null,2,null,null,90,"مورد"]
[null,null,null,null,3,"james","china",2,"مصر الإسلامي",7000000,0.05,null,3,null,null,180,"change"]
[null,null,null,null,4,"wilson","china",3,"العربي الكويتي",null,null,null,4]
[null,null,null,null,5,"bahroz","turky",4,"بنك قطر",null,null,null,5]
[null,null,null,null,6,"akel","turky",null,null,null,null,null,6]
[null,null,null,null,7,null,null,null,null,null,null,null,7]
[null,null,null,null,8,null,null,null,null,null,null,null,8]
[null,null,null,null,9,null,null,null,null,null,null,null,9]
[null,null,null,null,10,null,null,null,null,null,null,null,10]
[null,null,null,null,11]
[null,null,null,null,12]
[null,null,null,null,13]
[null,null,null,null,14]
[null,null,null,null,15,"محلي"]
[]
[]
[]
[]
[]
[]
[]
[]
[]
[]
[]
[]
[]
[]
[]
[]
[]
[]
[]
[]
[]
[]
[]
[]
[]
[]
[]
[]
[]
[]
[]
[]
[]
[]
[]
[]
[]
[]
[]
[]
[]
[]
[]
[]
[]
[]
[]
[]
[]
[]
[]
[]
[]
[]
[]
[]
[]
[]
[]
[]
[]
[]
[]
[]
[]
[]
[]
[]
[]
[]
[]
[]
[]
[]
[]
[]
[]
[]
[]
[]
[]
[]
[]
[]
[]
[]
[]
[]
[]
[]
[]
[]
[]
[]
[]
[]
[]
[]
[]
[]
[]
[]
[]
[]
[]
[]
[]
[]
[]
[]
[]
[]
[]
[]
[]
[]
[]
[]
[]
[]
[]
[]
[]
[]
[]
[]
[]
[]
[]
[]
[]
[]
[]
[]
[]
[]
[]
[]
[]
[]
[]
[]
[]
[]
[]
[]
[]
[]
[]
[]
[]
[]
[]
[]
[]
[]
[]
[]
[]
[]
[]
[]
[]
[]
[]
[]
[]
[]
[]
[]
[]
[]
[]
[]
[]
[]
[]
[]
[]
[]
[]
[]
[]
[]
[]
[]
[]
[]
[]
[]
[]
[]
[]
[]
[]
[]
[]
[]
[]
[]
[]
[]
[]
[]
[]
[]
[]
[]
[]
[]
[]
[]
[]
[]
[]
[]
[]
[]
[]
[]
[]
[]
[]
[]
[]
[]
[]
[]
[]
[]
[]
[]
[]
[]
[]
[]
[]
[]
[]
[]
[]
[]
[]
[]
[]
[]
[]
[]
[]
[]
[]
[]
[]
[]
[]
[]
[]
[]
[]
[]
[]
[]
[]
[]
[]
[]
[]
[]
[]
[]
[]
[]
[]
[]
[]
[]
[]
[]
[]
[]
[]
[]
[]
[]
[]
[]
[]
[]
[]
[]
[]
[]
[]
[]
[]
[]
[]
[]
[]
[]
[]
[]
[]
[]
[]
[]
[]
[]
[]
[]
[]
[]
[]
[]
[]
[]
[]
[]
[]
[]
[]
[]
[]
[]
[]
[]
[]
[]
[]
[]
[]
[]
[]
[]
[]
[]
[]
[]
[]
[]
[]
[]
[]
[]
[]
[]
[]
[]
[]
[]
[]
[]
[]
[]
[]
[]
[]
[]
[]
[]
[]
[]
[]
[]
[]
[]
[]
[]
[]
[]
[]
[]
[]
[]
[]
[]
[]
[]
[]
[]
[]
[]
[]
{"$rows_left_out":65136}
{"sheet":"loans","index":2,"n_rows":26,"n_cols":23,"rows_kept":26,"cut":false,"hidden":false,"merged":[[5,3,5,5],[5,11,5,12],[6,3,6,4],[6,6,6,7],[7,3,7,4],[7,6,7,7],[7,11,7,12],[3,3,3,4],[3,6,3,7],[3,11,3,12],[0,0,0,11],[1,3,1,5],[1,11,1,12],[2,3,2,4],[2,6,2,7]]}
["متابعة  وإدارة التسهيلات البنكية ",null,null,null,null,null,null,null,null,null,null,null,null,null,null,null,null,null,{"$f":"COLUMN()","v":19},{"$f":"COLUMN()","v":20},{"$f":"COLUMN()","v":21},{"$f":"COLUMN()","v":22},{"$f":"COLUMN()","v":23}]
["كود البنك",1,"اسم البنك","كل البنوك",null,null,"قيمة التسهيل",{"$f":"IFERROR([2]setup!J2,\"\")","v":12000000},"نسية العمولة",{"$f":"IFERROR(VLOOKUP(B2,[2]setup!H:K,4,FALSE),\"\")","v":0.05},"قيمة العمولة ",{"$f":"SUMIFS(T:T,J:J,B2)","v":0}]
["اجمالي الفواتير",{"$f":"SUMIFS(F$12:F4989,P$12:P4989,\"<>change\")","v":5496214.5999999996},"المستخدم",{"$f":"SUMIFS(F:F,P:P,\"تسهيل\")","v":4922211.5999999996},null,"المتبقي",{"$f":"IFERROR(H2-D3,0)","v":7077788.4000000004}]
["سيولة نقدية متاحة",null,"مستخدم معدل",{"$f":"D3-B4","v":4922211.5999999996},null,"متبقي معدل",{"$f":"G3+B4","v":7077788.4000000004},null,"سعر الصرف",null,"المعادل",{"$f":"IFERROR(G4/J4,0)","v":0}]
[0]
["كود البنك",2,"اسم البنك",{"$f":"IFERROR(VLOOKUP(B6,[2]setup!H:K,2,FALSE),\"\")","v":"مصر الإسلامي"},null,null,"قيمة التسهيل",{"$f":"IFERROR(VLOOKUP(B6,[2]setup!H:K,3,FALSE),\"\")","v":7000000},"نسية العمولة",{"$f":"IFERROR(VLOOKUP(B6,[2]setup!H:K,4,FALSE),\"\")","v":0.05},"قيمة العمولة ",{"$f":"SUMIFS(T:T,J:J,B6)","v":0}]
["اجمالي التسهيلات",{"$f":"SUMIFS(F:F,J:J,B6)","v":2053500},"المستخدم",{"$f":"SUMIFS(F:F,J:J,B6,P:P,\"تسهيل\")","v":1953500},null,"المتبقي",{"$f":"IFERROR(H6-D7,0)","v":5046500}]
["سيولة نقدية متاحة",0,"مستخدم معدل",{"$f":"D7-B8","v":1953500},null,"متبقي معدل",{"$f":"G7+B8","v":5046500},null,"سعر الصرف",null,"المعادل",{"$f":"IFERROR(G8/J8,0)","v":0}]
[0]
[0,null,{"$f":"SUBTOTAL(9,C12:C4949)","v":5970217.5999999996},null,null,{"$f":"SUBTOTAL(9,F12:F4949)","v":5970217.5999999996},null,null,null,null,null,null,null,null,null,null,null,null,null,{"$f":"SUBTOTAL(9,T12:T4949)","v":0}]
["م","رقم مرجعي البنك","المبلغ","العملة","سعر الصرف","المعادل","تاريخ الحق","تاريخ دفع البنك","طريقة السداد","كود البنك","اسم البنك","كود المورد","اسم المورد","الصنف","رقم الفاتورة","حالة السداد ","تاريخ السداد","نوع التغيير","موافقة ","قيمة العمولة ","الشركة","month"]
[{"$f":"IF((A11)<>\"م\",(A11)+1,1)","v":1},1111,474003,"جنيه",1,{"$f":"(E12*C12)","v":474003},"2022-02-27","2021-08-31",0,1,"ابوظبي",2,"maged","اعادة"," ","change","2022-02-23","تدبير","p",null,"اكاي صناعة",{"$f":"MONTH(G12)","v":2}]
[2,null,553396.64,"جنيه",1,553396.64,"2022-01-22","2021-10-24",0,1,"ابوظبي",1,"nader","اعادة",1111,"تسهيل","2022-03-19","تدبير",null,null,"اكاي للصناعة",{"$f":"MONTH(G13)","v":1}]
[3,null,315793.2,"جنيه",1,315793.2,"2022-04-25","2021-10-27",0,1,"ابوظبي",2,"maged","اعادة",1111,"تسهيل",null,null,null,null,"اكاي للصناعة",4]
[4,11,249680.48,"جنية",1,249680.48,"2022-07-16","2022-01-17",0,1,"ابوظبي",2,"maged","اعادة",1111,"تسهيل",null,null,null,null,"اكاي للصناعة",7]
[5,11,262246.40000000002,"جنيه",1,262246.40000000002,"2022-01-16","2022-01-17",0,1,"ابوظبي",2,"maged","اعادة",1111,"تسهيل",null,null,null,null,"اكاي للصناعة",1]
[6,1,206698.4,"جنيه",1,206698.4,"2022-07-16","2022-01-17",0,1,"ابوظبي",1,"nader","اعادة",1111,"تسهيل",null,null,null,null,"اكاي للصناعة",7]
[7,1,161035.68,"جنيه",1,161035.68,"2022-07-16","2022-01-17",0,1,"ابوظبي",1,"nader","اعادة",1111,"تسهيل",null,null,null,null,"اكاي للصناعة",7]
[8,1,474060.79999999999,"جنيه",1,474060.79999999999,"2022-01-16","2022-01-17",0,1,"ابوظبي",4,"mostafa","اعادة",1111,"تسهيل",null,null,null,null,"اكاي للصناعة",1]
[9,1111,474003,"جنيه",1,474003,"2022-08-26","2022-02-23",180,1,"ابوظبي",2,"maged","اعادة",1111,"سداد",null,null,null,null,null,8]
[10,null,495800,"جنيه ",1,495800,"2022-07-19","2022-01-20",0,1,"ابوظبي",15,"محلي","اعادة",1111,"تسهيل",null,null,null,null,"اكاي للصناعة",7]
[11,1,250000,"جنيه",1,250000,"2022-09-05","2022-03-09",0,1,"ابوظبي",15,"محلي","اعادة",1111,"تسهيل",null,null,null,null,"اكاي للصناعة",9]
[12,1,1013500,"جنيه",1,1013500,"2022-04-26","2021-10-28",0,2,"مصر الإسلامي",15,"محلي","اعادة",1111,"تسهيل",null,null,null,null,"اكاي للصناعة",4]
[13,null,500000,"جنيه",1,500000,"2022-04-30","2021-11-01",0,2,"مصر الإسلامي",15,"محلي","اعادة",1111,"تسهيل",null,null,null,null,"اكاي للصناعة",4]
[14,null,440000,"جنيه",1,440000,"2022-05-07","2021-11-08",0,2,"مصر الإسلامي",15,"محلي","اعادة",1111,"تسهيل",null,null,null,null,"اكاي للصناعة",5]
[{"$f":"IF((A25)<>\"م\",(A25)+1,1)","v":15},null,100000,"جنيه",1,{"$f":"(E26*C26)","v":100000},"2021-11-08","2021-11-08",0,2,"مصر الإسلامي",1,"nader",null,null,"سداد",null,null,null,null,"اكاي للصناعة",11]