{"text_format":"1","workbook":"xlsx","n_sheets":2,"sheets":["رصد الترم الثانى","4شهادات"],"not_rendered":{"charts":0,"images":1,"macros":1,"external_links":0,"defined_names":2,"comments":0,"pivot_tables":0},"unopened":[],"bounds":{"document_bytes":16777216,"sheet_cells":100000,"rows_first":2000,"rows_last":500,"rows_between":2000,"halvings":0,"cell_chars":16384,"cell_head_chars":4096},"cells_cut":0,"cells_raw":0,"read":"whole","date_system":"1900"}

{"sheet":"رصد الترم الثانى","index":0,"n_rows":255,"n_cols":112,"rows_kept":255,"cut":false,"hidden":false,"merged":[[1,0,5,0],[1,1,5,1],[1,3,2,3],[1,9,1,12],[2,4,3,4],[2,5,3,5],[2,9,3,9],[2,10,3,10],[2,11,3,11],[2,12,3,12],[1,13,1,14],[1,18,1,21],[1,22,1,23],[1,27,1,30],[1,31,1,32],[1,36,1,39],[1,47,1,50],[1,57,1,61],[1,62,1,66],[2,54,3,54],[2,55,3,55],[2,56,3,56],[2,57,3,57],[2,58,3,58],[2,59,3,59],[2,53,3,53],[1,51,3,51],[1,52,1,56],[2,39,3,39],[1,40,1,42],[2,64,3,64],[1,67,1,71],[1,72,3,72],[1,73,1,74],[1,78,1,81],[2,68,3,68],[2,69,3,69],[2,70,3,70],[2,71,3,71],[2,73,3,73],[2,74,3,74],[2,81,3,81],[1,82,1,83],[1,87,1,90],[1,91,1,92],[1,96,1,99],[2,13,3,13],[2,14,3,14],[2,18,3,18],[2,19,3,19],[2,20,3,20],[2,21,3,21],[2,22,3,22],[2,23,3,23],[2,27,3,27],[2,28,3,28],[2,29,3,29],[2,30,3,30],[2,31,3,31],[2,32,3,32],[2,36,3,36],[2,37,3,37],[2,38,3,38],[2,66,3,66],[2,67,3,67],[2,40,2,42],[2,48,3,48],[2,49,3,49],[2,50,3,50],[2,52,3,52],[5,45,5,46],[2,96,3,96],[2,97,3,97],[2,98,3,98],[2,82,3,82],[2,60,3,60],[2,61,3,61],[2,62,3,62],[2,63,3,63],[2,80,3,80],[2,83,3,83],[2,87,3,87],[2,88,3,88],[2,78,3,78],[2,79,3,79],[2,65,3,65],[2,99,3,99],[2,89,3,89],[2,90,3,90],[2,91,3,91],[2,92,3,92]]}
[null,null,{"$f":"COLUMN()","v":3},{"$f":"COLUMN()","v":4},{"$f":"COLUMN()","v":5},{"$f":"COLUMN()","v":6},{"$f":"COLUMN()","v":7},{"$f":"COLUMN()","v":8},{"$f":"COLUMN()","v":9},{"$f":"COLUMN()","v":10},{"$f":"COLUMN()","v":11},{"$f":"COLUMN()","v":12},{"$f":"COLUMN()","v":13},{"$f":"COLUMN()","v":14},{"$f":"COLUMN()","v":15},{"$f":"COLUMN()","v":16},{"$f":"COLUMN()","v":17},{"$f":"COLUMN()","v":18},{"$f":"COLUMN()","v":19},{"$f":"COLUMN()","v":20},{"$f":"COLUMN()","v":21},{"$f":"COLUMN()","v":22},{"$f":"COLUMN()","v":23},{"$f":"COLUMN()","v":24},{"$f":"COLUMN()","v":25},{"$f":"COLUMN()","v":26},{"$f":"COLUMN()","v":27},{"$f":"COLUMN()","v":28},{"$f":"COLUMN()","v":29},{"$f":"COLUMN()","v":30},{"$f":"COLUMN()","v":31},{"$f":"COLUMN()","v":32},{"$f":"COLUMN()","v":33},{"$f":"COLUMN()","v":34},{"$f":"COLUMN()","v":35},{"$f":"COLUMN()","v":36},{"$f":"COLUMN()","v":37},{"$f":"COLUMN()","v":38},{"$f":"COLUMN()","v":39},{"$f":"COLUMN()","v":40},{"$f":"COLUMN()","v":41},{"$f":"COLUMN()","v":42},{"$f":"COLUMN()","v":43},{"$f":"COLUMN()","v":44},{"$f":"COLUMN()","v":45},{"$f":"COLUMN()","v":46},{"$f":"COLUMN()","v":47},{"$f":"COLUMN()","v":48},{"$f":"COLUMN()","v":49},{"$f":"COLUMN()","v":50},{"$f":"COLUMN()","v":51},{"$f":"COLUMN()","v":52},{"$f":"COLUMN()","v":53},{"$f":"COLUMN()","v":54},{"$f":"COLUMN()","v":55},{"$f":"COLUMN()","v":56},{"$f":"COLUMN()","v":57},{"$f":"COLUMN()","v":58},{"$f":"COLUMN()","v":59},{"$f":"COLUMN()","v":60},{"$f":"COLUMN()","v":61},{"$f":"COLUMN()","v":62},{"$f":"COLUMN()","v":63},{"$f":"COLUMN()","v":64},{"$f":"COLUMN()","v":65},{"$f":"COLUMN()","v":66},{"$f":"COLUMN()","v":67},{"$f":"COLUMN()","v":68},{"$f":"COLUMN()","v":69},{"$f":"COLUMN()","v":70},{"$f":"COLUMN()","v":71},{"$f":"COLUMN()","v":72},{"$f":"COLUMN()","v":73},{"$f":"COLUMN()","v":74},{"$f":"COLUMN()","v":75},{"$f":"COLUMN()","v":76},{"$f":"COLUMN()","v":77},{"$f":"COLUMN()","v":78},{"$f":"COLUMN()","v":79},{"$f":"COLUMN()","v":80},{"$f":"COLUMN()","v":81},{"$f":"COLUMN()","v":82},{"$f":"COLUMN()","v":83},{"$f":"COLUMN()","v":84},{"$f":"COLUMN()","v":85},{"$f":"COLUMN()","v":86},{"$f":"COLUMN()","v":87},{"$f":"COLUMN()","v":88},{"$f":"COLUMN()","v":89},{"$f":"COLUMN()","v":90},{"$f":"COLUMN()","v":91},{"$f":"COLUMN()","v":92},{"$f":"COLUMN()","v":93},{"$f":"COLUMN()","v":94},{"$f":"COLUMN()","v":95},{"$f":"COLUMN()","v":96},{"$f":"COLUMN()","v":97},{"$f":"COLUMN()","v":98},{"$f":"COLUMN()","v":99},{"$f":"COLUMN()","v":100},{"$f":"COLUMN()","v":101},{"$f":"COLUMN()","v":102}]
["السري","الجلوس",null,"المادة","اللغة العربية والخط",null,"الغياب",null,null,"اللغة العربية والخط",null,null,null,"الرياضيات",null,"الغياب",null,null,"الرياضيات",null,null,null,"الدراسات الإجتماعية",null,"الغياب",null,null,"الدراسات الإجتماعية",null,null,null,"اللغة الأجنبية",null,"الغياب",null,null,"اللغة الأجنبية",null,null,null,"العلـوم",null,null,"الغياب",null,null,null,"العلـوم",null,null,null,"مجموع المواد الأساسية","نشاط التربية الفنية",null,null,null,null,"نشاط التربية الرياضية",null,null,null,null,"نشاط اختيارى ( 1 )",null,null,null,null,"نشاط اختيارى ( 2 )",null,null,null,null,"المجموع الكلي ","التربية الدينية",null,"الغياب",null,null,"التربية الدينية",null,null,null,"لغة أجنبية ( مستوى رفيع E )",null,"الغياب",null,null,"لغة أجنبية ( مستوى رفيع E )",null,null,null,"لغة أجنبية ( مستوى رفيع F )",null,"الغياب",null,null,"لغة أجنبية ( مستوى رفيع F )"]
[null,null,null,null,"تقويمات الفصل الدراسى الأول","اختبارالفصل الدراســـــــى الأول","المرصود",null,null,"المجموع","محموع الفصلين الدراسيين","متوسط  الفصلين الدراسيين","الدرجة الأصلية","تقويمات الفصل الدراسى الأول","اختبارالفصل الدراســـــــى الأول","المرصود",null,null,"المجموع","محموع الفصلين الدراسيين","متوسط  الفصلين الدراسيين","الدرجة الأصلية","تقويمات الفصل الدراسى الأول","اختبارالفصل الدراســـــــى الأول","المرصود",null,null,"المجموع","محموع الفصلين الدراسيين","متوسط  الفصلين الدراسيين","الدرجة الأصلية","تقويمات الفصل الدراسى الأول","اختبارالفصل الدراســـــــى الأول","المرصود",null,null,"المجموع","محموع الفصلين الدراسيين","متوسط  الفصلين الدراسيين","الدرجة الأصلية","الفصل الدراسى الأول",null,null,"المرصود",null,null,null,"الدراسى الثانى","محموع الفصلين الدراسيين","متوسط  الفصلين الدراسيين","الدرجة الأصلية",null,"تقويمات الفصل الدراسى الأول","تقويمات الفصل الدراسى الثانى","محموع الفصلين الدراسيين","متوسط  الفصلين الدراسيين","الدرجة الأصلية","تقويمات الفصل الدراسى الأول","تقويمات الفصل الدراسى الثانى","محموع الفصلين الدراسيين","متوسط  الفصلين الدراسيين","الدرجة الأصلية","تقويمات الفصل الدراسى الأول","تقويمات الفصل الدراسى الثانى","محموع الفصلين الدراسيين","متوسط  الفصلين الدراسيين","الدرجة الأصلية","تقويمات الفصل الدراسى الأول","تقويمات الفصل الدراسى الثانى","محموع الفصلين الدراسيين","متوسط  الفصلين الدراسيين","الدرجة الأصلية",null,"تقويمات الفصل الدراسى الأول","اختبارالفصل الدراســـــــى الأول","المرصود",null,null,"المجموع","محموع الفصلين الدراسيين","متوسط  الفصلين الدراسيين","الدرجة الأصلية","تقويمات الفصل الدراسى الأول","اختبارالفصل الدراســـــــى الأول","المرصود",null,null,"المجموع","محموع الفصلين الدراسيين","متوسط  الفصلين الدراسيين","الدرجة الأصلية","تقويمات الفصل الدراسى الأول","اختبارالفصل الدراســـــــى الأول","المرصود",null,null,"المجموع","محموع الفصلين الدراسيين","متوسط  الفصلين الدراسيين","الدرجة الأصلية"]
[null,null,"الاســم","توزيع الدرجات",null,null,"المجموع","تقويمات الفصل الدراسى الثانى","اختبارالفصل الدراســـــى الثانى",null,null,null,null,null,null,"المجموع","تقويمات الفصل الدراسى الثانى","اختبارالفصل الدراســـــى الثانى",null,null,null,null,null,null,"المجموع","تقويمات الفصل الدراسى الثانى","اختبارالفصل الدراســـــى الثانى",null,null,null,null,null,null,"المجموع","تقويمات الفصل الدراسى الثانى","اختبارالفصل الدراســـــى الثانى",null,null,null,null,"تقويمات الفصل الدراسى الأول","اختبار العملى","اختبار التحريرى","المحموع","تقويمات الفصل الدراسى الثانى","اختبار العملى","اختبار التحريرى","المحموع",null,null,null,null,null,null,null,null,null,null,null,null,null,null,null,null,null,null,null,null,null,null,null,null,null,null,null,"المجموع","تقويمات الفصل الدراسى الثانى","اختبارالفصل الدراســـــى الثانى",null,null,null,null,null,null,"المجموع","تقويمات الفصل الدراسى الثانى","اختبارالفصل الدراســـــى الثانى",null,null,null,null,null,null,"المجموع","تقويمات الفصل الدراسى الثانى","اختبارالفصل الدراســـــى الثانى",null,null,null,null,"النتيجة","ملاحظات",null,null,null,{"$f":"101/4","v":25.25}]
[null,null,null,"النهاية الكبري",60,40,{"$f":"SUM(E5:F5)","v":100},{"$f":"E5","v":60},{"$f":"F5","v":40},{"$f":"SUM(H5:I5)","v":100},{"$f":"J5+G5","v":200},{"$f":"K5/2","v":100},{"$f":"L5","v":100},60,40,{"$f":"SUM(N5:O5)","v":100},{"$f":"N5","v":60},{"$f":"O5","v":40},{"$f":"SUM(Q5:R5)","v":100},{"$f":"S5+P5","v":200},{"$f":"T5/2","v":100},{"$f":"U5*0.8","v":80},60,40,{"$f":"SUM(W5:X5)","v":100},{"$f":"W5","v":60},{"$f":"X5","v":40},{"$f":"SUM(Z5:AA5)","v":100},{"$f":"AB5+Y5","v":200},{"$f":"AC5/2","v":100},{"$f":"AD5*0.4","v":40},60,40,{"$f":"SUM(AF5:AG5)","v":100},{"$f":"AF5","v":60},{"$f":"AG5","v":40},{"$f":"SUM(AI5:AJ5)","v":100},{"$f":"AK5+AH5","v":200},{"$f":"AL5/2","v":100},{"$f":"IF(OR($DH$4=1,$DH$4=2,$DH$4=3),AM5*0.3,AM5*0.4)","v":40},60,8,32,{"$f":"SUM(AO5:AQ5)","v":100},{"$f":"AO5","v":60},{"$f":"AP5","v":8},{"$f":"AQ5","v":32},{"$f":"SUM(AS5:AU5)","v":100},{"$f":"AV5+AR5","v":200},{"$f":"AW5/2","v":100},{"$f":"AX5*0.4","v":40},{"$f":"AY5+AN5+AE5+V5+M5","v":300},100,{"$f":"BA5","v":100},{"$f":"BA5+BB5","v":200},{"$f":"BC5/2","v":100},{"$f":"IF(BD5=10,BD5*2,BD5*0.2)","v":20},100,{"$f":"BF5","v":100},{"$f":"BF5+BG5","v":200},{"$f":"BH5/2","v":100},{"$f":"IF(BI5=10,BI5*2,BI5*0.2)","v":20},100,{"$f":"BK5","v":100},{"$f":"BK5+BL5","v":200},{"$f":"BM5/2","v":100},{"$f":"IF(BN5=10,BN5*2,BN5*0.2)","v":20},100,{"$f":"BP5","v":100},{"$f":"BP5+BQ5","v":200},{"$f":"BR5/2","v":100},{"$f":"IF(BS5=10,BS5*2,BS5*0.2)","v":20},{"$f":"AZ5+BE5+BJ5+BO5+BT5","v":380},60,40,{"$f":"SUM(BV5:BW5)","v":100},{"$f":"BV5","v":60},{"$f":"BW5","v":40},{"$f":"SUM(BY5:BZ5)","v":100},{"$f":"CA5+BX5","v":200},{"$f":"CB5/2","v":100},{"$f":"IF(OR($DH$4=1,$DH$4=2,$DH$4=3),CC5*0.3,CC5*0.4)","v":40},60,40,{"$f":"SUM(CE5:CF5)","v":100},{"$f":"CE5","v":60},{"$f":"CF5","v":40},{"$f":"SUM(CH5:CI5)","v":100},{"$f":"CJ5+CG5","v":200},{"$f":"CK5/2","v":100},{"$f":"IF(OR($DH$4=1,$DH$4=2,$DH$4=3),CL5*0.3,CL5*0.4)","v":40},60,40,{"$f":"SUM(CN5:CO5)","v":100},{"$f":"CN5","v":60},{"$f":"CO5","v":40},{"$f":"SUM(CQ5:CR5)","v":100},{"$f":"CS5+CP5","v":200},{"$f":"CT5/2","v":100},{"$f":"IF(OR($DH$4=1,$DH$4=2,$DH$4=3),CU5*0.3,CU5*0.4)","v":40}]
[null,null,null,"النهاية الصغري",null,null,null,null,{"$f":"I5*30%","v":12},null,null,null,{"$f":"M5/2","v":50},null,null,null,null,{"$f":"R5*30%","v":12},null,null,null,{"$f":"V5/2","v":40},null,null,null,null,{"$f":"AA5*30%","v":12},null,null,null,{"$f":"AE5/2","v":20},null,null,null,null,{"$f":"AJ5*30%","v":12},null,null,null,{"$f":"AN5/2","v":20},null,null,null,null,null,{"$f":"SUM(AT5:AU5)*30%","v":12},null,null,null,null,{"$f":"AY5/2","v":20},{"$f":"AZ5/2","v":150},null,null,null,null,{"$f":"BE5/2","v":10},null,null,null,null,{"$f":"BJ5/2","v":10},null,null,null,null,{"$f":"BO5/2","v":10},null,null,null,null,{"$f":"BT5/2","v":10},{"$f":"BU5/2","v":190},null,null,null,null,{"$f":"BZ5*30%","v":12},null,null,null,{"$f":"CD5/2","v":20},null,null,null,null,{"$f":"CI5*30%","v":12},null,null,null,{"$f":"CM5/2","v":20},null,null,null,null,{"$f":"CR5*30%","v":12},null,null,null,{"$f":"CV5/2","v":20}]
[50,700,"اسلام محمدي عبد السميع عبد الغني",1,60,40,100,60,39,99,199,99.5,99.5,58,40,98,60,40,100,198,99,79.2,59,39,98,58,40,98,196,98,39.200000000000003,60,39,99,60,39,99,198,99,39.6,60,8,32,100,60,8,32,100,200,100,40,297.5,100,100,200,100,20,100,100,200,100,20,100,100,200,100,20,100,100,200,100,20,377.5,59,31,90,59,40,99,189,94.5,37.799999999999997,0,0,0,0,null,0,0,0,0,0,0,0,0,null,0,0,0,0,"ناجــــح","ومنقول للصف الخامس",null,null,null,null,null,null,null,null,null,{"$f":"IFERROR(INDEX($B$7:$B$33,MATCH(0,INDEX(COUNTIF($DH$6:DH6,$B$7:$B$33),),0)),\"\")","v":700}]
[null,701,"السيد شريف عبد العليم السيد",1,48,15,63,43,22,65,128,64,64,42,24,66,44,28,72,138,69,55.2,45,30,75,36,33,69,144,72,28.8,55,36,91,46,37,83,174,87,34.799999999999997,48,8,26,82,51,8,27,86,168,84,33.6,216.4,100,100,200,100,20,100,100,200,100,20,100,100,200,100,20,100,100,200,100,20,296.5,39,21,60,40,26,66,126,63,25.2,0,0,0,0,null,0,0,0,0,0,0,0,0,null,0,0,0,0,"ناجــــح","ومنقول للصف الخامس",null,null,null,null,null,null,null,null,null,{"$f":"IFERROR(INDEX($B$7:$B$33,MATCH(0,INDEX(COUNTIF($DH$6:DH7,$B$7:$B$33),),0)),\"\")","v":701}]
[null,702,"السيد صلاح السيد محمد",1,60,40,100,59,39,98,198,99,99,60,37,97,54,37,91,188,94,75.2,54,40,94,55,40,95,189,94.5,37.799999999999997,60,40,100,59,40,99,199,99.5,39.799999999999997,60,8,31,99,59,8,30,97,196,98,39.200000000000003,291,100,100,200,100,20,100,100,200,100,20,100,100,200,100,20,100,100,200,100,20,371,59,30,89,57,38,95,184,92,36.799999999999997,0,0,0,0,null,0,0,0,0,0,0,0,0,null,0,0,0,0,"ناجــــح","ومنقول للصف الخامس",null,null,null,null,null,null,null,null,null,{"$f":"IFERROR(INDEX($B$7:$B$33,MATCH(0,INDEX(COUNTIF($DH$6:DH8,$B$7:$B$33),),0)),\"\")","v":702}]
[null,703,"أحمد أشرف محمد سيدأحمد",1,43,15,58,47,10,57,115,57.5,57.5,44,24,68,45,28,73,141,70.5,56.4,32,10,42,33,22,55,97,48.5,19.399999999999999,50,16,66,47,22,69,135,67.5,27,43,8,20,71,50,4,11,65,136,68,27.2,187.5,91,100,191,95.5,19.100000000000001,100,100,200,100,20,100,100,200,100,20,100,100,200,100,20,267,34,14,48,44,25,69,117,58.5,23.4,0,0,0,0,null,0,0,0,0,0,0,0,0,null,0,0,0,0,"ناجــــح","عربى،دراسات،",null,null,null,null,null,null,null,null,null,{"$f":"IFERROR(INDEX($B$7:$B$33,MATCH(0,INDEX(COUNTIF($DH$6:DH9,$B$7:$B$33),),0)),\"\")","v":703}]
[null,704,"أحمد أيمن فاروق السيد",1,59,39,98,59,37,96,194,97,97,60,40,100,58,40,98,198,99,79.2,60,40,100,51,40,91,191,95.5,38.200000000000003,60,40,100,60,39,99,199,99.5,39.799999999999997,55,8,31,94,58,8,30,96,190,95,38,292.2,99,100,199,99.5,19.899999999999999,100,100,200,100,20,100,100,200,100,20,100,100,200,100,20,372.5,60,30,90,59,36,95,185,92.5,37,0,0,0,0,null,0,0,0,0,0,0,0,0,null,0,0,0,0,"ناجــــح","ومنقول للصف الخامس",null,null,null,null,null,null,null,null,null,{"$f":"IFERROR(INDEX($B$7:$B$33,MATCH(0,INDEX(COUNTIF($DH$6:DH10,$B$7:$B$33),),0)),\"\")","v":704}]
[null,705,"أحمد إبراهيم أحمد عبد الغنى",1,60,40,100,59,40,99,199,99.5,99.5,60,37,97,54,39,93,190,95,76,57,39,96,46,40,86,182,91,36.4,60,39,99,59,39,98,197,98.5,39.4,57,8,30,95,57,8,30,95,190,95,38,289.3,100,100,200,100,20,100,100,200,100,20,100,100,200,100,20,100,100,200,100,20,369.5,52,32,84,55,40,95,179,89.5,35.799999999999997,0,0,0,0,null,0,0,0,0,0,0,0,0,null,0,0,0,0,"ناجــــح","ومنقول للصف الخامس",null,null,null,null,null,null,null,null,null,{"$f":"IFERROR(INDEX($B$7:$B$33,MATCH(0,INDEX(COUNTIF($DH$6:DH11,$B$7:$B$33),),0)),\"\")","v":705}]
[null,706,"أحمد جلال أحمد جمعه",1,60,40,100,60,40,100,200,100,100,60,40,100,60,40,100,200,100,80,60,40,100,59,40,99,199,99.5,39.799999999999997,60,40,100,60,40,100,200,100,40,60,8,32,100,60,8,31,99,199,99.5,39.799999999999997,299.60000000000002,100,100,200,100,20,100,100,200,100,20,100,100,200,100,20,100,100,200,100,20,380,60,38,98,60,40,100,198,99,39.6,0,0,0,0,null,0,0,0,0,0,0,0,0,null,0,0,0,0,"ناجــــح","ومنقول للصف الخامس",null,null,null,{"$f":"COUNTIFS(CW7:CW213,{\"ناجــــح\",\"ناجـحة\"})","v":102},null,null,null,null,null,{"$f":"IFERROR(INDEX($B$7:$B$33,MATCH(0,INDEX(COUNTIF($DH$6:DH12,$B$7:$B$33),),0)),\"\")","v":706}]
[null,707,"أحمد حسام إبراهيم محمد",1,57,33,90,49,33,82,172,86,86,49,30,79,45,19,64,143,71.5,57.2,49,29,78,46,24,70,148,74,29.6,60,38,98,59,31,90,188,94,37.6,51,4,32,87,58,8,23,89,176,88,35.200000000000003,245.6,100,100,200,100,20,100,100,200,100,20,100,100,200,100,20,100,100,200,100,20,326,48,28,76,49,26,75,151,75.5,30.2,0,0,0,0,null,0,0,0,0,0,0,0,0,null,0,0,0,0,"ناجــــح","ومنقول للصف الخامس",null,null,null,null,null,null,null,null,null,{"$f":"IFERROR(INDEX($B$7:$B$33,MATCH(0,INDEX(COUNTIF($DH$6:DH13,$B$7:$B$33),),0)),\"\")","v":707}]
[null,708,"أحمد خليفه محمد على",1,58,15,73,50,19,69,142,71,71,50,24,74,50,15,65,139,69.5,55.6,44,17,61,35,14,49,110,55,22,45,25,70,51,20,71,141,70.5,28.2,49,8,25,82,50,8,13,71,153,76.5,30.6,207.4,99,100,199,99.5,19.899999999999999,100,100,200,100,20,100,100,200,100,20,100,100,200,100,20,287.5,39,28,67,38,30,68,135,67.5,27,0,0,0,0,null,0,0,0,0,0,0,0,0,null,0,0,0,0,"ناجــــح","ومنقول للصف الخامس",null,null,null,null,null,null,null,null,null,{"$f":"IFERROR(INDEX($B$7:$B$33,MATCH(0,INDEX(COUNTIF($DH$6:DH14,$B$7:$B$33),),0)),\"\")","v":708}]
[null,709,"أحمد خميس محمد على",1,60,36,96,59,38,97,193,96.5,96.5,60,38,98,55,40,95,193,96.5,77.2,59,40,99,56,40,96,195,97.5,39,58,39,97,60,38,98,195,97.5,39,56,8,32,96,57,8,30,95,191,95.5,38.200000000000003,289.89999999999998,100,100,200,100,20,100,100,200,100,20,100,100,200,100,20,100,100,200,100,20,370,58,34,92,56,40,96,188,94,37.6,0,0,0,0,null,0,0,0,0,0,0,0,0,null,0,0,0,0,"ناجــــح","ومنقول للصف الخامس",null,null,null,null,null,null,null,null,null,{"$f":"IFERROR(INDEX($B$7:$B$33,MATCH(0,INDEX(COUNTIF($DH$6:DH15,$B$7:$B$33),),0)),\"\")","v":709}]
[null,710,"أحمد رضا اجمد بيومي",1,57,35,92,57,34,91,183,91.5,91.5,55,39,94,57,35,92,186,93,74.400000000000006,56,40,96,44,38,82,178,89,35.6,60,34,94,57,30,87,181,90.5,36.200000000000003,57,8,28,93,54,8,29,91,184,92,36.799999999999997,274.5,100,100,200,100,20,100,100,200,100,20,100,100,200,100,20,100,100,200,100,20,354.5,55,30,85,57,39,96,181,90.5,36.200000000000003,0,0,0,0,null,0,0,0,0,0,0,0,0,null,0,0,0,0,"ناجــــح","ومنقول للصف الخامس",null,null,null,null,null,null,null,null,null,{"$f":"IFERROR(INDEX($B$7:$B$33,MATCH(0,INDEX(COUNTIF($DH$6:DH16,$B$7:$B$33),),0)),\"\")","v":710}]
[null,711,"أحمد رضا محمد أبوالعز",1,58,37,95,60,38,98,193,96.5,96.5,58,40,98,50,28,78,176,88,70.400000000000006,57,37,94,56,37,93,187,93.5,37.4,60,40,100,60,35,95,195,97.5,39,59,8,30,97,60,8,28,96,193,96.5,38.6,281.89999999999998,100,100,200,100,20,100,100,200,100,20,100,100,200,100,20,100,100,200,100,20,362,58,31,89,51,40,91,180,90,36,0,0,0,0,null,0,0,0,0,0,0,0,0,null,0,0,0,0,"ناجــــح","ومنقول للصف الخامس",null,null,null,null,null,null,null,null,null,{"$f":"IFERROR(INDEX($B$7:$B$33,MATCH(0,INDEX(COUNTIF($DH$6:DH17,$B$7:$B$33),),0)),\"\")","v":711}]
[null,712,"أحمد سعيد إبراهيم محمد",1,57,39,96,59,34,93,189,94.5,94.5,54,40,94,55,24,79,173,86.5,69.2,58,32,90,46,26,72,162,81,32.4,60,39,99,60,38,98,197,98.5,39.4,54,8,29,91,57,8,27,92,183,91.5,36.6,272.10000000000002,99,100,199,99.5,19.899999999999999,100,100,200,100,20,100,100,200,100,20,100,100,200,100,20,352,57,31,88,59,35,94,182,91,36.4,0,0,0,0,null,0,0,0,0,0,0,0,0,null,0,0,0,0,"ناجــــح","ومنقول للصف الخامس",null,null,null,null,null,null,null,null,null,{"$f":"IFERROR(INDEX($B$7:$B$33,MATCH(0,INDEX(COUNTIF($DH$6:DH18,$B$7:$B$33),),0)),\"\")","v":712}]
[null,713,"أحمد سعيد محمد السيد",1,60,38,98,60,39,99,197,98.5,98.5,59,40,99,54,38,92,191,95.5,76.400000000000006,52,36,88,50,38,88,176,88,35.200000000000003,50,40,90,60,39,99,189,94.5,37.799999999999997,59,8,32,99,58,8,25,91,190,95,38,285.89999999999998,100,100,200,100,20,100,100,200,100,20,100,100,200,100,20,100,100,200,100,20,366,60,36,96,60,40,100,196,98,39.200000000000003,0,0,0,0,null,0,0,0,0,0,0,0,0,null,0,0,0,0,"ناجــــح","ومنقول للصف الخامس",null,null,null,null,null,null,null,null,null,{"$f":"IFERROR(INDEX($B$7:$B$33,MATCH(0,INDEX(COUNTIF($DH$6:DH19,$B$7:$B$33),),0)),\"\")","v":713}]
{"$rows_left_out":236}
{"sheet":"4شهادات","index":1,"n_rows":61,"n_cols":51,"rows_kept":61,"cut":false,"hidden":false,"merged":[[58,7,58,8],[58,9,58,10],[59,2,59,4],[59,5,59,14],[50,2,50,6],[50,7,50,9],[50,10,50,11],[50,12,50,14],[62,0,62,11],[62,12,62,15],[60,2,60,5],[60,6,60,7],[60,8,60,10],[60,11,60,14],[61,2,61,7],[61,8,61,10],[61,11,61,14],[51,1,53,1],[51,2,51,10],[51,11,53,11],[51,12,51,14],[52,3,53,3],[52,6,53,6],[48,1,48,4],[48,5,48,8],[48,9,48,14],[49,1,49,6],[49,8,49,9],[49,10,49,14],[52,7,52,10],[52,13,53,13],[52,14,53,14],[45,2,45,7],[45,8,45,10],[45,11,45,14],[46,0,46,11],[46,12,46,15],[47,1,47,14],[42,7,42,8],[42,9,42,10],[43,2,43,4],[43,5,43,14],[44,2,44,5],[44,6,44,7],[44,8,44,10],[44,11,44,14],[35,1,37,1],[35,2,35,10],[35,11,37,11],[35,12,35,14],[36,3,37,3],[36,6,37,6],[36,7,36,10],[36,13,37,13],[36,14,37,14],[33,1,33,6],[33,8,33,9],[33,10,33,14],[34,2,34,6],[34,7,34,9],[34,10,34,11],[34,12,34,14],[29,2,29,7],[29,8,29,10],[29,11,29,14],[30,0,30,11],[30,12,30,15],[32,1,32,4],[32,5,32,8],[32,9,32,14],[26,7,26,8],[26,9,26,10],[27,2,27,4],[27,5,27,14],[28,2,28,5],[28,6,28,7],[28,8,28,10],[28,11,28,14],[19,1,21,1],[19,2,19,10],[19,11,21,11],[19,12,19,14],[20,3,21,3],[20,6,21,6],[20,7,20,10],[20,13,21,13],[20,14,21,14],[17,1,17,6],[17,8,17,9],[17,10,17,14],[18,2,18,6],[18,7,18,9],[18,10,18,11],[18,12,18,14],[14,0,14,11],[14,12,14,15],[15,1,15,14],[16,1,16,4],[16,5,16,8],[16,9,16,14],[13,2,13,7],[13,8,13,10],[13,11,13,14],[4,7,4,10],[4,13,5,13],[4,14,5,14],[10,7,10,8],[10,9,10,10],[11,2,11,4],[11,5,11,14],[3,1,5,1],[3,2,3,10],[3,11,5,11],[3,12,3,14],[4,3,5,3],[4,6,5,6],[12,2,12,5],[12,6,12,7],[12,8,12,10],[12,11,12,14],[0,1,0,4],[0,5,0,8],[0,9,0,14],[1,1,1,6],[1,8,1,9],[1,10,1,14],[2,2,2,6],[2,7,2,9],[2,10,2,11],[2,12,2,14]]}
[null,"اداره / .........",null,null,null,"بيان درجات طالب",null,null,null,null,null,null,null,null,null,null,null,null,null,"عام"]
[null,"مدرسه / ..............."]
[null,"الاســم ",{"$f":"IFERROR(VLOOKUP($M$3,'رصد الترم الثانى'!$B$7:$C$212,2,0),\"\")","v":"اسلام محمدي عبد السميع عبد الغني"},null,null,null,null,null,null,null,"رقم الجلوس",null,700,null,null,null,null,null,null,null,null,null,null,null,null,null,null,null,null,null,null,null,null,null,702]
[null,"المادة","المـواد التى تضـاف للمجمـوع الكلـى",null,null,null,null,null,null,null,null,"المجموع الكلى","لاتضاف للمجموع"]
[null,null,"لغة عربية","رياضيات","دراسات","لغة","علـــوم","الأنشطة التربوية اللاصفية",null,null,null,null,"تربية","مستوىE","مستوىF"]
[null,null,"وخط",null,"إجتماعية","أجنبية",null,"الفنى","الرياضى","إختيارى1","إختيارى2",null,"دينية",null,null,null,null,"من","الى"]
[null,"النهاية الكبرى",100,80,40,40,40,20,20,20,20,380,40,"",40,null,null,7,35]
[null,"النهاية الصغرى",{"$f":"C7/2","v":50},{"$f":"D7/2","v":40},20,20,20,10,10,10,10,190,20,20,20]
[null,"الدرجه",{"$f":"IFERROR(VLOOKUP($M$3,'رصد الترم الثانى'!$B$7:$CX$212,12,0),\"\")","v":99.5},{"$f":"IFERROR(VLOOKUP($M$3,'رصد الترم الثانى'!$B$7:$CX$212,21,0),\"\")","v":79.2},{"$f":"IFERROR(VLOOKUP($M$3,'رصد الترم الثانى'!$B$7:$CX$212,30,0),\"\")","v":39.200000000000003},{"$f":"IFERROR(VLOOKUP($M$3,'رصد الترم الثانى'!$B$7:$CX$212,39,0),\"\")","v":39.6},{"$f":"IFERROR(VLOOKUP($M$3,'رصد الترم الثانى'!$B$7:$CX$212,50,0),\"\")","v":40},{"$f":"IFERROR(VLOOKUP($M$3,'رصد الترم الثانى'!$B$7:$CX$212,56,0),\"\")","v":20},{"$f":"IFERROR(VLOOKUP($M$3,'رصد الترم الثانى'!$B$7:$CX$212,61,0),\"\")","v":20},{"$f":"IFERROR(VLOOKUP($M$3,'رصد الترم الثانى'!$B$7:$CX$212,66,0),\"\")","v":20},{"$f":"IFERROR(VLOOKUP($M$3,'رصد الترم الثانى'!$B$7:$CX$212,71,0),\"\")","v":20},{"$f":"SUM(C9:K9)","v":377.5},{"$f":"IFERROR(VLOOKUP($M$3,'رصد الترم الثانى'!$B$7:$CX$212,81,0),\"\")","v":37.799999999999997}]
[null,"النسبة المئوية"]
[null,"التقدير",null,null,null,null,null,{"$f":"IFERROR(VLOOKUP($M$3,'رصد الترم الثانى'!$B$7:$CW$212,100,0),\"\")","v":"ناجــــح"},null,{"$f":"IFERROR(VLOOKUP($M$3,'رصد الترم الثانى'!$B$7:$CX$212,101,0),\"\")","v":"ومنقول للصف الخامس"}]
[null,"النتيجة"]
[null,null,null,null,null,null,"المراجعون",null,"رئيس لجنه النظام والمراقبه",null,null,"مدير المدرسه"]
[]
[]
[]
[null,"اداره / .........",null,null,null,"بيان درجات طالب",null,null,null,null,null,null,null,null,null,null,{"$f":"Q1+1","v":1}]
[null,"مدرسه / ..............."]
[null,"الاســم ",{"$f":"IFERROR(VLOOKUP($M$19,'رصد الترم الثانى'!$B$7:$C$212,2,0),\"\")","v":"السيد شريف عبد العليم السيد"},null,null,null,null,null,null,null,"رقم الجلوس",null,701,null,null,null,null,null,null,null,null,null,null,null,null,null,null,null,null,null,null,null,null,null,null,null,null,null,null,null,null,null,null,null,null,null,null,null,null,null,713]
[null,"المادة","المـواد التى تضـاف للمجمـوع الكلـى",null,null,null,null,null,null,null,null,"المجموع الكلى","لاتضاف للمجموع"]
{"$rows_left_out":41}