{"text_format":"1","workbook":"xlsx","n_sheets":2,"sheets":["Sheets1","Feuil1"],"not_rendered":{"charts":0,"images":0,"macros":0,"external_links":1,"defined_names":19,"comments":0,"pivot_tables":0},"unopened":[],"bounds":{"document_bytes":16777216,"sheet_cells":100000,"rows_first":2000,"rows_last":500,"rows_between":2000,"halvings":0,"cell_chars":16384,"cell_head_chars":4096},"cells_cut":0,"cells_raw":0,"read":"whole","date_system":"1900"}

{"sheet":"Sheets1","index":0,"n_rows":78,"n_cols":11,"rows_kept":78,"cut":false,"hidden":false,"merged":[]}
[]
["Date","Semaine","NOM","TCC","T001","T002","R1","R2","R3"]
["2022-04-15",15,"Ali",55,582.59,300.99,2345,0.35,2.74]
["2022-04-15",15,"Ali",55,584.35,305.05,0.09,0.26,3.04,null,"في الشيت الثاني يتم كتابة الإسم في الخانة C3 وتتم عملية تصفية الأعمدة R1 وR2وR3 تلقائيا على حسب الإسم "]
["2022-04-15",15,"Ali",55,null,null,0.1,0.19,2.73]
["2022-04-15",15,"Ali",55,635.30999999999995,332.81,100,200,300]
["2022-04-15",15,"BADR",55,616.19000000000005,343.99,800,0.35,4.1399999999999997]
["2022-04-15",15,"BADR",55,null,null,140,5,22]
["2022-04-15",15,"BADR",55,662.15,341.06,77,88,100]
["2022-04-15",15,"ALI",55,647.08000000000004,338.65,477,88,23,null,"قد تم عمل الملف  بواسطة الهاتف بنسخة اوفيس 365 حيث تفاجأت لاحقا انه لا يمكنني استخدمها على الجهاز عندي لأن نسخة الاوفيس عندي 2016  "]
["2022-04-15",15,"ALI",55,null,null,69,55,10,null,"المطلوب انشاء معادلة تقوم بنفس الدور لاكن تشتغل على النسخة التي عندي لأنه صعب اغيرها حاليا"]
["2022-04-15",15,"BADR",55,null,null,44,25,12]
["2022-04-15",15,"khalid",55,612.84,323.14,1407,75,11]
["2022-04-15",15,"hicham1470",55,612.20000000000005,321.2,745,47,1123]
["2022-04-15",15,"officena",55,853.27,460.97,25,14,14]
["2022-04-15",15,"tawfik",55,868.43,459.83,800,45,44]
["2022-04-15",15,"khalid",55]
["2022-04-15",15,"ALI",55,883.03,472.73,55,56,96]
["2022-04-15",15,"ALI",55,880.02,463.12,11,22,69]
["2022-04-15",15,"ALI",55,null,null,2,55,25]
["2022-04-15",15,"ALI",55,842.18,473.18,65,88,47]
["2022-04-15",15,"Ali",55,852.16,469.58,0.1,0.19,2.73]
["2022-04-15",15,"Ali",55,null,null,100,200,300]
["2022-04-15",15,"Ali",55,853.07,474.67,0.13,0.35,4.1399999999999997]
["2022-04-15",15,"Ali",55,854.1,473.3,140,5,22]
["2022-04-15",15,"BADR",55,null,null,77,88,100]
["2022-04-14",15,"BADR",55,561.24,294.94,477,88,23]
["2022-04-14",15,"BADR",55,568.05999999999995,297.16000000000003,69,55,10]
["2022-04-14",15,"ALI",55,null,null,44,25,12]
["2022-04-14",15,"ALI",55,null,null,1407,75,11]
{"$rows_left_out":49}
{"sheet":"Feuil1","index":1,"n_rows":98,"n_cols":4,"rows_kept":98,"cut":false,"hidden":false,"merged":[]}
["names"]
[null,null,"tawfik"]
[{"$f":"IFERROR(INDEX(names,MATCH(0,IF(ISBLANK(names),1,COUNTIF($A$2:A2,names)),0)),\"\")","v":"Ali"},"R1","R2","R3"]
[{"$f":"IFERROR(INDEX(names,MATCH(0,IF(ISBLANK(names),1,COUNTIF($A$2:A3,names)),0)),\"\")","v":"BADR"},{"$f":"IF(COUNTIF(Sheets1!$C$3:$C$365,$C$2)<ROWS(B$1:B1),\"\",INDEX(Sheets1!$G$3:$G$365,100000-SUMPRODUCT(LARGE((Sheets1!$C$3:$C$365=$C$2)*(100000-ROW(Sheets1!$C$3:$C$365)),ROWS(B$1:B1)))-2))","v":800},{"$f":"IF(COUNTIF(Sheets1!$C$3:$C$365,$C$2)<ROWS(B$1:B1),\"\",INDEX(Sheets1!$H$3:$H$365,100000-SUMPRODUCT(LARGE((Sheets1!$C$3:$C$365=$C$2)*(100000-ROW(Sheets1!$C$3:$C$365)),ROWS(B$1:B1)))-2))","v":45},{"$f":"IF(COUNTIF(Sheets1!$C$3:$C$365,$C$2)<ROWS(B$1:B1),\"\",INDEX(Sheets1!$I$3:$I$365,100000-SUMPRODUCT(LARGE((Sheets1!$C$3:$C$365=$C$2)*(100000-ROW(Sheets1!$C$3:$C$365)),ROWS(B$1:B1)))-2))","v":44}]
[{"$f":"IFERROR(INDEX(names,MATCH(0,IF(ISBLANK(names),1,COUNTIF($A$2:A4,names)),0)),\"\")","v":"khalid"},{"$f":"IF(COUNTIF(Sheets1!$C$3:$C$365,$C$2)<ROWS(B$1:B2),\"\",INDEX(Sheets1!$G$3:$G$365,100000-SUMPRODUCT(LARGE((Sheets1!$C$3:$C$365=$C$2)*(100000-ROW(Sheets1!$C$3:$C$365)),ROWS(B$1:B2)))-2))","v":745},{"$f":"IF(COUNTIF(Sheets1!$C$3:$C$365,$C$2)<ROWS(B$1:B2),\"\",INDEX(Sheets1!$H$3:$H$365,100000-SUMPRODUCT(LARGE((Sheets1!$C$3:$C$365=$C$2)*(100000-ROW(Sheets1!$C$3:$C$365)),ROWS(B$1:B2)))-2))","v":47},{"$f":"IF(COUNTIF(Sheets1!$C$3:$C$365,$C$2)<ROWS(B$1:B2),\"\",INDEX(Sheets1!$I$3:$I$365,100000-SUMPRODUCT(LARGE((Sheets1!$C$3:$C$365=$C$2)*(100000-ROW(Sheets1!$C$3:$C$365)),ROWS(B$1:B2)))-2))","v":1123}]
[{"$f":"IFERROR(INDEX(names,MATCH(0,IF(ISBLANK(names),1,COUNTIF($A$2:A5,names)),0)),\"\")","v":"hicham1470"},{"$f":"IF(COUNTIF(Sheets1!$C$3:$C$365,$C$2)<ROWS(B$1:B3),\"\",INDEX(Sheets1!$G$3:$G$365,100000-SUMPRODUCT(LARGE((Sheets1!$C$3:$C$365=$C$2)*(100000-ROW(Sheets1!$C$3:$C$365)),ROWS(B$1:B3)))-2))","v":745},{"$f":"IF(COUNTIF(Sheets1!$C$3:$C$365,$C$2)<ROWS(B$1:B3),\"\",INDEX(Sheets1!$H$3:$H$365,100000-SUMPRODUCT(LARGE((Sheets1!$C$3:$C$365=$C$2)*(100000-ROW(Sheets1!$C$3:$C$365)),ROWS(B$1:B3)))-2))","v":47},{"$f":"IF(COUNTIF(Sheets1!$C$3:$C$365,$C$2)<ROWS(B$1:B3),\"\",INDEX(Sheets1!$I$3:$I$365,100000-SUMPRODUCT(LARGE((Sheets1!$C$3:$C$365=$C$2)*(100000-ROW(Sheets1!$C$3:$C$365)),ROWS(B$1:B3)))-2))","v":1123}]
[{"$f":"IFERROR(INDEX(names,MATCH(0,IF(ISBLANK(names),1,COUNTIF($A$2:A6,names)),0)),\"\")","v":"officena"},{"$f":"IF(COUNTIF(Sheets1!$C$3:$C$365,$C$2)<ROWS(B$1:B4),\"\",INDEX(Sheets1!$G$3:$G$365,100000-SUMPRODUCT(LARGE((Sheets1!$C$3:$C$365=$C$2)*(100000-ROW(Sheets1!$C$3:$C$365)),ROWS(B$1:B4)))-2))","v":""},{"$f":"IF(COUNTIF(Sheets1!$C$3:$C$365,$C$2)<ROWS(B$1:B4),\"\",INDEX(Sheets1!$H$3:$H$365,100000-SUMPRODUCT(LARGE((Sheets1!$C$3:$C$365=$C$2)*(100000-ROW(Sheets1!$C$3:$C$365)),ROWS(B$1:B4)))-2))","v":""},{"$f":"IF(COUNTIF(Sheets1!$C$3:$C$365,$C$2)<ROWS(B$1:B4),\"\",INDEX(Sheets1!$I$3:$I$365,100000-SUMPRODUCT(LARGE((Sheets1!$C$3:$C$365=$C$2)*(100000-ROW(Sheets1!$C$3:$C$365)),ROWS(B$1:B4)))-2))","v":""}]
[{"$f":"IFERROR(INDEX(names,MATCH(0,IF(ISBLANK(names),1,COUNTIF($A$2:A7,names)),0)),\"\")","v":"tawfik"},{"$f":"IF(COUNTIF(Sheets1!$C$3:$C$365,$C$2)<ROWS(B$1:B5),\"\",INDEX(Sheets1!$G$3:$G$365,100000-SUMPRODUCT(LARGE((Sheets1!$C$3:$C$365=$C$2)*(100000-ROW(Sheets1!$C$3:$C$365)),ROWS(B$1:B5)))-2))","v":""},{"$f":"IF(COUNTIF(Sheets1!$C$3:$C$365,$C$2)<ROWS(B$1:B5),\"\",INDEX(Sheets1!$H$3:$H$365,100000-SUMPRODUCT(LARGE((Sheets1!$C$3:$C$365=$C$2)*(100000-ROW(Sheets1!$C$3:$C$365)),ROWS(B$1:B5)))-2))","v":""},{"$f":"IF(COUNTIF(Sheets1!$C$3:$C$365,$C$2)<ROWS(B$1:B5),\"\",INDEX(Sheets1!$I$3:$I$365,100000-SUMPRODUCT(LARGE((Sheets1!$C$3:$C$365=$C$2)*(100000-ROW(Sheets1!$C$3:$C$365)),ROWS(B$1:B5)))-2))","v":""}]
[{"$f":"IFERROR(INDEX(names,MATCH(0,IF(ISBLANK(names),1,COUNTIF($A$2:A8,names)),0)),\"\")","v":""},{"$f":"IF(COUNTIF(Sheets1!$C$3:$C$365,$C$2)<ROWS(B$1:B6),\"\",INDEX(Sheets1!$G$3:$G$365,100000-SUMPRODUCT(LARGE((Sheets1!$C$3:$C$365=$C$2)*(100000-ROW(Sheets1!$C$3:$C$365)),ROWS(B$1:B6)))-2))","v":""},{"$f":"IF(COUNTIF(Sheets1!$C$3:$C$365,$C$2)<ROWS(B$1:B6),\"\",INDEX(Sheets1!$H$3:$H$365,100000-SUMPRODUCT(LARGE((Sheets1!$C$3:$C$365=$C$2)*(100000-ROW(Sheets1!$C$3:$C$365)),ROWS(B$1:B6)))-2))","v":""},{"$f":"IF(COUNTIF(Sheets1!$C$3:$C$365,$C$2)<ROWS(B$1:B6),\"\",INDEX(Sheets1!$I$3:$I$365,100000-SUMPRODUCT(LARGE((Sheets1!$C$3:$C$365=$C$2)*(100000-ROW(Sheets1!$C$3:$C$365)),ROWS(B$1:B6)))-2))","v":""}]
[{"$f":"IFERROR(INDEX(names,MATCH(0,IF(ISBLANK(names),1,COUNTIF($A$2:A9,names)),0)),\"\")","v":""},{"$f":"IF(COUNTIF(Sheets1!$C$3:$C$365,$C$2)<ROWS(B$1:B7),\"\",INDEX(Sheets1!$G$3:$G$365,100000-SUMPRODUCT(LARGE((Sheets1!$C$3:$C$365=$C$2)*(100000-ROW(Sheets1!$C$3:$C$365)),ROWS(B$1:B7)))-2))","v":""},{"$f":"IF(COUNTIF(Sheets1!$C$3:$C$365,$C$2)<ROWS(B$1:B7),\"\",INDEX(Sheets1!$H$3:$H$365,100000-SUMPRODUCT(LARGE((Sheets1!$C$3:$C$365=$C$2)*(100000-ROW(Sheets1!$C$3:$C$365)),ROWS(B$1:B7)))-2))","v":""},{"$f":"IF(COUNTIF(Sheets1!$C$3:$C$365,$C$2)<ROWS(B$1:B7),\"\",INDEX(Sheets1!$I$3:$I$365,100000-SUMPRODUCT(LARGE((Sheets1!$C$3:$C$365=$C$2)*(100000-ROW(Sheets1!$C$3:$C$365)),ROWS(B$1:B7)))-2))","v":""}]
[{"$f":"IFERROR(INDEX(names,MATCH(0,IF(ISBLANK(names),1,COUNTIF($A$2:A10,names)),0)),\"\")","v":""},{"$f":"IF(COUNTIF(Sheets1!$C$3:$C$365,$C$2)<ROWS(B$1:B8),\"\",INDEX(Sheets1!$G$3:$G$365,100000-SUMPRODUCT(LARGE((Sheets1!$C$3:$C$365=$C$2)*(100000-ROW(Sheets1!$C$3:$C$365)),ROWS(B$1:B8)))-2))","v":""},{"$f":"IF(COUNTIF(Sheets1!$C$3:$C$365,$C$2)<ROWS(B$1:B8),\"\",INDEX(Sheets1!$H$3:$H$365,100000-SUMPRODUCT(LARGE((Sheets1!$C$3:$C$365=$C$2)*(100000-ROW(Sheets1!$C$3:$C$365)),ROWS(B$1:B8)))-2))","v":""},{"$f":"IF(COUNTIF(Sheets1!$C$3:$C$365,$C$2)<ROWS(B$1:B8),\"\",INDEX(Sheets1!$I$3:$I$365,100000-SUMPRODUCT(LARGE((Sheets1!$C$3:$C$365=$C$2)*(100000-ROW(Sheets1!$C$3:$C$365)),ROWS(B$1:B8)))-2))","v":""}]
[{"$f":"IFERROR(INDEX(names,MATCH(0,IF(ISBLANK(names),1,COUNTIF($A$2:A11,names)),0)),\"\")","v":""},{"$f":"IF(COUNTIF(Sheets1!$C$3:$C$365,$C$2)<ROWS(B$1:B9),\"\",INDEX(Sheets1!$G$3:$G$365,100000-SUMPRODUCT(LARGE((Sheets1!$C$3:$C$365=$C$2)*(100000-ROW(Sheets1!$C$3:$C$365)),ROWS(B$1:B9)))-2))","v":""},{"$f":"IF(COUNTIF(Sheets1!$C$3:$C$365,$C$2)<ROWS(B$1:B9),\"\",INDEX(Sheets1!$H$3:$H$365,100000-SUMPRODUCT(LARGE((Sheets1!$C$3:$C$365=$C$2)*(100000-ROW(Sheets1!$C$3:$C$365)),ROWS(B$1:B9)))-2))","v":""},{"$f":"IF(COUNTIF(Sheets1!$C$3:$C$365,$C$2)<ROWS(B$1:B9),\"\",INDEX(Sheets1!$I$3:$I$365,100000-SUMPRODUCT(LARGE((Sheets1!$C$3:$C$365=$C$2)*(100000-ROW(Sheets1!$C$3:$C$365)),ROWS(B$1:B9)))-2))","v":""}]
[{"$f":"IFERROR(INDEX(names,MATCH(0,IF(ISBLANK(names),1,COUNTIF($A$2:A12,names)),0)),\"\")","v":""},{"$f":"IF(COUNTIF(Sheets1!$C$3:$C$365,$C$2)<ROWS(B$1:B10),\"\",INDEX(Sheets1!$G$3:$G$365,100000-SUMPRODUCT(LARGE((Sheets1!$C$3:$C$365=$C$2)*(100000-ROW(Sheets1!$C$3:$C$365)),ROWS(B$1:B10)))-2))","v":""},{"$f":"IF(COUNTIF(Sheets1!$C$3:$C$365,$C$2)<ROWS(B$1:B10),\"\",INDEX(Sheets1!$H$3:$H$365,100000-SUMPRODUCT(LARGE((Sheets1!$C$3:$C$365=$C$2)*(100000-ROW(Sheets1!$C$3:$C$365)),ROWS(B$1:B10)))-2))","v":""},{"$f":"IF(COUNTIF(Sheets1!$C$3:$C$365,$C$2)<ROWS(B$1:B10),\"\",INDEX(Sheets1!$I$3:$I$365,100000-SUMPRODUCT(LARGE((Sheets1!$C$3:$C$365=$C$2)*(100000-ROW(Sheets1!$C$3:$C$365)),ROWS(B$1:B10)))-2))","v":""}]
[null,{"$f":"IF(COUNTIF(Sheets1!$C$3:$C$365,$C$2)<ROWS(B$1:B11),\"\",INDEX(Sheets1!$G$3:$G$365,100000-SUMPRODUCT(LARGE((Sheets1!$C$3:$C$365=$C$2)*(100000-ROW(Sheets1!$C$3:$C$365)),ROWS(B$1:B11)))-2))","v":""},{"$f":"IF(COUNTIF(Sheets1!$C$3:$C$365,$C$2)<ROWS(B$1:B11),\"\",INDEX(Sheets1!$H$3:$H$365,100000-SUMPRODUCT(LARGE((Sheets1!$C$3:$C$365=$C$2)*(100000-ROW(Sheets1!$C$3:$C$365)),ROWS(B$1:B11)))-2))","v":""},{"$f":"IF(COUNTIF(Sheets1!$C$3:$C$365,$C$2)<ROWS(B$1:B11),\"\",INDEX(Sheets1!$I$3:$I$365,100000-SUMPRODUCT(LARGE((Sheets1!$C$3:$C$365=$C$2)*(100000-ROW(Sheets1!$C$3:$C$365)),ROWS(B$1:B11)))-2))","v":""}]
[null,{"$f":"IF(COUNTIF(Sheets1!$C$3:$C$365,$C$2)<ROWS(B$1:B12),\"\",INDEX(Sheets1!$G$3:$G$365,100000-SUMPRODUCT(LARGE((Sheets1!$C$3:$C$365=$C$2)*(100000-ROW(Sheets1!$C$3:$C$365)),ROWS(B$1:B12)))-2))","v":""},{"$f":"IF(COUNTIF(Sheets1!$C$3:$C$365,$C$2)<ROWS(B$1:B12),\"\",INDEX(Sheets1!$H$3:$H$365,100000-SUMPRODUCT(LARGE((Sheets1!$C$3:$C$365=$C$2)*(100000-ROW(Sheets1!$C$3:$C$365)),ROWS(B$1:B12)))-2))","v":""},{"$f":"IF(COUNTIF(Sheets1!$C$3:$C$365,$C$2)<ROWS(B$1:B12),\"\",INDEX(Sheets1!$I$3:$I$365,100000-SUMPRODUCT(LARGE((Sheets1!$C$3:$C$365=$C$2)*(100000-ROW(Sheets1!$C$3:$C$365)),ROWS(B$1:B12)))-2))","v":""}]
[null,{"$f":"IF(COUNTIF(Sheets1!$C$3:$C$365,$C$2)<ROWS(B$1:B13),\"\",INDEX(Sheets1!$G$3:$G$365,100000-SUMPRODUCT(LARGE((Sheets1!$C$3:$C$365=$C$2)*(100000-ROW(Sheets1!$C$3:$C$365)),ROWS(B$1:B13)))-2))","v":""},{"$f":"IF(COUNTIF(Sheets1!$C$3:$C$365,$C$2)<ROWS(B$1:B13),\"\",INDEX(Sheets1!$H$3:$H$365,100000-SUMPRODUCT(LARGE((Sheets1!$C$3:$C$365=$C$2)*(100000-ROW(Sheets1!$C$3:$C$365)),ROWS(B$1:B13)))-2))","v":""},{"$f":"IF(COUNTIF(Sheets1!$C$3:$C$365,$C$2)<ROWS(B$1:B13),\"\",INDEX(Sheets1!$I$3:$I$365,100000-SUMPRODUCT(LARGE((Sheets1!$C$3:$C$365=$C$2)*(100000-ROW(Sheets1!$C$3:$C$365)),ROWS(B$1:B13)))-2))","v":""}]
[null,{"$f":"IF(COUNTIF(Sheets1!$C$3:$C$365,$C$2)<ROWS(B$1:B14),\"\",INDEX(Sheets1!$G$3:$G$365,100000-SUMPRODUCT(LARGE((Sheets1!$C$3:$C$365=$C$2)*(100000-ROW(Sheets1!$C$3:$C$365)),ROWS(B$1:B14)))-2))","v":""},{"$f":"IF(COUNTIF(Sheets1!$C$3:$C$365,$C$2)<ROWS(B$1:B14),\"\",INDEX(Sheets1!$H$3:$H$365,100000-SUMPRODUCT(LARGE((Sheets1!$C$3:$C$365=$C$2)*(100000-ROW(Sheets1!$C$3:$C$365)),ROWS(B$1:B14)))-2))","v":""},{"$f":"IF(COUNTIF(Sheets1!$C$3:$C$365,$C$2)<ROWS(B$1:B14),\"\",INDEX(Sheets1!$I$3:$I$365,100000-SUMPRODUCT(LARGE((Sheets1!$C$3:$C$365=$C$2)*(100000-ROW(Sheets1!$C$3:$C$365)),ROWS(B$1:B14)))-2))","v":""}]
[null,{"$f":"IF(COUNTIF(Sheets1!$C$3:$C$365,$C$2)<ROWS(B$1:B15),\"\",INDEX(Sheets1!$G$3:$G$365,100000-SUMPRODUCT(LARGE((Sheets1!$C$3:$C$365=$C$2)*(100000-ROW(Sheets1!$C$3:$C$365)),ROWS(B$1:B15)))-2))","v":""},{"$f":"IF(COUNTIF(Sheets1!$C$3:$C$365,$C$2)<ROWS(B$1:B15),\"\",INDEX(Sheets1!$H$3:$H$365,100000-SUMPRODUCT(LARGE((Sheets1!$C$3:$C$365=$C$2)*(100000-ROW(Sheets1!$C$3:$C$365)),ROWS(B$1:B15)))-2))","v":""},{"$f":"IF(COUNTIF(Sheets1!$C$3:$C$365,$C$2)<ROWS(B$1:B15),\"\",INDEX(Sheets1!$I$3:$I$365,100000-SUMPRODUCT(LARGE((Sheets1!$C$3:$C$365=$C$2)*(100000-ROW(Sheets1!$C$3:$C$365)),ROWS(B$1:B15)))-2))","v":""}]
[null,{"$f":"IF(COUNTIF(Sheets1!$C$3:$C$365,$C$2)<ROWS(B$1:B16),\"\",INDEX(Sheets1!$G$3:$G$365,100000-SUMPRODUCT(LARGE((Sheets1!$C$3:$C$365=$C$2)*(100000-ROW(Sheets1!$C$3:$C$365)),ROWS(B$1:B16)))-2))","v":""},{"$f":"IF(COUNTIF(Sheets1!$C$3:$C$365,$C$2)<ROWS(B$1:B16),\"\",INDEX(Sheets1!$H$3:$H$365,100000-SUMPRODUCT(LARGE((Sheets1!$C$3:$C$365=$C$2)*(100000-ROW(Sheets1!$C$3:$C$365)),ROWS(B$1:B16)))-2))","v":""},{"$f":"IF(COUNTIF(Sheets1!$C$3:$C$365,$C$2)<ROWS(B$1:B16),\"\",INDEX(Sheets1!$I$3:$I$365,100000-SUMPRODUCT(LARGE((Sheets1!$C$3:$C$365=$C$2)*(100000-ROW(Sheets1!$C$3:$C$365)),ROWS(B$1:B16)))-2))","v":""}]
[null,{"$f":"IF(COUNTIF(Sheets1!$C$3:$C$365,$C$2)<ROWS(B$1:B17),\"\",INDEX(Sheets1!$G$3:$G$365,100000-SUMPRODUCT(LARGE((Sheets1!$C$3:$C$365=$C$2)*(100000-ROW(Sheets1!$C$3:$C$365)),ROWS(B$1:B17)))-2))","v":""},{"$f":"IF(COUNTIF(Sheets1!$C$3:$C$365,$C$2)<ROWS(B$1:B17),\"\",INDEX(Sheets1!$H$3:$H$365,100000-SUMPRODUCT(LARGE((Sheets1!$C$3:$C$365=$C$2)*(100000-ROW(Sheets1!$C$3:$C$365)),ROWS(B$1:B17)))-2))","v":""},{"$f":"IF(COUNTIF(Sheets1!$C$3:$C$365,$C$2)<ROWS(B$1:B17),\"\",INDEX(Sheets1!$I$3:$I$365,100000-SUMPRODUCT(LARGE((Sheets1!$C$3:$C$365=$C$2)*(100000-ROW(Sheets1!$C$3:$C$365)),ROWS(B$1:B17)))-2))","v":""}]
[null,{"$f":"IF(COUNTIF(Sheets1!$C$3:$C$365,$C$2)<ROWS(B$1:B18),\"\",INDEX(Sheets1!$G$3:$G$365,100000-SUMPRODUCT(LARGE((Sheets1!$C$3:$C$365=$C$2)*(100000-ROW(Sheets1!$C$3:$C$365)),ROWS(B$1:B18)))-2))","v":""},{"$f":"IF(COUNTIF(Sheets1!$C$3:$C$365,$C$2)<ROWS(B$1:B18),\"\",INDEX(Sheets1!$H$3:$H$365,100000-SUMPRODUCT(LARGE((Sheets1!$C$3:$C$365=$C$2)*(100000-ROW(Sheets1!$C$3:$C$365)),ROWS(B$1:B18)))-2))","v":""},{"$f":"IF(COUNTIF(Sheets1!$C$3:$C$365,$C$2)<ROWS(B$1:B18),\"\",INDEX(Sheets1!$I$3:$I$365,100000-SUMPRODUCT(LARGE((Sheets1!$C$3:$C$365=$C$2)*(100000-ROW(Sheets1!$C$3:$C$365)),ROWS(B$1:B18)))-2))","v":""}]
[null,{"$f":"IF(COUNTIF(Sheets1!$C$3:$C$365,$C$2)<ROWS(B$1:B19),\"\",INDEX(Sheets1!$G$3:$G$365,100000-SUMPRODUCT(LARGE((Sheets1!$C$3:$C$365=$C$2)*(100000-ROW(Sheets1!$C$3:$C$365)),ROWS(B$1:B19)))-2))","v":""},{"$f":"IF(COUNTIF(Sheets1!$C$3:$C$365,$C$2)<ROWS(B$1:B19),\"\",INDEX(Sheets1!$H$3:$H$365,100000-SUMPRODUCT(LARGE((Sheets1!$C$3:$C$365=$C$2)*(100000-ROW(Sheets1!$C$3:$C$365)),ROWS(B$1:B19)))-2))","v":""},{"$f":"IF(COUNTIF(Sheets1!$C$3:$C$365,$C$2)<ROWS(B$1:B19),\"\",INDEX(Sheets1!$I$3:$I$365,100000-SUMPRODUCT(LARGE((Sheets1!$C$3:$C$365=$C$2)*(100000-ROW(Sheets1!$C$3:$C$365)),ROWS(B$1:B19)))-2))","v":""}]
[null,{"$f":"IF(COUNTIF(Sheets1!$C$3:$C$365,$C$2)<ROWS(B$1:B20),\"\",INDEX(Sheets1!$G$3:$G$365,100000-SUMPRODUCT(LARGE((Sheets1!$C$3:$C$365=$C$2)*(100000-ROW(Sheets1!$C$3:$C$365)),ROWS(B$1:B20)))-2))","v":""},{"$f":"IF(COUNTIF(Sheets1!$C$3:$C$365,$C$2)<ROWS(B$1:B20),\"\",INDEX(Sheets1!$H$3:$H$365,100000-SUMPRODUCT(LARGE((Sheets1!$C$3:$C$365=$C$2)*(100000-ROW(Sheets1!$C$3:$C$365)),ROWS(B$1:B20)))-2))","v":""},{"$f":"IF(COUNTIF(Sheets1!$C$3:$C$365,$C$2)<ROWS(B$1:B20),\"\",INDEX(Sheets1!$I$3:$I$365,100000-SUMPRODUCT(LARGE((Sheets1!$C$3:$C$365=$C$2)*(100000-ROW(Sheets1!$C$3:$C$365)),ROWS(B$1:B20)))-2))","v":""}]
[null,{"$f":"IF(COUNTIF(Sheets1!$C$3:$C$365,$C$2)<ROWS(B$1:B21),\"\",INDEX(Sheets1!$G$3:$G$365,100000-SUMPRODUCT(LARGE((Sheets1!$C$3:$C$365=$C$2)*(100000-ROW(Sheets1!$C$3:$C$365)),ROWS(B$1:B21)))-2))","v":""},{"$f":"IF(COUNTIF(Sheets1!$C$3:$C$365,$C$2)<ROWS(B$1:B21),\"\",INDEX(Sheets1!$H$3:$H$365,100000-SUMPRODUCT(LARGE((Sheets1!$C$3:$C$365=$C$2)*(100000-ROW(Sheets1!$C$3:$C$365)),ROWS(B$1:B21)))-2))","v":""},{"$f":"IF(COUNTIF(Sheets1!$C$3:$C$365,$C$2)<ROWS(B$1:B21),\"\",INDEX(Sheets1!$I$3:$I$365,100000-SUMPRODUCT(LARGE((Sheets1!$C$3:$C$365=$C$2)*(100000-ROW(Sheets1!$C$3:$C$365)),ROWS(B$1:B21)))-2))","v":""}]
[null,{"$f":"IF(COUNTIF(Sheets1!$C$3:$C$365,$C$2)<ROWS(B$1:B22),\"\",INDEX(Sheets1!$G$3:$G$365,100000-SUMPRODUCT(LARGE((Sheets1!$C$3:$C$365=$C$2)*(100000-ROW(Sheets1!$C$3:$C$365)),ROWS(B$1:B22)))-2))","v":""},{"$f":"IF(COUNTIF(Sheets1!$C$3:$C$365,$C$2)<ROWS(B$1:B22),\"\",INDEX(Sheets1!$H$3:$H$365,100000-SUMPRODUCT(LARGE((Sheets1!$C$3:$C$365=$C$2)*(100000-ROW(Sheets1!$C$3:$C$365)),ROWS(B$1:B22)))-2))","v":""},{"$f":"IF(COUNTIF(Sheets1!$C$3:$C$365,$C$2)<ROWS(B$1:B22),\"\",INDEX(Sheets1!$I$3:$I$365,100000-SUMPRODUCT(LARGE((Sheets1!$C$3:$C$365=$C$2)*(100000-ROW(Sheets1!$C$3:$C$365)),ROWS(B$1:B22)))-2))","v":""}]
[null,{"$f":"IF(COUNTIF(Sheets1!$C$3:$C$365,$C$2)<ROWS(B$1:B23),\"\",INDEX(Sheets1!$G$3:$G$365,100000-SUMPRODUCT(LARGE((Sheets1!$C$3:$C$365=$C$2)*(100000-ROW(Sheets1!$C$3:$C$365)),ROWS(B$1:B23)))-2))","v":""},{"$f":"IF(COUNTIF(Sheets1!$C$3:$C$365,$C$2)<ROWS(B$1:B23),\"\",INDEX(Sheets1!$H$3:$H$365,100000-SUMPRODUCT(LARGE((Sheets1!$C$3:$C$365=$C$2)*(100000-ROW(Sheets1!$C$3:$C$365)),ROWS(B$1:B23)))-2))","v":""},{"$f":"IF(COUNTIF(Sheets1!$C$3:$C$365,$C$2)<ROWS(B$1:B23),\"\",INDEX(Sheets1!$I$3:$I$365,100000-SUMPRODUCT(LARGE((Sheets1!$C$3:$C$365=$C$2)*(100000-ROW(Sheets1!$C$3:$C$365)),ROWS(B$1:B23)))-2))","v":""}]
[null,{"$f":"IF(COUNTIF(Sheets1!$C$3:$C$365,$C$2)<ROWS(B$1:B24),\"\",INDEX(Sheets1!$G$3:$G$365,100000-SUMPRODUCT(LARGE((Sheets1!$C$3:$C$365=$C$2)*(100000-ROW(Sheets1!$C$3:$C$365)),ROWS(B$1:B24)))-2))","v":""},{"$f":"IF(COUNTIF(Sheets1!$C$3:$C$365,$C$2)<ROWS(B$1:B24),\"\",INDEX(Sheets1!$H$3:$H$365,100000-SUMPRODUCT(LARGE((Sheets1!$C$3:$C$365=$C$2)*(100000-ROW(Sheets1!$C$3:$C$365)),ROWS(B$1:B24)))-2))","v":""},{"$f":"IF(COUNTIF(Sheets1!$C$3:$C$365,$C$2)<ROWS(B$1:B24),\"\",INDEX(Sheets1!$I$3:$I$365,100000-SUMPRODUCT(LARGE((Sheets1!$C$3:$C$365=$C$2)*(100000-ROW(Sheets1!$C$3:$C$365)),ROWS(B$1:B24)))-2))","v":""}]
[null,{"$f":"IF(COUNTIF(Sheets1!$C$3:$C$365,$C$2)<ROWS(B$1:B25),\"\",INDEX(Sheets1!$G$3:$G$365,100000-SUMPRODUCT(LARGE((Sheets1!$C$3:$C$365=$C$2)*(100000-ROW(Sheets1!$C$3:$C$365)),ROWS(B$1:B25)))-2))","v":""},{"$f":"IF(COUNTIF(Sheets1!$C$3:$C$365,$C$2)<ROWS(B$1:B25),\"\",INDEX(Sheets1!$H$3:$H$365,100000-SUMPRODUCT(LARGE((Sheets1!$C$3:$C$365=$C$2)*(100000-ROW(Sheets1!$C$3:$C$365)),ROWS(B$1:B25)))-2))","v":""},{"$f":"IF(COUNTIF(Sheets1!$C$3:$C$365,$C$2)<ROWS(B$1:B25),\"\",INDEX(Sheets1!$I$3:$I$365,100000-SUMPRODUCT(LARGE((Sheets1!$C$3:$C$365=$C$2)*(100000-ROW(Sheets1!$C$3:$C$365)),ROWS(B$1:B25)))-2))","v":""}]
[null,{"$f":"IF(COUNTIF(Sheets1!$C$3:$C$365,$C$2)<ROWS(B$1:B26),\"\",INDEX(Sheets1!$G$3:$G$365,100000-SUMPRODUCT(LARGE((Sheets1!$C$3:$C$365=$C$2)*(100000-ROW(Sheets1!$C$3:$C$365)),ROWS(B$1:B26)))-2))","v":""},{"$f":"IF(COUNTIF(Sheets1!$C$3:$C$365,$C$2)<ROWS(B$1:B26),\"\",INDEX(Sheets1!$H$3:$H$365,100000-SUMPRODUCT(LARGE((Sheets1!$C$3:$C$365=$C$2)*(100000-ROW(Sheets1!$C$3:$C$365)),ROWS(B$1:B26)))-2))","v":""},{"$f":"IF(COUNTIF(Sheets1!$C$3:$C$365,$C$2)<ROWS(B$1:B26),\"\",INDEX(Sheets1!$I$3:$I$365,100000-SUMPRODUCT(LARGE((Sheets1!$C$3:$C$365=$C$2)*(100000-ROW(Sheets1!$C$3:$C$365)),ROWS(B$1:B26)))-2))","v":""}]
[null,{"$f":"IF(COUNTIF(Sheets1!$C$3:$C$365,$C$2)<ROWS(B$1:B27),\"\",INDEX(Sheets1!$G$3:$G$365,100000-SUMPRODUCT(LARGE((Sheets1!$C$3:$C$365=$C$2)*(100000-ROW(Sheets1!$C$3:$C$365)),ROWS(B$1:B27)))-2))","v":""},{"$f":"IF(COUNTIF(Sheets1!$C$3:$C$365,$C$2)<ROWS(B$1:B27),\"\",INDEX(Sheets1!$H$3:$H$365,100000-SUMPRODUCT(LARGE((Sheets1!$C$3:$C$365=$C$2)*(100000-ROW(Sheets1!$C$3:$C$365)),ROWS(B$1:B27)))-2))","v":""},{"$f":"IF(COUNTIF(Sheets1!$C$3:$C$365,$C$2)<ROWS(B$1:B27),\"\",INDEX(Sheets1!$I$3:$I$365,100000-SUMPRODUCT(LARGE((Sheets1!$C$3:$C$365=$C$2)*(100000-ROW(Sheets1!$C$3:$C$365)),ROWS(B$1:B27)))-2))","v":""}]
{"$rows_left_out":68}