{"text_format":"1","workbook":"xlsx","n_sheets":4,"sheets":["بيع الهلال","DATA","MAIN","SELL"],"not_rendered":{"charts":0,"images":0,"macros":1,"external_links":1,"defined_names":8,"comments":0,"pivot_tables":0},"unopened":[],"bounds":{"document_bytes":16777216,"sheet_cells":100000,"rows_first":2000,"rows_last":500,"rows_between":2000,"halvings":0,"cell_chars":16384,"cell_head_chars":4096},"cells_cut":0,"cells_raw":0,"read":"whole","date_system":"1900"}

{"sheet":"بيع الهلال","index":0,"n_rows":177,"n_cols":58,"rows_kept":177,"cut":false,"hidden":false,"merged":[[67,1,67,3],[68,1,68,3],[69,1,69,3],[70,1,70,3]]}
[{"$f":"COLUMN()","v":1},{"$f":"COLUMN()","v":2},{"$f":"COLUMN()","v":3},{"$f":"COLUMN()","v":4},{"$f":"COLUMN()","v":5},{"$f":"COLUMN()","v":6},{"$f":"COLUMN()","v":7},{"$f":"COLUMN()","v":8},{"$f":"COLUMN()","v":9},{"$f":"COLUMN()","v":10},{"$f":"COLUMN()","v":11},{"$f":"COLUMN()","v":12},"عمرو","عمرو","عمرو","عمرو","عمرو","هشام","عمرو","هشام","عمرو","عمرو","هشام","عمرو","عمرو","عمرو","عمرو","عمرو","هشام","هشام","عمرو","عمرو","عمرو","عمرو","عمرو","احمد سمير","احمد سمير","احمد سمير","احمد سمير","احمد سمير","عمرو","عمرو","عمرو","احمد سمير","احمد سمير","احمد سمير","احمد سمير","احمد سمير","احمد سمير"]
["م","كود الصنف","Barcode","الإسم الجديد للمنتج على التغليف و السيستم","Brand","العائلة","الوحدة","قائمة الاساسيه  غير شامله الضريبه","قائمة الاساسيه   شامله الضريبه","قائمة الجمله   شامله الضريبه","قائمه الاسعار بعد الزياده شامله الضريبه ","قائمة التجزئه   شامله الضريبه","بيع يوم 3/4/2022","بيع يوم 3/4/2022","بيع يوم 4/4/2022","بيع يوم 4/4/2022","بيع يوم 4/4/2022","بيع يوم 5/4/2022","بيع يوم 5/4/2022","بيع يوم 6/4/2022","بيع يوم 6/4/2022","بيع يوم 7/4/2022","بيع يوم 7/4/2022","بيع يوم 9/4/2022","بيع يوم 10/4/2022","بيع يوم 10/4/2022","بيع يوم 10/4/2022","بيع يوم 10/4/2022","بيع يوم 11/4/2022","بيع يوم 11/4/2022","بيع يوم 11/4/2022","بيع يوم 11/4/2022","بيع يوم 11/4/2022","بيع يوم 11/4/2022","بيع يوم 11/4/2022","بيع يوم 11/4/2022","بيع يوم 11/4/2022","بيع يوم 11/4/2022","بيع يوم 11/4/2022","بيع يوم 11/4/2022","بيع يوم 12/4/2022","بيع يوم 12/4/2022","بيع يوم 12/4/2022","بيع يوم 12/4/2022","بيع يوم 12/4/2022","بيع يوم 12/4/2022","بيع يوم 12/4/2022","بيع يوم 12/4/2022","بيع يوم 12/4/2022"]
[1,410110065,6222016100657,"فرشة ايديال ناعمة ","Helal","فرش و مكانس","قطعة",10.626987628105244,{"$f":"H3+(H3*14%)","v":12.114765896039978},{"$f":"I3-(I3*12%)","v":10.66099398851518},{"$f":"VLOOKUP(B3,'[1]مخزن الهلال'!$B$81:$D$153,3,0)","v":13.28},{"$f":"I3-(I3*7%)","v":11.266732283317181},null,null,null,12,null,null,null,null,12,null,12,48,12,null,null,12,null,null,null,null,null,null,null,null,null,null,null,null,null,null,null,null,null,12]
[{"$f":"A3+1","v":2},410110107,6222016101074,"فرشة روما لوكس","Helal","فرش و مكانس","قطعة",11.304033279073975,12.886597938144332,11.340206185567013,{"$f":"VLOOKUP(B4,'[1]مخزن الهلال'!$B$81:$D$153,3,0)","v":14.61},11.984536082474229,12,12,12,null,null,null,null,12,12,24,null,24,12,null,12,12,{"$f":"10*12","v":120},null,null,null,12,null,12,12,12,12,null,12,null,null,null,null,null,null,24,12]
[3,410110104,6222016101043,"فرشة لوكس الهلال","Helal","فرش و مكانس","قطعة",14,15.96,14.0448,{"$f":"VLOOKUP(B5,'[1]مخزن الهلال'!$B$81:$D$153,3,0)","v":23.47},14.8428]
[4,410110066,6222016100664,"فرشة ايديال خشنة","Helal","فرش و مكانس","قطعة",11.586634111050826,13.208762886597942,11.623711340206189,{"$f":"VLOOKUP(B6,'[1]مخزن الهلال'!$B$81:$D$153,3,0)","v":14.53},12.284149484536085,null,null,null,null,null,null,null,null,null,null,12,null,null,null,null,null,null,null,null,null,null,null,null,null,null,null,6,null,null,null,null,null,null,12]
[5,410110058,6222016100589,"فرشة ميكس الهلال","Helal","فرش و مكانس","قطعة",15.731446313377948,17.93384879725086,15.781786941580757,{"$f":"VLOOKUP(B7,'[1]مخزن الهلال'!$B$81:$D$153,3,0)","v":19.73},16.678479381443299,null,null,null,null,null,null,null,null,null,null,null,null,null,null,12]
[6,410110063,6222016100633,"فرشة هلين اسود","Helal","فرش و مكانس","قطعة",15.072044372098635,17.182130584192443,15.12027491408935,{"$f":"VLOOKUP(B8,'[1]مخزن الهلال'!$B$81:$D$153,3,0)","v":23.16},15.979381443298971]
[7,410110062,6222016100626,"فرشة سوبر هلين ناعم","Helal","فرش و مكانس","قطعة",15.731446313377948,17.93384879725086,15.781786941580757,{"$f":"VLOOKUP(B9,'[1]مخزن الهلال'!$B$81:$D$153,3,0)","v":24.15},16.678479381443299,12,null,12,12,null,null,null,null,12,null,null,null,null,null,null,null,null,null,null,null,null,null,3]
[8,410110064,6222016100640,"فرشة سوبر هلين خشن","Helal","فرش و مكانس","قطعة",15.731446313377948,17.93384879725086,15.781786941580757,{"$f":"VLOOKUP(B10,'[1]مخزن الهلال'!$B$81:$D$153,3,0)","v":23.74},16.678479381443299,12,null,null,12,null,null,null,null,12,null,null,12,null,null,null,null,null,null,null,null,null,null,3,null,null,null,null,6]
[9,410118004,6222016180048,"فرشة مدريد ناعم بيد معدن مدهون","Helal","فرش و مكانس","قطعة",25.438596491228072,29.000000000000004,25.520000000000003,{"$f":"VLOOKUP(B11,'[1]مخزن الهلال'!$B$81:$D$153,3,0)","v":31.9},26.970000000000002]
[10,410114000,6222016140004,"فرشة دهب باليد المعدن","Helal","فرش و مكانس","قطعة",51.754385964912288,59.000000000000007,51.920000000000009,{"$f":"VLOOKUP(B12,'[1]مخزن الهلال'!$B$81:$D$153,3,0)","v":64.900000000000006},54.870000000000005]
[11,410114001,6222016140011,"فرشة فضة ناعمة باليد المعدن","Helal","فرش و مكانس","قطعة",51.754385964912288,59.000000000000007,51.920000000000009,{"$f":"VLOOKUP(B13,'[1]مخزن الهلال'!$B$81:$D$153,3,0)","v":64.900000000000006},54.870000000000005]
[12,410210133,6222016101333,"فرشة طرق وملاعب  30 سم جلبة بلاستيك","Helal","فرش و مكانس","قطعة",36.930790542429179,42.101101218369266,37.048969072164951,{"$f":"VLOOKUP(B14,'[1]مخزن الهلال'!$B$81:$D$153,3,0)","v":46.31},39.154024133083418]
[13,410210122,6222016101227,"فرشة طرق وملاعب  30 سم جلبة حديد","Helal","فرش و مكانس","قطعة",45.203287623933306,51.53174789128397,45.347938144329895,{"$f":"VLOOKUP(B15,'[1]مخزن الهلال'!$B$81:$D$153,3,0)","v":56.68},47.924525538894095]
[14,410210123,6222016101234,"فرشة طرق وملاعب  40 سم جلبة حديد","Helal","فرش و مكانس","قطعة",55.051498435247758,62.758708216182448,55.227663230240552,{"$f":"VLOOKUP(B16,'[1]مخزن الهلال'!$B$81:$D$153,3,0)","v":63.25},58.365598641049679]
[15,410210132,6222016101326,"فرشة طرق وملاعب خشب 60 سم بدون جلبة","Helal","فرش و مكانس","قطعة",55.051498435247758,62.758708216182448,55.227663230240552,{"$f":"VLOOKUP(B17,'[1]مخزن الهلال'!$B$81:$D$153,3,0)","v":69.03},58.365598641049679]
[16,410210124,6222016101241,"فرشة طرق وملاعب  60 سم جلبة حديد","Helal","فرش و مكانس","قطعة",78.687204382402413,89.703412995938749,78.939003436426106,{"$f":"VLOOKUP(B18,'[1]مخزن الهلال'!$B$81:$D$153,3,0)","v":98.67},83.424174086223033]
[17,410310160,6222016101609,"فرشة أطباق الهلال","Helal","فرشة أطباق","قطعة",7.0175438596491233,8,7.04,{"$f":"VLOOKUP(B19,'[1]مخزن الهلال'!$B$81:$D$153,3,0)","v":8.8000000000000007},7.4399999999999995,null,null,null,null,null,null,null,null,null,null,null,null,null,null,6]
[18,410310111,6222016101111,"فرشة استحمام الهلال","Helal","فرشة استحمام","قطعة",9.7497287032013027,11.114690721649485,9.7809278350515463,{"$f":"VLOOKUP(B20,'[1]مخزن الهلال'!$B$81:$D$153,3,0)","v":12.23},10.33666237113402,null,12,null,null,null,null,24,6,24,null,null,null,null,null,null,null,null,null,null,null,null,null,null,null,null,null,null,null,null,null,null,null,6]
[19,410310119,6222016101197,"فرشة أحواض الهلال","Helal","فرشة أحواض ","قطعة",10.340621351880168,11.788308341143392,10.373711340206185,{"$f":"VLOOKUP(B21,'[1]مخزن الهلال'!$B$81:$D$153,3,0)","v":12.97},10.963126757263353,null,null,null,12,null,null,12,null,12,null,null,null,null,null,null,6,null,null,null,null,null,12]
[20,410114002,6222016140028,"فرشة سيارات الهلال","Helal","فرش متنوعة","قطعة",17.726779460366004,20.208528584817245,17.783505154639176,{"$f":"VLOOKUP(B22,'[1]مخزن الهلال'!$B$81:$D$153,3,0)","v":22.23},18.793931583880038]
[21,410110000,6222016100008,"فرشة الهلال متعددة الاغراض ( سيارات )","Helal","فرش متنوعة","قطعة",20.188832163194611,23.015268666041855,20.253436426116831,{"$f":"VLOOKUP(B23,'[1]مخزن الهلال'!$B$81:$D$153,3,0)","v":25.32},21.404199859418924,null,null,null,null,null,null,null,null,null,null,null,null,null,null,null,null,null,null,null,null,null,null,null,null,null,null,null,null,null,null,null,3]
[22,411116979,6222016169791,"سلاكة هلال جامبو ييد عكاز بلاستيك","Helal","سلاكة","قطعة",{"$f":"19.95/1.14","v":17.5},19.95,17.556000000000001,{"$f":"VLOOKUP(B24,'[1]مخزن الهلال'!$B$81:$D$153,3,0)","v":21.95},18.5535]
[23,410410447,6222016104471,"مكنسة الهلال السحرية","Helal","فرش و مكانس","قطعة",88.141486761264275,100.48129490784127,88.423539518900327,{"$f":"VLOOKUP(B25,'[1]مخزن الهلال'!$B$81:$D$153,3,0)","v":110.53},93.44760426429238]
[24,410510071,6222016100718,"جاروف هلال بالكاوتشة","Helal","جاروف","قطعة",8.7719298245614041,10,8.8000000000000007,{"$f":"VLOOKUP(B26,'[1]مخزن الهلال'!$B$81:$D$153,3,0)","v":11},9.3000000000000007]
[25,410510099,6222016100992,"فرشة بالجاروف كف الهلال","Helal","فرشة بالجاروف","قطعة",{"$f":"13/1.14","v":11.403508771929825},13.000000000000002,11.440000000000001,{"$f":"VLOOKUP(B27,'[1]مخزن الهلال'!$B$81:$D$153,3,0)","v":14.3},12.090000000000002]
[26,410513513,6222016135130,"فرشة بالجاروف دولفين الهلال","Helal","فرشة بالجاروف","قطعة",16.666666666666668,19,16.72,{"$f":"VLOOKUP(B28,'[1]مخزن الهلال'!$B$81:$D$153,3,0)","v":20.9},17.670000000000002]
[27,410510068,6222016100688,"فرشة بالجاروف توأم الهلال","Helal","فرشة بالجاروف","قطعة",{"$f":"16/1.14","v":14.035087719298247},16,14.08,{"$f":"VLOOKUP(B29,'[1]مخزن الهلال'!$B$81:$D$153,3,0)","v":17.600000000000001},14.879999999999999,null,null,12,null,null,null,12,6,null,24,null,12,null,null,12,12,{"$f":"2*12","v":24},null,null,null,null,12,3,null,null,null,null,null,null,null,null,null,null,null,null,6]
[28,410510072,6222016100725,"جاروف بلدوزر كبير بالكاوتشة باليد المعدن","Helal","فرشة بالجاروف","قطعة",23.684210526315791,27.000000000000004,23.760000000000005,{"$f":"VLOOKUP(B30,'[1]مخزن الهلال'!$B$81:$D$153,3,0)","v":29.7},25.110000000000003]
{"$rows_left_out":148}
{"sheet":"DATA","index":1,"n_rows":177,"n_cols":26,"rows_kept":177,"cut":false,"hidden":false,"merged":[]}
["التاريخ","رمز الشركة","رقم اللوحة","مستلم السيارة","رقم الكمبيوتر","الوظيفة","اسم المشروع","سبب العطل","ملاحظات",{"$f":"COLUMN()","v":10},{"$f":"COLUMN()","v":11},{"$f":"COLUMN()","v":12},{"$f":"COLUMN()","v":13},{"$f":"COLUMN()","v":14},null,null,null,null,null,null,null,null,null,null,null,"مندوب"]
["م","كود الصنف","Barcode","الإسم الجديد للمنتج على التغليف و السيستم","Brand","العائلة","الوحدة","قائمة الاساسيه  غير شامله الضريبه","قائمة الاساسيه   شامله الضريبه","قائمة الجمله   شامله الضريبه","قائمه الاسعار بعد الزياده شامله الضريبه ","قائمة التجزئه   شامله الضريبه","MNDOB","DATE",null,null,null,null,null,null,null,null,null,null,null,"عمرو"]
["2022-04-03",410110065,6222016100657,"فرشة ايديال ناعمة ","Helal","فرش و مكانس","قطعة",10.626987628105244,{"$f":"H3+(H3*14%)","v":12.114765896039978},{"$f":"I3-(I3*12%)","v":10.66099398851518},{"$f":"VLOOKUP(B3,'[1]مخزن الهلال'!$B$81:$D$153,3,0)","v":13.28},{"$f":"I3-(I3*7%)","v":11.266732283317181},"عمرو","2022-04-03",null,null,null,null,null,null,null,null,null,null,null,"هشام"]
["2022-04-03",410110107,6222016101074,"فرشة روما لوكس","Helal","فرش و مكانس","قطعة",11.304033279073975,12.886597938144332,11.340206185567013,{"$f":"VLOOKUP(B4,'[1]مخزن الهلال'!$B$81:$D$153,3,0)","v":14.61},11.984536082474229,"هشام","2022-04-04",null,null,null,null,null,null,null,null,null,null,null,"احمد سمير"]
["2022-04-05",410110104,6222016101043,"فرشة لوكس الهلال","Helal","فرش و مكانس","قطعة",14,15.96,14.0448,{"$f":"VLOOKUP(B5,'[1]مخزن الهلال'!$B$81:$D$153,3,0)","v":23.47},14.8428,"احمد سمير","2022-04-05"]
[{"$f":"A5+1","v":"2022-04-06"},410110066,6222016100664,"فرشة ايديال خشنة","Helal","فرش و مكانس","قطعة",11.586634111050826,13.208762886597942,11.623711340206189,{"$f":"VLOOKUP(B6,'[1]مخزن الهلال'!$B$81:$D$153,3,0)","v":14.53},12.284149484536085]
["2022-04-07",410110058,6222016100589,"فرشة ميكس الهلال","Helal","فرش و مكانس","قطعة",15.731446313377948,17.93384879725086,15.781786941580757,{"$f":"VLOOKUP(B7,'[1]مخزن الهلال'!$B$81:$D$153,3,0)","v":19.73},16.678479381443299]
["2022-04-08",410110063,6222016100633,"فرشة هلين اسود","Helal","فرش و مكانس","قطعة",15.072044372098635,17.182130584192443,15.12027491408935,{"$f":"VLOOKUP(B8,'[1]مخزن الهلال'!$B$81:$D$153,3,0)","v":23.16},15.979381443298971]
["2022-04-09",410110062,6222016100626,"فرشة سوبر هلين ناعم","Helal","فرش و مكانس","قطعة",15.731446313377948,17.93384879725086,15.781786941580757,{"$f":"VLOOKUP(B9,'[1]مخزن الهلال'!$B$81:$D$153,3,0)","v":24.15},16.678479381443299,null,12]
["2022-04-10",410110064,6222016100640,"فرشة سوبر هلين خشن","Helal","فرش و مكانس","قطعة",15.731446313377948,17.93384879725086,15.781786941580757,{"$f":"VLOOKUP(B10,'[1]مخزن الهلال'!$B$81:$D$153,3,0)","v":23.74},16.678479381443299,null,12]
["2022-04-11",410118004,6222016180048,"فرشة مدريد ناعم بيد معدن مدهون","Helal","فرش و مكانس","قطعة",25.438596491228072,29.000000000000004,25.520000000000003,{"$f":"VLOOKUP(B11,'[1]مخزن الهلال'!$B$81:$D$153,3,0)","v":31.9},26.970000000000002]
["2022-04-12",410114000,6222016140004,"فرشة دهب باليد المعدن","Helal","فرش و مكانس","قطعة",51.754385964912288,59.000000000000007,51.920000000000009,{"$f":"VLOOKUP(B12,'[1]مخزن الهلال'!$B$81:$D$153,3,0)","v":64.900000000000006},54.870000000000005]
["2022-04-13",410114001,6222016140011,"فرشة فضة ناعمة باليد المعدن","Helal","فرش و مكانس","قطعة",51.754385964912288,59.000000000000007,51.920000000000009,{"$f":"VLOOKUP(B13,'[1]مخزن الهلال'!$B$81:$D$153,3,0)","v":64.900000000000006},54.870000000000005]
["2022-04-14",410210133,6222016101333,"فرشة طرق وملاعب  30 سم جلبة بلاستيك","Helal","فرش و مكانس","قطعة",36.930790542429179,42.101101218369266,37.048969072164951,{"$f":"VLOOKUP(B14,'[1]مخزن الهلال'!$B$81:$D$153,3,0)","v":46.31},39.154024133083418]
["2022-04-15",410210122,6222016101227,"فرشة طرق وملاعب  30 سم جلبة حديد","Helal","فرش و مكانس","قطعة",45.203287623933306,51.53174789128397,45.347938144329895,{"$f":"VLOOKUP(B15,'[1]مخزن الهلال'!$B$81:$D$153,3,0)","v":56.68},47.924525538894095]
["2022-04-16",410210123,6222016101234,"فرشة طرق وملاعب  40 سم جلبة حديد","Helal","فرش و مكانس","قطعة",55.051498435247758,62.758708216182448,55.227663230240552,{"$f":"VLOOKUP(B16,'[1]مخزن الهلال'!$B$81:$D$153,3,0)","v":63.25},58.365598641049679]
["2022-04-17",410210132,6222016101326,"فرشة طرق وملاعب خشب 60 سم بدون جلبة","Helal","فرش و مكانس","قطعة",55.051498435247758,62.758708216182448,55.227663230240552,{"$f":"VLOOKUP(B17,'[1]مخزن الهلال'!$B$81:$D$153,3,0)","v":69.03},58.365598641049679]
["2022-04-18",410210124,6222016101241,"فرشة طرق وملاعب  60 سم جلبة حديد","Helal","فرش و مكانس","قطعة",78.687204382402413,89.703412995938749,78.939003436426106,{"$f":"VLOOKUP(B18,'[1]مخزن الهلال'!$B$81:$D$153,3,0)","v":98.67},83.424174086223033]
["2022-04-19",410310160,6222016101609,"فرشة أطباق الهلال","Helal","فرشة أطباق","قطعة",7.0175438596491233,8,7.04,{"$f":"VLOOKUP(B19,'[1]مخزن الهلال'!$B$81:$D$153,3,0)","v":8.8000000000000007},7.4399999999999995]
["2022-04-20",410310111,6222016101111,"فرشة استحمام الهلال","Helal","فرشة استحمام","قطعة",9.7497287032013027,11.114690721649485,9.7809278350515463,{"$f":"VLOOKUP(B20,'[1]مخزن الهلال'!$B$81:$D$153,3,0)","v":12.23},10.33666237113402]
["2022-04-21",410310119,6222016101197,"فرشة أحواض الهلال","Helal","فرشة أحواض ","قطعة",10.340621351880168,11.788308341143392,10.373711340206185,{"$f":"VLOOKUP(B21,'[1]مخزن الهلال'!$B$81:$D$153,3,0)","v":12.97},10.963126757263353]
["2022-04-22",410114002,6222016140028,"فرشة سيارات الهلال","Helal","فرش متنوعة","قطعة",17.726779460366004,20.208528584817245,17.783505154639176,{"$f":"VLOOKUP(B22,'[1]مخزن الهلال'!$B$81:$D$153,3,0)","v":22.23},18.793931583880038]
["2022-04-23",410110000,6222016100008,"فرشة الهلال متعددة الاغراض ( سيارات )","Helal","فرش متنوعة","قطعة",20.188832163194611,23.015268666041855,20.253436426116831,{"$f":"VLOOKUP(B23,'[1]مخزن الهلال'!$B$81:$D$153,3,0)","v":25.32},21.404199859418924]
["2022-04-24",411116979,6222016169791,"سلاكة هلال جامبو ييد عكاز بلاستيك","Helal","سلاكة","قطعة",{"$f":"19.95/1.14","v":17.5},19.95,17.556000000000001,{"$f":"VLOOKUP(B24,'[1]مخزن الهلال'!$B$81:$D$153,3,0)","v":21.95},18.5535]
["2022-04-25",410410447,6222016104471,"مكنسة الهلال السحرية","Helal","فرش و مكانس","قطعة",88.141486761264275,100.48129490784127,88.423539518900327,{"$f":"VLOOKUP(B25,'[1]مخزن الهلال'!$B$81:$D$153,3,0)","v":110.53},93.44760426429238]
["2022-04-26",410510071,6222016100718,"جاروف هلال بالكاوتشة","Helal","جاروف","قطعة",8.7719298245614041,10,8.8000000000000007,{"$f":"VLOOKUP(B26,'[1]مخزن الهلال'!$B$81:$D$153,3,0)","v":11},9.3000000000000007]
["2022-04-27",410510099,6222016100992,"فرشة بالجاروف كف الهلال","Helal","فرشة بالجاروف","قطعة",{"$f":"13/1.14","v":11.403508771929825},13.000000000000002,11.440000000000001,{"$f":"VLOOKUP(B27,'[1]مخزن الهلال'!$B$81:$D$153,3,0)","v":14.3},12.090000000000002]
["2022-04-28",410513513,6222016135130,"فرشة بالجاروف دولفين الهلال","Helal","فرشة بالجاروف","قطعة",16.666666666666668,19,16.72,{"$f":"VLOOKUP(B28,'[1]مخزن الهلال'!$B$81:$D$153,3,0)","v":20.9},17.670000000000002]
["2022-04-29",410510068,6222016100688,"فرشة بالجاروف توأم الهلال","Helal","فرشة بالجاروف","قطعة",{"$f":"16/1.14","v":14.035087719298247},16,14.08,{"$f":"VLOOKUP(B29,'[1]مخزن الهلال'!$B$81:$D$153,3,0)","v":17.600000000000001},14.879999999999999]
["2022-04-30",410510072,6222016100725,"جاروف بلدوزر كبير بالكاوتشة باليد المعدن","Helal","فرشة بالجاروف","قطعة",23.684210526315791,27.000000000000004,23.760000000000005,{"$f":"VLOOKUP(B30,'[1]مخزن الهلال'!$B$81:$D$153,3,0)","v":29.7},25.110000000000003]
{"$rows_left_out":148}
{"sheet":"MAIN","index":2,"n_rows":20,"n_cols":9,"rows_kept":20,"cut":false,"hidden":false,"merged":[]}
[null,null,"مندوب"]
["التاريخ :","2022-04-05","احمد سمير"]
[null,{"$f":"IF($A3>0,VLOOKUP($B3,'بيع الهلال'!$B$3:$L$67,3,0),0)","v":0},{"$f":"IF($B3>0,VLOOKUP($B3,'بيع الهلال'!$B$3:$L$67,6,0),0)","v":0},null,{"$f":"IF($D3>0,VLOOKUP($A3,'بيع الهلال'!$B$3:$L$67,10,0),0)","v":0},{"$f":"IF($D3>0,$D3*$E3,0)","v":0},{"$f":"IF($D3>0,$F3*7/100,0)","v":0},{"$f":"IF($D3>0,$F3-$G3,0)","v":0}]
[]
["الكود","اسم الصنف","الوحده","الكميه","السعر","القيمه","الخصم","الصافي","مندوب"]
[410110062,"فرشة سوبر هلين ناعم","قطعة",12,24.15,289.79999999999995,20.285999999999998,269.51399999999995,"احمد سمير"]
[410110107,"فرشة روما لوكس","قطعة",12,14.61,289.79999999999995,20.285999999999998,269.51399999999995,"احمد سمير"]
[410110062,"فرشة سوبر هلين ناعم","قطعة",12,24.15,289.79999999999995,20.285999999999998,269.51399999999995,"احمد سمير"]
[410110062,"فرشة سوبر هلين ناعم","قطعة",12,24.15,289.79999999999995,null,289.79999999999995,"احمد سمير"]
[410110062,"فرشة سوبر هلين ناعم","قطعة",12,24.15,0,0,0,"احمد سمير"]
[410110107,"فرشة روما لوكس","قطعة",12,14.61,289.79999999999995,20.285999999999998,269.51399999999995,"احمد سمير"]
[410110062,"فرشة سوبر هلين ناعم","قطعة",12,24.15,289.79999999999995,20.285999999999998,269.51399999999995,"احمد سمير"]
[410110062,"فرشة سوبر هلين ناعم","قطعة",12,24.15,289.79999999999995,null,289.79999999999995,"احمد سمير"]
[410110062,"فرشة سوبر هلين ناعم","قطعة",12,24.15,0,0,0,"احمد سمير"]
[null,null,null,null,{"$f":"IF($D15>0,VLOOKUP($A15,'بيع الهلال'!$B$3:$L$67,10,0),0)","v":0},{"$f":"IF($D15>0,$D15*$E15,0)","v":0},{"$f":"IF($D15>0,$F15*7/100,0)","v":0},{"$f":"IF($D15>0,$F15-$G15,0)","v":0}]
[null,null,null,null,{"$f":"IF($D16>0,VLOOKUP($A16,'بيع الهلال'!$B$3:$L$67,10,0),0)","v":0},0,0,0]
[null,null,null,null,{"$f":"IF($D17>0,VLOOKUP($A17,'بيع الهلال'!$B$3:$L$67,10,0),0)","v":0},0,0,0]
[null,null,null,null,{"$f":"IF($D18>0,VLOOKUP($A18,'بيع الهلال'!$B$3:$L$67,10,0),0)","v":0},0,0,0]
[null,null,null,null,{"$f":"IF($D19>0,VLOOKUP($A19,'بيع الهلال'!$B$3:$L$67,10,0),0)","v":0},0,0,0]
[null,null,null,null,{"$f":"IF($D20>0,VLOOKUP($A20,'بيع الهلال'!$B$3:$L$67,10,0),0)","v":0},0,0,0]

{"sheet":"SELL","index":3,"n_rows":47,"n_cols":11,"rows_kept":47,"cut":false,"hidden":false,"merged":[]}
["التاريخ","الكود","اسم الصنف","الوحده","الكميه","السعر","القيمه","الخصم","الصافي","مندوب","X"]
["2022-04-03",410110107,"فرشة روما لوكس","قطعة",12,14.61,175.32,null,175.32,"هشام"]
["2022-04-03",410110062,"فرشة سوبر هلين ناعم","قطعة",12,24.15,289.79999999999995,null,289.79999999999995,"هشام"]
["2022-04-03",410110062,{"$f":"IF($B4>0,VLOOKUP($B4,'بيع الهلال'!$B$3:$L$67,3,0),0)","v":"فرشة سوبر هلين ناعم"},{"$f":"IF($B4>0,VLOOKUP($B4,'بيع الهلال'!$B$3:$L$67,6,0),0)","v":"قطعة"},12,{"$f":"IF($E4>0,VLOOKUP($B4,'بيع الهلال'!$B$3:$L$67,10,0),0)","v":24.15},{"$f":"IF($E4>0,$F$6*$E$6,0)","v":289.79999999999995},{"$f":"IF($E4>0,$G$6*7/100,0)","v":20.285999999999998},{"$f":"IF($E4>0,$G$6-$H$6,0)","v":269.51399999999995},"هشام"]
["2022-04-03",410110107,{"$f":"IF($B5>0,VLOOKUP($B5,'بيع الهلال'!$B$3:$L$67,3,0),0)","v":"فرشة روما لوكس"},{"$f":"IF($B5>0,VLOOKUP($B5,'بيع الهلال'!$B$3:$L$67,6,0),0)","v":"قطعة"},12,{"$f":"IF($E5>0,VLOOKUP($B5,'بيع الهلال'!$B$3:$L$67,10,0),0)","v":14.61},{"$f":"IF($E5>0,$F$6*$E$6,0)","v":289.79999999999995},{"$f":"IF($E5>0,$G$6*7/100,0)","v":20.285999999999998},{"$f":"IF($E5>0,$G$6-$H$6,0)","v":269.51399999999995},"هشام"]
["2022-04-03",410110062,{"$f":"IF($B6>0,VLOOKUP($B6,'بيع الهلال'!$B$3:$L$67,3,0),0)","v":"فرشة سوبر هلين ناعم"},{"$f":"IF($B6>0,VLOOKUP($B6,'بيع الهلال'!$B$3:$L$67,6,0),0)","v":"قطعة"},12,{"$f":"IF($E6>0,VLOOKUP($B6,'بيع الهلال'!$B$3:$L$67,10,0),0)","v":24.15},{"$f":"IF($E6>0,$F$6*$E$6,0)","v":289.79999999999995},{"$f":"IF($E6>0,$G$6*7/100,0)","v":20.285999999999998},{"$f":"IF($E6>0,$G$6-$H$6,0)","v":269.51399999999995},"هشام"]
["2022-04-03",410110107,"فرشة روما لوكس","قطعة",12,14.61,289.79999999999995,20.285999999999998,269.51399999999995,"عمرو"]
["2022-04-03",410110062,"فرشة سوبر هلين ناعم","قطعة",12,24.15,289.79999999999995,20.285999999999998,269.51399999999995,"عمرو"]
["2022-04-03",410110062,"فرشة سوبر هلين ناعم","قطعة",12,24.15,289.79999999999995,null,289.79999999999995,"عمرو"]
["2022-04-03",410110062,"فرشة سوبر هلين ناعم","قطعة",12,24.15,289.79999999999995,20.285999999999998,269.51399999999995,"عمرو"]
["2022-04-03",410110107,"فرشة روما لوكس","قطعة",12,14.61,289.79999999999995,20.285999999999998,269.51399999999995,"عمرو"]
["2022-04-05",410110107,"فرشة روما لوكس","قطعة",12,14.61,289.79999999999995,20.285999999999998,269.51399999999995,"عمرو",9]
["2022-04-05",410110062,"فرشة سوبر هلين ناعم","قطعة",12,24.15,289.79999999999995,20.285999999999998,269.51399999999995,"هشام",10]
["2022-04-05",410110107,"فرشة روما لوكس","قطعة",12,14.61,289.79999999999995,20.285999999999998,269.51399999999995,"هشام",11]
["2022-04-05",410110062,"فرشة سوبر هلين ناعم","قطعة",12,24.15,289.79999999999995,20.285999999999998,269.51399999999995,"هشام",12]
["2022-04-07",410110062,"فرشة سوبر هلين ناعم","قطعة",12,24.15,289.79999999999995,null,289.79999999999995,"هشام",13]
["2022-04-07",410110062,"فرشة سوبر هلين ناعم","قطعة",12,24.15,0,0,0,"عمرو",14]
["2022-04-07",410110107,"فرشة روما لوكس","قطعة",12,14.61,289.79999999999995,20.285999999999998,269.51399999999995,"عمرو",15]
["2022-04-07",410110062,"فرشة سوبر هلين ناعم","قطعة",12,24.15,289.79999999999995,20.285999999999998,269.51399999999995,"عمرو",16]
["2022-04-07",410110062,"فرشة سوبر هلين ناعم","قطعة",12,24.15,289.79999999999995,null,289.79999999999995,"عمرو",17]
["2022-04-07",410110062,"فرشة سوبر هلين ناعم","قطعة",12,24.15,0,0,0,"عمرو",18]
["2022-04-07",410110107,"فرشة روما لوكس","قطعة",12,14.61,289.79999999999995,20.285999999999998,269.51399999999995,"احمد سمير",19]
["2022-04-05",410110062,"فرشة سوبر هلين ناعم","قطعة",12,24.15,289.79999999999995,20.285999999999998,269.51399999999995,"احمد سمير",20]
["2022-04-05",410110107,"فرشة روما لوكس","قطعة",12,14.61,289.79999999999995,20.285999999999998,269.51399999999995,"احمد سمير",21]
["2022-04-05",410110062,"فرشة سوبر هلين ناعم","قطعة",12,24.15,289.79999999999995,20.285999999999998,269.51399999999995,"احمد سمير",22]
["2022-04-05",410110062,"فرشة سوبر هلين ناعم","قطعة",12,24.15,289.79999999999995,null,289.79999999999995,"احمد سمير",23]
["2022-04-05",410110062,"فرشة سوبر هلين ناعم","قطعة",12,24.15,0,0,0,"احمد سمير",24]
["2022-04-05",410110107,"فرشة روما لوكس","قطعة",12,14.61,289.79999999999995,20.285999999999998,269.51399999999995,"احمد سمير",25]
["2022-04-05",410110062,"فرشة سوبر هلين ناعم","قطعة",12,24.15,289.79999999999995,20.285999999999998,269.51399999999995,"احمد سمير",26]
["2022-04-05",410110062,"فرشة سوبر هلين ناعم","قطعة",12,24.15,289.79999999999995,null,289.79999999999995,"احمد سمير",27]
{"$rows_left_out":17}