{"text_format":"1","workbook":"xlsx","n_sheets":2,"sheets":["Feuil1","Feuil2"],"not_rendered":{"charts":0,"images":0,"macros":0,"external_links":0,"defined_names":1,"comments":0,"pivot_tables":0},"unopened":[],"bounds":{"document_bytes":16777216,"sheet_cells":100000,"rows_first":2000,"rows_last":500,"rows_between":2000,"halvings":0,"cell_chars":16384,"cell_head_chars":4096},"cells_cut":0,"cells_raw":0,"read":"whole","date_system":"1900"}

{"sheet":"Feuil1","index":0,"n_rows":34,"n_cols":5,"rows_kept":34,"cut":false,"hidden":false,"merged":[]}
["المؤسسة","اللجنة","الشعبة","المادة","ععد الوثائق"]
["المؤسسة 1",9090,"علوم","عربية",187]
["المؤسسة 2",9091,"علوم اداب","فرنسية",190]
["المؤسسة 4",9092,"راضيات","انجليزية",200]
["المؤسسة 3",9093,"علوم","فيزياء",220]
["المؤسسة 4",9094,"علوم اداب","اقتصاد",190]
["المؤسسة 4",9095,"راضيات","رياضيات",192]
["المؤسسة 4",9096,"علوم","تكنولوجيا",187]
["المؤسسة 1",9097,"علوم اداب","عربية",190]
["المؤسسة 4",9098,"راضيات","فرنسية",200]
["المؤسسة 1",9099,"علوم","انجليزية",220]
["المؤسسة 4",9100,"علوم اداب","فيزياء",190]
["المؤسسة 3",9090,"علوم","رياضيات",192]
["المؤسسة 4",9091,"علوم","رياضيات",187]
["المؤسسة 4",9092,"علوم اداب","تكنولوجيا",190]
{"$rows_left_out":20}
{"sheet":"Feuil2","index":1,"n_rows":43,"n_cols":23,"rows_kept":43,"cut":false,"hidden":false,"merged":[]}
["المؤسسة 1",null,null,null,null,null,null,null,null,null,null,null,null,null,null,null,null,null,"اختر اسم المؤسسة من القائمة المنسدلة"]
[null,null,null,null,null,null,null,null,null,null,null,null,null,null,null,null,null,null,null,null,null,null,"المؤسسة 1"]
["الرقم","اللجنة","عربية","فرنسية","رياضيات","علوم","فلسفة","اقتصاد ","محاسبة","قانون","تاريخ","فيزياء","انجليزية","تكنولوجيا","علوم اسلامية",null,null,null,null,null,null,null,"المؤسسة 2"]
[{"$f":"IF(B4=\"\",\"\",MAX($A$3:A3)+1)","v":1},{"$f":"IFERROR(INDEX(Feuil1!$B$2:$B$340, MATCH(0, IF(A$1=Feuil1!$A$2:$A$340, COUNTIF($B$3:$B3,Feuil1!$B$2:$B$340), \"\"), 0)),\"\")","v":9090},{"$f":"SUMPRODUCT((Feuil1!$A$2:$A$31=$A$1)*(Feuil1!$B$2:$B$31=$B4)*(Feuil1!$D$2:$D$31=C$3)*(Feuil1!$E$2:$E$31))","v":187},{"$f":"SUMPRODUCT((Feuil1!$A$2:$A$31=$A$1)*(Feuil1!$B$2:$B$31=$B4)*(Feuil1!$D$2:$D$31=D$3)*(Feuil1!$E$2:$E$31))","v":0},{"$f":"SUMPRODUCT((Feuil1!$A$2:$A$31=$A$1)*(Feuil1!$B$2:$B$31=$B4)*(Feuil1!$D$2:$D$31=E$3)*(Feuil1!$E$2:$E$31))","v":0},{"$f":"SUMPRODUCT((Feuil1!$A$2:$A$31=$A$1)*(Feuil1!$B$2:$B$31=$B4)*(Feuil1!$D$2:$D$31=F$3)*(Feuil1!$E$2:$E$31))","v":0},{"$f":"SUMPRODUCT((Feuil1!$A$2:$A$31=$A$1)*(Feuil1!$B$2:$B$31=$B4)*(Feuil1!$D$2:$D$31=G$3)*(Feuil1!$E$2:$E$31))","v":0},{"$f":"SUMPRODUCT((Feuil1!$A$2:$A$31=$A$1)*(Feuil1!$B$2:$B$31=$B4)*(Feuil1!$D$2:$D$31=H$3)*(Feuil1!$E$2:$E$31))","v":0},{"$f":"SUMPRODUCT((Feuil1!$A$2:$A$31=$A$1)*(Feuil1!$B$2:$B$31=$B4)*(Feuil1!$D$2:$D$31=I$3)*(Feuil1!$E$2:$E$31))","v":0},{"$f":"SUMPRODUCT((Feuil1!$A$2:$A$31=$A$1)*(Feuil1!$B$2:$B$31=$B4)*(Feuil1!$D$2:$D$31=J$3)*(Feuil1!$E$2:$E$31))","v":0},{"$f":"SUMPRODUCT((Feuil1!$A$2:$A$31=$A$1)*(Feuil1!$B$2:$B$31=$B4)*(Feuil1!$D$2:$D$31=K$3)*(Feuil1!$E$2:$E$31))","v":0},{"$f":"SUMPRODUCT((Feuil1!$A$2:$A$31=$A$1)*(Feuil1!$B$2:$B$31=$B4)*(Feuil1!$D$2:$D$31=L$3)*(Feuil1!$E$2:$E$31))","v":0},{"$f":"SUMPRODUCT((Feuil1!$A$2:$A$31=$A$1)*(Feuil1!$B$2:$B$31=$B4)*(Feuil1!$D$2:$D$31=M$3)*(Feuil1!$E$2:$E$31))","v":0},{"$f":"SUMPRODUCT((Feuil1!$A$2:$A$31=$A$1)*(Feuil1!$B$2:$B$31=$B4)*(Feuil1!$D$2:$D$31=N$3)*(Feuil1!$E$2:$E$31))","v":0},{"$f":"SUMPRODUCT((Feuil1!$A$2:$A$31=$A$1)*(Feuil1!$B$2:$B$31=$B4)*(Feuil1!$D$2:$D$31=O$3)*(Feuil1!$E$2:$E$31))","v":0},null,null,null,null,null,null,null,"المؤسسة 3"]
[{"$f":"IF(B5=\"\",\"\",MAX($A$3:A4)+1)","v":2},{"$f":"IFERROR(INDEX(Feuil1!$B$2:$B$340, MATCH(0, IF(A$1=Feuil1!$A$2:$A$340, COUNTIF($B$3:$B4,Feuil1!$B$2:$B$340), \"\"), 0)),\"\")","v":9097},{"$f":"SUMPRODUCT((Feuil1!$A$2:$A$31=$A$1)*(Feuil1!$B$2:$B$31=$B5)*(Feuil1!$D$2:$D$31=C$3)*(Feuil1!$E$2:$E$31))","v":190},{"$f":"SUMPRODUCT((Feuil1!$A$2:$A$31=$A$1)*(Feuil1!$B$2:$B$31=$B5)*(Feuil1!$D$2:$D$31=D$3)*(Feuil1!$E$2:$E$31))","v":0},{"$f":"SUMPRODUCT((Feuil1!$A$2:$A$31=$A$1)*(Feuil1!$B$2:$B$31=$B5)*(Feuil1!$D$2:$D$31=E$3)*(Feuil1!$E$2:$E$31))","v":0},{"$f":"SUMPRODUCT((Feuil1!$A$2:$A$31=$A$1)*(Feuil1!$B$2:$B$31=$B5)*(Feuil1!$D$2:$D$31=F$3)*(Feuil1!$E$2:$E$31))","v":0},{"$f":"SUMPRODUCT((Feuil1!$A$2:$A$31=$A$1)*(Feuil1!$B$2:$B$31=$B5)*(Feuil1!$D$2:$D$31=G$3)*(Feuil1!$E$2:$E$31))","v":0},{"$f":"SUMPRODUCT((Feuil1!$A$2:$A$31=$A$1)*(Feuil1!$B$2:$B$31=$B5)*(Feuil1!$D$2:$D$31=H$3)*(Feuil1!$E$2:$E$31))","v":0},{"$f":"SUMPRODUCT((Feuil1!$A$2:$A$31=$A$1)*(Feuil1!$B$2:$B$31=$B5)*(Feuil1!$D$2:$D$31=I$3)*(Feuil1!$E$2:$E$31))","v":0},{"$f":"SUMPRODUCT((Feuil1!$A$2:$A$31=$A$1)*(Feuil1!$B$2:$B$31=$B5)*(Feuil1!$D$2:$D$31=J$3)*(Feuil1!$E$2:$E$31))","v":0},{"$f":"SUMPRODUCT((Feuil1!$A$2:$A$31=$A$1)*(Feuil1!$B$2:$B$31=$B5)*(Feuil1!$D$2:$D$31=K$3)*(Feuil1!$E$2:$E$31))","v":0},{"$f":"SUMPRODUCT((Feuil1!$A$2:$A$31=$A$1)*(Feuil1!$B$2:$B$31=$B5)*(Feuil1!$D$2:$D$31=L$3)*(Feuil1!$E$2:$E$31))","v":0},{"$f":"SUMPRODUCT((Feuil1!$A$2:$A$31=$A$1)*(Feuil1!$B$2:$B$31=$B5)*(Feuil1!$D$2:$D$31=M$3)*(Feuil1!$E$2:$E$31))","v":0},{"$f":"SUMPRODUCT((Feuil1!$A$2:$A$31=$A$1)*(Feuil1!$B$2:$B$31=$B5)*(Feuil1!$D$2:$D$31=N$3)*(Feuil1!$E$2:$E$31))","v":0},{"$f":"SUMPRODUCT((Feuil1!$A$2:$A$31=$A$1)*(Feuil1!$B$2:$B$31=$B5)*(Feuil1!$D$2:$D$31=O$3)*(Feuil1!$E$2:$E$31))","v":0},null,null,null,null,null,null,null,"المؤسسة 4"]
[{"$f":"IF(B6=\"\",\"\",MAX($A$3:A5)+1)","v":3},{"$f":"IFERROR(INDEX(Feuil1!$B$2:$B$340, MATCH(0, IF(A$1=Feuil1!$A$2:$A$340, COUNTIF($B$3:$B5,Feuil1!$B$2:$B$340), \"\"), 0)),\"\")","v":9099},{"$f":"SUMPRODUCT((Feuil1!$A$2:$A$31=$A$1)*(Feuil1!$B$2:$B$31=$B6)*(Feuil1!$D$2:$D$31=C$3)*(Feuil1!$E$2:$E$31))","v":0},{"$f":"SUMPRODUCT((Feuil1!$A$2:$A$31=$A$1)*(Feuil1!$B$2:$B$31=$B6)*(Feuil1!$D$2:$D$31=D$3)*(Feuil1!$E$2:$E$31))","v":0},{"$f":"SUMPRODUCT((Feuil1!$A$2:$A$31=$A$1)*(Feuil1!$B$2:$B$31=$B6)*(Feuil1!$D$2:$D$31=E$3)*(Feuil1!$E$2:$E$31))","v":0},{"$f":"SUMPRODUCT((Feuil1!$A$2:$A$31=$A$1)*(Feuil1!$B$2:$B$31=$B6)*(Feuil1!$D$2:$D$31=F$3)*(Feuil1!$E$2:$E$31))","v":0},{"$f":"SUMPRODUCT((Feuil1!$A$2:$A$31=$A$1)*(Feuil1!$B$2:$B$31=$B6)*(Feuil1!$D$2:$D$31=G$3)*(Feuil1!$E$2:$E$31))","v":0},{"$f":"SUMPRODUCT((Feuil1!$A$2:$A$31=$A$1)*(Feuil1!$B$2:$B$31=$B6)*(Feuil1!$D$2:$D$31=H$3)*(Feuil1!$E$2:$E$31))","v":0},{"$f":"SUMPRODUCT((Feuil1!$A$2:$A$31=$A$1)*(Feuil1!$B$2:$B$31=$B6)*(Feuil1!$D$2:$D$31=I$3)*(Feuil1!$E$2:$E$31))","v":0},{"$f":"SUMPRODUCT((Feuil1!$A$2:$A$31=$A$1)*(Feuil1!$B$2:$B$31=$B6)*(Feuil1!$D$2:$D$31=J$3)*(Feuil1!$E$2:$E$31))","v":0},{"$f":"SUMPRODUCT((Feuil1!$A$2:$A$31=$A$1)*(Feuil1!$B$2:$B$31=$B6)*(Feuil1!$D$2:$D$31=K$3)*(Feuil1!$E$2:$E$31))","v":0},{"$f":"SUMPRODUCT((Feuil1!$A$2:$A$31=$A$1)*(Feuil1!$B$2:$B$31=$B6)*(Feuil1!$D$2:$D$31=L$3)*(Feuil1!$E$2:$E$31))","v":0},{"$f":"SUMPRODUCT((Feuil1!$A$2:$A$31=$A$1)*(Feuil1!$B$2:$B$31=$B6)*(Feuil1!$D$2:$D$31=M$3)*(Feuil1!$E$2:$E$31))","v":220},{"$f":"SUMPRODUCT((Feuil1!$A$2:$A$31=$A$1)*(Feuil1!$B$2:$B$31=$B6)*(Feuil1!$D$2:$D$31=N$3)*(Feuil1!$E$2:$E$31))","v":200},{"$f":"SUMPRODUCT((Feuil1!$A$2:$A$31=$A$1)*(Feuil1!$B$2:$B$31=$B6)*(Feuil1!$D$2:$D$31=O$3)*(Feuil1!$E$2:$E$31))","v":0}]
[{"$f":"IF(B7=\"\",\"\",MAX($A$3:A6)+1)","v":4},{"$f":"IFERROR(INDEX(Feuil1!$B$2:$B$340, MATCH(0, IF(A$1=Feuil1!$A$2:$A$340, COUNTIF($B$3:$B6,Feuil1!$B$2:$B$340), \"\"), 0)),\"\")","v":9098},{"$f":"SUMPRODUCT((Feuil1!$A$2:$A$31=$A$1)*(Feuil1!$B$2:$B$31=$B7)*(Feuil1!$D$2:$D$31=C$3)*(Feuil1!$E$2:$E$31))","v":0},{"$f":"SUMPRODUCT((Feuil1!$A$2:$A$31=$A$1)*(Feuil1!$B$2:$B$31=$B7)*(Feuil1!$D$2:$D$31=D$3)*(Feuil1!$E$2:$E$31))","v":0},{"$f":"SUMPRODUCT((Feuil1!$A$2:$A$31=$A$1)*(Feuil1!$B$2:$B$31=$B7)*(Feuil1!$D$2:$D$31=E$3)*(Feuil1!$E$2:$E$31))","v":190},{"$f":"SUMPRODUCT((Feuil1!$A$2:$A$31=$A$1)*(Feuil1!$B$2:$B$31=$B7)*(Feuil1!$D$2:$D$31=F$3)*(Feuil1!$E$2:$E$31))","v":0},{"$f":"SUMPRODUCT((Feuil1!$A$2:$A$31=$A$1)*(Feuil1!$B$2:$B$31=$B7)*(Feuil1!$D$2:$D$31=G$3)*(Feuil1!$E$2:$E$31))","v":0},{"$f":"SUMPRODUCT((Feuil1!$A$2:$A$31=$A$1)*(Feuil1!$B$2:$B$31=$B7)*(Feuil1!$D$2:$D$31=H$3)*(Feuil1!$E$2:$E$31))","v":0},{"$f":"SUMPRODUCT((Feuil1!$A$2:$A$31=$A$1)*(Feuil1!$B$2:$B$31=$B7)*(Feuil1!$D$2:$D$31=I$3)*(Feuil1!$E$2:$E$31))","v":0},{"$f":"SUMPRODUCT((Feuil1!$A$2:$A$31=$A$1)*(Feuil1!$B$2:$B$31=$B7)*(Feuil1!$D$2:$D$31=J$3)*(Feuil1!$E$2:$E$31))","v":0},{"$f":"SUMPRODUCT((Feuil1!$A$2:$A$31=$A$1)*(Feuil1!$B$2:$B$31=$B7)*(Feuil1!$D$2:$D$31=K$3)*(Feuil1!$E$2:$E$31))","v":0},{"$f":"SUMPRODUCT((Feuil1!$A$2:$A$31=$A$1)*(Feuil1!$B$2:$B$31=$B7)*(Feuil1!$D$2:$D$31=L$3)*(Feuil1!$E$2:$E$31))","v":0},{"$f":"SUMPRODUCT((Feuil1!$A$2:$A$31=$A$1)*(Feuil1!$B$2:$B$31=$B7)*(Feuil1!$D$2:$D$31=M$3)*(Feuil1!$E$2:$E$31))","v":0},{"$f":"SUMPRODUCT((Feuil1!$A$2:$A$31=$A$1)*(Feuil1!$B$2:$B$31=$B7)*(Feuil1!$D$2:$D$31=N$3)*(Feuil1!$E$2:$E$31))","v":0},{"$f":"SUMPRODUCT((Feuil1!$A$2:$A$31=$A$1)*(Feuil1!$B$2:$B$31=$B7)*(Feuil1!$D$2:$D$31=O$3)*(Feuil1!$E$2:$E$31))","v":0}]
[{"$f":"IF(B8=\"\",\"\",MAX($A$3:A7)+1)","v":5},{"$f":"IFERROR(INDEX(Feuil1!$B$2:$B$340, MATCH(0, IF(A$1=Feuil1!$A$2:$A$340, COUNTIF($B$3:$B7,Feuil1!$B$2:$B$340), \"\"), 0)),\"\")","v":9112},{"$f":"SUMPRODUCT((Feuil1!$A$2:$A$31=$A$1)*(Feuil1!$B$2:$B$31=$B8)*(Feuil1!$D$2:$D$31=C$3)*(Feuil1!$E$2:$E$31))","v":0},{"$f":"SUMPRODUCT((Feuil1!$A$2:$A$31=$A$1)*(Feuil1!$B$2:$B$31=$B8)*(Feuil1!$D$2:$D$31=D$3)*(Feuil1!$E$2:$E$31))","v":190},{"$f":"SUMPRODUCT((Feuil1!$A$2:$A$31=$A$1)*(Feuil1!$B$2:$B$31=$B8)*(Feuil1!$D$2:$D$31=E$3)*(Feuil1!$E$2:$E$31))","v":0},{"$f":"SUMPRODUCT((Feuil1!$A$2:$A$31=$A$1)*(Feuil1!$B$2:$B$31=$B8)*(Feuil1!$D$2:$D$31=F$3)*(Feuil1!$E$2:$E$31))","v":0},{"$f":"SUMPRODUCT((Feuil1!$A$2:$A$31=$A$1)*(Feuil1!$B$2:$B$31=$B8)*(Feuil1!$D$2:$D$31=G$3)*(Feuil1!$E$2:$E$31))","v":0},{"$f":"SUMPRODUCT((Feuil1!$A$2:$A$31=$A$1)*(Feuil1!$B$2:$B$31=$B8)*(Feuil1!$D$2:$D$31=H$3)*(Feuil1!$E$2:$E$31))","v":0},{"$f":"SUMPRODUCT((Feuil1!$A$2:$A$31=$A$1)*(Feuil1!$B$2:$B$31=$B8)*(Feuil1!$D$2:$D$31=I$3)*(Feuil1!$E$2:$E$31))","v":0},{"$f":"SUMPRODUCT((Feuil1!$A$2:$A$31=$A$1)*(Feuil1!$B$2:$B$31=$B8)*(Feuil1!$D$2:$D$31=J$3)*(Feuil1!$E$2:$E$31))","v":0},{"$f":"SUMPRODUCT((Feuil1!$A$2:$A$31=$A$1)*(Feuil1!$B$2:$B$31=$B8)*(Feuil1!$D$2:$D$31=K$3)*(Feuil1!$E$2:$E$31))","v":0},{"$f":"SUMPRODUCT((Feuil1!$A$2:$A$31=$A$1)*(Feuil1!$B$2:$B$31=$B8)*(Feuil1!$D$2:$D$31=L$3)*(Feuil1!$E$2:$E$31))","v":0},{"$f":"SUMPRODUCT((Feuil1!$A$2:$A$31=$A$1)*(Feuil1!$B$2:$B$31=$B8)*(Feuil1!$D$2:$D$31=M$3)*(Feuil1!$E$2:$E$31))","v":0},{"$f":"SUMPRODUCT((Feuil1!$A$2:$A$31=$A$1)*(Feuil1!$B$2:$B$31=$B8)*(Feuil1!$D$2:$D$31=N$3)*(Feuil1!$E$2:$E$31))","v":0},{"$f":"SUMPRODUCT((Feuil1!$A$2:$A$31=$A$1)*(Feuil1!$B$2:$B$31=$B8)*(Feuil1!$D$2:$D$31=O$3)*(Feuil1!$E$2:$E$31))","v":0}]
[{"$f":"IF(B9=\"\",\"\",MAX($A$3:A8)+1)","v":""},{"$f":"IFERROR(INDEX(Feuil1!$B$2:$B$340, MATCH(0, IF(A$1=Feuil1!$A$2:$A$340, COUNTIF($B$3:$B8,Feuil1!$B$2:$B$340), \"\"), 0)),\"\")","v":""},{"$f":"SUMPRODUCT((Feuil1!$A$2:$A$31=$A$1)*(Feuil1!$B$2:$B$31=$B9)*(Feuil1!$D$2:$D$31=C$3)*(Feuil1!$E$2:$E$31))","v":0},{"$f":"SUMPRODUCT((Feuil1!$A$2:$A$31=$A$1)*(Feuil1!$B$2:$B$31=$B9)*(Feuil1!$D$2:$D$31=D$3)*(Feuil1!$E$2:$E$31))","v":0},{"$f":"SUMPRODUCT((Feuil1!$A$2:$A$31=$A$1)*(Feuil1!$B$2:$B$31=$B9)*(Feuil1!$D$2:$D$31=E$3)*(Feuil1!$E$2:$E$31))","v":0},{"$f":"SUMPRODUCT((Feuil1!$A$2:$A$31=$A$1)*(Feuil1!$B$2:$B$31=$B9)*(Feuil1!$D$2:$D$31=F$3)*(Feuil1!$E$2:$E$31))","v":0},{"$f":"SUMPRODUCT((Feuil1!$A$2:$A$31=$A$1)*(Feuil1!$B$2:$B$31=$B9)*(Feuil1!$D$2:$D$31=G$3)*(Feuil1!$E$2:$E$31))","v":0},{"$f":"SUMPRODUCT((Feuil1!$A$2:$A$31=$A$1)*(Feuil1!$B$2:$B$31=$B9)*(Feuil1!$D$2:$D$31=H$3)*(Feuil1!$E$2:$E$31))","v":0},{"$f":"SUMPRODUCT((Feuil1!$A$2:$A$31=$A$1)*(Feuil1!$B$2:$B$31=$B9)*(Feuil1!$D$2:$D$31=I$3)*(Feuil1!$E$2:$E$31))","v":0},{"$f":"SUMPRODUCT((Feuil1!$A$2:$A$31=$A$1)*(Feuil1!$B$2:$B$31=$B9)*(Feuil1!$D$2:$D$31=J$3)*(Feuil1!$E$2:$E$31))","v":0},{"$f":"SUMPRODUCT((Feuil1!$A$2:$A$31=$A$1)*(Feuil1!$B$2:$B$31=$B9)*(Feuil1!$D$2:$D$31=K$3)*(Feuil1!$E$2:$E$31))","v":0},{"$f":"SUMPRODUCT((Feuil1!$A$2:$A$31=$A$1)*(Feuil1!$B$2:$B$31=$B9)*(Feuil1!$D$2:$D$31=L$3)*(Feuil1!$E$2:$E$31))","v":0},{"$f":"SUMPRODUCT((Feuil1!$A$2:$A$31=$A$1)*(Feuil1!$B$2:$B$31=$B9)*(Feuil1!$D$2:$D$31=M$3)*(Feuil1!$E$2:$E$31))","v":0},{"$f":"SUMPRODUCT((Feuil1!$A$2:$A$31=$A$1)*(Feuil1!$B$2:$B$31=$B9)*(Feuil1!$D$2:$D$31=N$3)*(Feuil1!$E$2:$E$31))","v":0},{"$f":"SUMPRODUCT((Feuil1!$A$2:$A$31=$A$1)*(Feuil1!$B$2:$B$31=$B9)*(Feuil1!$D$2:$D$31=O$3)*(Feuil1!$E$2:$E$31))","v":0}]
[{"$f":"IF(B10=\"\",\"\",MAX($A$3:A9)+1)","v":""},{"$f":"IFERROR(INDEX(Feuil1!$B$2:$B$340, MATCH(0, IF(A$1=Feuil1!$A$2:$A$340, COUNTIF($B$3:$B9,Feuil1!$B$2:$B$340), \"\"), 0)),\"\")","v":""},{"$f":"SUMPRODUCT((Feuil1!$A$2:$A$31=$A$1)*(Feuil1!$B$2:$B$31=$B10)*(Feuil1!$D$2:$D$31=C$3)*(Feuil1!$E$2:$E$31))","v":0},{"$f":"SUMPRODUCT((Feuil1!$A$2:$A$31=$A$1)*(Feuil1!$B$2:$B$31=$B10)*(Feuil1!$D$2:$D$31=D$3)*(Feuil1!$E$2:$E$31))","v":0},{"$f":"SUMPRODUCT((Feuil1!$A$2:$A$31=$A$1)*(Feuil1!$B$2:$B$31=$B10)*(Feuil1!$D$2:$D$31=E$3)*(Feuil1!$E$2:$E$31))","v":0},{"$f":"SUMPRODUCT((Feuil1!$A$2:$A$31=$A$1)*(Feuil1!$B$2:$B$31=$B10)*(Feuil1!$D$2:$D$31=F$3)*(Feuil1!$E$2:$E$31))","v":0},{"$f":"SUMPRODUCT((Feuil1!$A$2:$A$31=$A$1)*(Feuil1!$B$2:$B$31=$B10)*(Feuil1!$D$2:$D$31=G$3)*(Feuil1!$E$2:$E$31))","v":0},{"$f":"SUMPRODUCT((Feuil1!$A$2:$A$31=$A$1)*(Feuil1!$B$2:$B$31=$B10)*(Feuil1!$D$2:$D$31=H$3)*(Feuil1!$E$2:$E$31))","v":0},{"$f":"SUMPRODUCT((Feuil1!$A$2:$A$31=$A$1)*(Feuil1!$B$2:$B$31=$B10)*(Feuil1!$D$2:$D$31=I$3)*(Feuil1!$E$2:$E$31))","v":0},{"$f":"SUMPRODUCT((Feuil1!$A$2:$A$31=$A$1)*(Feuil1!$B$2:$B$31=$B10)*(Feuil1!$D$2:$D$31=J$3)*(Feuil1!$E$2:$E$31))","v":0},{"$f":"SUMPRODUCT((Feuil1!$A$2:$A$31=$A$1)*(Feuil1!$B$2:$B$31=$B10)*(Feuil1!$D$2:$D$31=K$3)*(Feuil1!$E$2:$E$31))","v":0},{"$f":"SUMPRODUCT((Feuil1!$A$2:$A$31=$A$1)*(Feuil1!$B$2:$B$31=$B10)*(Feuil1!$D$2:$D$31=L$3)*(Feuil1!$E$2:$E$31))","v":0},{"$f":"SUMPRODUCT((Feuil1!$A$2:$A$31=$A$1)*(Feuil1!$B$2:$B$31=$B10)*(Feuil1!$D$2:$D$31=M$3)*(Feuil1!$E$2:$E$31))","v":0},{"$f":"SUMPRODUCT((Feuil1!$A$2:$A$31=$A$1)*(Feuil1!$B$2:$B$31=$B10)*(Feuil1!$D$2:$D$31=N$3)*(Feuil1!$E$2:$E$31))","v":0},{"$f":"SUMPRODUCT((Feuil1!$A$2:$A$31=$A$1)*(Feuil1!$B$2:$B$31=$B10)*(Feuil1!$D$2:$D$31=O$3)*(Feuil1!$E$2:$E$31))","v":0}]
[{"$f":"IF(B11=\"\",\"\",MAX($A$3:A10)+1)","v":""},{"$f":"IFERROR(INDEX(Feuil1!$B$2:$B$340, MATCH(0, IF(A$1=Feuil1!$A$2:$A$340, COUNTIF($B$3:$B10,Feuil1!$B$2:$B$340), \"\"), 0)),\"\")","v":""},{"$f":"SUMPRODUCT((Feuil1!$A$2:$A$31=$A$1)*(Feuil1!$B$2:$B$31=$B11)*(Feuil1!$D$2:$D$31=C$3)*(Feuil1!$E$2:$E$31))","v":0},{"$f":"SUMPRODUCT((Feuil1!$A$2:$A$31=$A$1)*(Feuil1!$B$2:$B$31=$B11)*(Feuil1!$D$2:$D$31=D$3)*(Feuil1!$E$2:$E$31))","v":0},{"$f":"SUMPRODUCT((Feuil1!$A$2:$A$31=$A$1)*(Feuil1!$B$2:$B$31=$B11)*(Feuil1!$D$2:$D$31=E$3)*(Feuil1!$E$2:$E$31))","v":0},{"$f":"SUMPRODUCT((Feuil1!$A$2:$A$31=$A$1)*(Feuil1!$B$2:$B$31=$B11)*(Feuil1!$D$2:$D$31=F$3)*(Feuil1!$E$2:$E$31))","v":0},{"$f":"SUMPRODUCT((Feuil1!$A$2:$A$31=$A$1)*(Feuil1!$B$2:$B$31=$B11)*(Feuil1!$D$2:$D$31=G$3)*(Feuil1!$E$2:$E$31))","v":0},{"$f":"SUMPRODUCT((Feuil1!$A$2:$A$31=$A$1)*(Feuil1!$B$2:$B$31=$B11)*(Feuil1!$D$2:$D$31=H$3)*(Feuil1!$E$2:$E$31))","v":0},{"$f":"SUMPRODUCT((Feuil1!$A$2:$A$31=$A$1)*(Feuil1!$B$2:$B$31=$B11)*(Feuil1!$D$2:$D$31=I$3)*(Feuil1!$E$2:$E$31))","v":0},{"$f":"SUMPRODUCT((Feuil1!$A$2:$A$31=$A$1)*(Feuil1!$B$2:$B$31=$B11)*(Feuil1!$D$2:$D$31=J$3)*(Feuil1!$E$2:$E$31))","v":0},{"$f":"SUMPRODUCT((Feuil1!$A$2:$A$31=$A$1)*(Feuil1!$B$2:$B$31=$B11)*(Feuil1!$D$2:$D$31=K$3)*(Feuil1!$E$2:$E$31))","v":0},{"$f":"SUMPRODUCT((Feuil1!$A$2:$A$31=$A$1)*(Feuil1!$B$2:$B$31=$B11)*(Feuil1!$D$2:$D$31=L$3)*(Feuil1!$E$2:$E$31))","v":0},{"$f":"SUMPRODUCT((Feuil1!$A$2:$A$31=$A$1)*(Feuil1!$B$2:$B$31=$B11)*(Feuil1!$D$2:$D$31=M$3)*(Feuil1!$E$2:$E$31))","v":0},{"$f":"SUMPRODUCT((Feuil1!$A$2:$A$31=$A$1)*(Feuil1!$B$2:$B$31=$B11)*(Feuil1!$D$2:$D$31=N$3)*(Feuil1!$E$2:$E$31))","v":0},{"$f":"SUMPRODUCT((Feuil1!$A$2:$A$31=$A$1)*(Feuil1!$B$2:$B$31=$B11)*(Feuil1!$D$2:$D$31=O$3)*(Feuil1!$E$2:$E$31))","v":0}]
[{"$f":"IF(B12=\"\",\"\",MAX($A$3:A11)+1)","v":""},{"$f":"IFERROR(INDEX(Feuil1!$B$2:$B$340, MATCH(0, IF(A$1=Feuil1!$A$2:$A$340, COUNTIF($B$3:$B11,Feuil1!$B$2:$B$340), \"\"), 0)),\"\")","v":""},{"$f":"SUMPRODUCT((Feuil1!$A$2:$A$31=$A$1)*(Feuil1!$B$2:$B$31=$B12)*(Feuil1!$D$2:$D$31=C$3)*(Feuil1!$E$2:$E$31))","v":0},{"$f":"SUMPRODUCT((Feuil1!$A$2:$A$31=$A$1)*(Feuil1!$B$2:$B$31=$B12)*(Feuil1!$D$2:$D$31=D$3)*(Feuil1!$E$2:$E$31))","v":0},{"$f":"SUMPRODUCT((Feuil1!$A$2:$A$31=$A$1)*(Feuil1!$B$2:$B$31=$B12)*(Feuil1!$D$2:$D$31=E$3)*(Feuil1!$E$2:$E$31))","v":0},{"$f":"SUMPRODUCT((Feuil1!$A$2:$A$31=$A$1)*(Feuil1!$B$2:$B$31=$B12)*(Feuil1!$D$2:$D$31=F$3)*(Feuil1!$E$2:$E$31))","v":0},{"$f":"SUMPRODUCT((Feuil1!$A$2:$A$31=$A$1)*(Feuil1!$B$2:$B$31=$B12)*(Feuil1!$D$2:$D$31=G$3)*(Feuil1!$E$2:$E$31))","v":0},{"$f":"SUMPRODUCT((Feuil1!$A$2:$A$31=$A$1)*(Feuil1!$B$2:$B$31=$B12)*(Feuil1!$D$2:$D$31=H$3)*(Feuil1!$E$2:$E$31))","v":0},{"$f":"SUMPRODUCT((Feuil1!$A$2:$A$31=$A$1)*(Feuil1!$B$2:$B$31=$B12)*(Feuil1!$D$2:$D$31=I$3)*(Feuil1!$E$2:$E$31))","v":0},{"$f":"SUMPRODUCT((Feuil1!$A$2:$A$31=$A$1)*(Feuil1!$B$2:$B$31=$B12)*(Feuil1!$D$2:$D$31=J$3)*(Feuil1!$E$2:$E$31))","v":0},{"$f":"SUMPRODUCT((Feuil1!$A$2:$A$31=$A$1)*(Feuil1!$B$2:$B$31=$B12)*(Feuil1!$D$2:$D$31=K$3)*(Feuil1!$E$2:$E$31))","v":0},{"$f":"SUMPRODUCT((Feuil1!$A$2:$A$31=$A$1)*(Feuil1!$B$2:$B$31=$B12)*(Feuil1!$D$2:$D$31=L$3)*(Feuil1!$E$2:$E$31))","v":0},{"$f":"SUMPRODUCT((Feuil1!$A$2:$A$31=$A$1)*(Feuil1!$B$2:$B$31=$B12)*(Feuil1!$D$2:$D$31=M$3)*(Feuil1!$E$2:$E$31))","v":0},{"$f":"SUMPRODUCT((Feuil1!$A$2:$A$31=$A$1)*(Feuil1!$B$2:$B$31=$B12)*(Feuil1!$D$2:$D$31=N$3)*(Feuil1!$E$2:$E$31))","v":0},{"$f":"SUMPRODUCT((Feuil1!$A$2:$A$31=$A$1)*(Feuil1!$B$2:$B$31=$B12)*(Feuil1!$D$2:$D$31=O$3)*(Feuil1!$E$2:$E$31))","v":0}]
[{"$f":"IF(B13=\"\",\"\",MAX($A$3:A12)+1)","v":""},{"$f":"IFERROR(INDEX(Feuil1!$B$2:$B$340, MATCH(0, IF(A$1=Feuil1!$A$2:$A$340, COUNTIF($B$3:$B12,Feuil1!$B$2:$B$340), \"\"), 0)),\"\")","v":""},{"$f":"SUMPRODUCT((Feuil1!$A$2:$A$31=$A$1)*(Feuil1!$B$2:$B$31=$B13)*(Feuil1!$D$2:$D$31=C$3)*(Feuil1!$E$2:$E$31))","v":0},{"$f":"SUMPRODUCT((Feuil1!$A$2:$A$31=$A$1)*(Feuil1!$B$2:$B$31=$B13)*(Feuil1!$D$2:$D$31=D$3)*(Feuil1!$E$2:$E$31))","v":0},{"$f":"SUMPRODUCT((Feuil1!$A$2:$A$31=$A$1)*(Feuil1!$B$2:$B$31=$B13)*(Feuil1!$D$2:$D$31=E$3)*(Feuil1!$E$2:$E$31))","v":0},{"$f":"SUMPRODUCT((Feuil1!$A$2:$A$31=$A$1)*(Feuil1!$B$2:$B$31=$B13)*(Feuil1!$D$2:$D$31=F$3)*(Feuil1!$E$2:$E$31))","v":0},{"$f":"SUMPRODUCT((Feuil1!$A$2:$A$31=$A$1)*(Feuil1!$B$2:$B$31=$B13)*(Feuil1!$D$2:$D$31=G$3)*(Feuil1!$E$2:$E$31))","v":0},{"$f":"SUMPRODUCT((Feuil1!$A$2:$A$31=$A$1)*(Feuil1!$B$2:$B$31=$B13)*(Feuil1!$D$2:$D$31=H$3)*(Feuil1!$E$2:$E$31))","v":0},{"$f":"SUMPRODUCT((Feuil1!$A$2:$A$31=$A$1)*(Feuil1!$B$2:$B$31=$B13)*(Feuil1!$D$2:$D$31=I$3)*(Feuil1!$E$2:$E$31))","v":0},{"$f":"SUMPRODUCT((Feuil1!$A$2:$A$31=$A$1)*(Feuil1!$B$2:$B$31=$B13)*(Feuil1!$D$2:$D$31=J$3)*(Feuil1!$E$2:$E$31))","v":0},{"$f":"SUMPRODUCT((Feuil1!$A$2:$A$31=$A$1)*(Feuil1!$B$2:$B$31=$B13)*(Feuil1!$D$2:$D$31=K$3)*(Feuil1!$E$2:$E$31))","v":0},{"$f":"SUMPRODUCT((Feuil1!$A$2:$A$31=$A$1)*(Feuil1!$B$2:$B$31=$B13)*(Feuil1!$D$2:$D$31=L$3)*(Feuil1!$E$2:$E$31))","v":0},{"$f":"SUMPRODUCT((Feuil1!$A$2:$A$31=$A$1)*(Feuil1!$B$2:$B$31=$B13)*(Feuil1!$D$2:$D$31=M$3)*(Feuil1!$E$2:$E$31))","v":0},{"$f":"SUMPRODUCT((Feuil1!$A$2:$A$31=$A$1)*(Feuil1!$B$2:$B$31=$B13)*(Feuil1!$D$2:$D$31=N$3)*(Feuil1!$E$2:$E$31))","v":0},{"$f":"SUMPRODUCT((Feuil1!$A$2:$A$31=$A$1)*(Feuil1!$B$2:$B$31=$B13)*(Feuil1!$D$2:$D$31=O$3)*(Feuil1!$E$2:$E$31))","v":0}]
[{"$f":"IF(B14=\"\",\"\",MAX($A$3:A13)+1)","v":""},{"$f":"IFERROR(INDEX(Feuil1!$B$2:$B$340, MATCH(0, IF(A$1=Feuil1!$A$2:$A$340, COUNTIF($B$3:$B13,Feuil1!$B$2:$B$340), \"\"), 0)),\"\")","v":""},{"$f":"SUMPRODUCT((Feuil1!$A$2:$A$31=$A$1)*(Feuil1!$B$2:$B$31=$B14)*(Feuil1!$D$2:$D$31=C$3)*(Feuil1!$E$2:$E$31))","v":0},{"$f":"SUMPRODUCT((Feuil1!$A$2:$A$31=$A$1)*(Feuil1!$B$2:$B$31=$B14)*(Feuil1!$D$2:$D$31=D$3)*(Feuil1!$E$2:$E$31))","v":0},{"$f":"SUMPRODUCT((Feuil1!$A$2:$A$31=$A$1)*(Feuil1!$B$2:$B$31=$B14)*(Feuil1!$D$2:$D$31=E$3)*(Feuil1!$E$2:$E$31))","v":0},{"$f":"SUMPRODUCT((Feuil1!$A$2:$A$31=$A$1)*(Feuil1!$B$2:$B$31=$B14)*(Feuil1!$D$2:$D$31=F$3)*(Feuil1!$E$2:$E$31))","v":0},{"$f":"SUMPRODUCT((Feuil1!$A$2:$A$31=$A$1)*(Feuil1!$B$2:$B$31=$B14)*(Feuil1!$D$2:$D$31=G$3)*(Feuil1!$E$2:$E$31))","v":0},{"$f":"SUMPRODUCT((Feuil1!$A$2:$A$31=$A$1)*(Feuil1!$B$2:$B$31=$B14)*(Feuil1!$D$2:$D$31=H$3)*(Feuil1!$E$2:$E$31))","v":0},{"$f":"SUMPRODUCT((Feuil1!$A$2:$A$31=$A$1)*(Feuil1!$B$2:$B$31=$B14)*(Feuil1!$D$2:$D$31=I$3)*(Feuil1!$E$2:$E$31))","v":0},{"$f":"SUMPRODUCT((Feuil1!$A$2:$A$31=$A$1)*(Feuil1!$B$2:$B$31=$B14)*(Feuil1!$D$2:$D$31=J$3)*(Feuil1!$E$2:$E$31))","v":0},{"$f":"SUMPRODUCT((Feuil1!$A$2:$A$31=$A$1)*(Feuil1!$B$2:$B$31=$B14)*(Feuil1!$D$2:$D$31=K$3)*(Feuil1!$E$2:$E$31))","v":0},{"$f":"SUMPRODUCT((Feuil1!$A$2:$A$31=$A$1)*(Feuil1!$B$2:$B$31=$B14)*(Feuil1!$D$2:$D$31=L$3)*(Feuil1!$E$2:$E$31))","v":0},{"$f":"SUMPRODUCT((Feuil1!$A$2:$A$31=$A$1)*(Feuil1!$B$2:$B$31=$B14)*(Feuil1!$D$2:$D$31=M$3)*(Feuil1!$E$2:$E$31))","v":0},{"$f":"SUMPRODUCT((Feuil1!$A$2:$A$31=$A$1)*(Feuil1!$B$2:$B$31=$B14)*(Feuil1!$D$2:$D$31=N$3)*(Feuil1!$E$2:$E$31))","v":0},{"$f":"SUMPRODUCT((Feuil1!$A$2:$A$31=$A$1)*(Feuil1!$B$2:$B$31=$B14)*(Feuil1!$D$2:$D$31=O$3)*(Feuil1!$E$2:$E$31))","v":0}]
[{"$f":"IF(B15=\"\",\"\",MAX($A$3:A14)+1)","v":""},{"$f":"IFERROR(INDEX(Feuil1!$B$2:$B$340, MATCH(0, IF(A$1=Feuil1!$A$2:$A$340, COUNTIF($B$3:$B14,Feuil1!$B$2:$B$340), \"\"), 0)),\"\")","v":""},{"$f":"SUMPRODUCT((Feuil1!$A$2:$A$31=$A$1)*(Feuil1!$B$2:$B$31=$B15)*(Feuil1!$D$2:$D$31=C$3)*(Feuil1!$E$2:$E$31))","v":0},{"$f":"SUMPRODUCT((Feuil1!$A$2:$A$31=$A$1)*(Feuil1!$B$2:$B$31=$B15)*(Feuil1!$D$2:$D$31=D$3)*(Feuil1!$E$2:$E$31))","v":0},{"$f":"SUMPRODUCT((Feuil1!$A$2:$A$31=$A$1)*(Feuil1!$B$2:$B$31=$B15)*(Feuil1!$D$2:$D$31=E$3)*(Feuil1!$E$2:$E$31))","v":0},{"$f":"SUMPRODUCT((Feuil1!$A$2:$A$31=$A$1)*(Feuil1!$B$2:$B$31=$B15)*(Feuil1!$D$2:$D$31=F$3)*(Feuil1!$E$2:$E$31))","v":0},{"$f":"SUMPRODUCT((Feuil1!$A$2:$A$31=$A$1)*(Feuil1!$B$2:$B$31=$B15)*(Feuil1!$D$2:$D$31=G$3)*(Feuil1!$E$2:$E$31))","v":0},{"$f":"SUMPRODUCT((Feuil1!$A$2:$A$31=$A$1)*(Feuil1!$B$2:$B$31=$B15)*(Feuil1!$D$2:$D$31=H$3)*(Feuil1!$E$2:$E$31))","v":0},{"$f":"SUMPRODUCT((Feuil1!$A$2:$A$31=$A$1)*(Feuil1!$B$2:$B$31=$B15)*(Feuil1!$D$2:$D$31=I$3)*(Feuil1!$E$2:$E$31))","v":0},{"$f":"SUMPRODUCT((Feuil1!$A$2:$A$31=$A$1)*(Feuil1!$B$2:$B$31=$B15)*(Feuil1!$D$2:$D$31=J$3)*(Feuil1!$E$2:$E$31))","v":0},{"$f":"SUMPRODUCT((Feuil1!$A$2:$A$31=$A$1)*(Feuil1!$B$2:$B$31=$B15)*(Feuil1!$D$2:$D$31=K$3)*(Feuil1!$E$2:$E$31))","v":0},{"$f":"SUMPRODUCT((Feuil1!$A$2:$A$31=$A$1)*(Feuil1!$B$2:$B$31=$B15)*(Feuil1!$D$2:$D$31=L$3)*(Feuil1!$E$2:$E$31))","v":0},{"$f":"SUMPRODUCT((Feuil1!$A$2:$A$31=$A$1)*(Feuil1!$B$2:$B$31=$B15)*(Feuil1!$D$2:$D$31=M$3)*(Feuil1!$E$2:$E$31))","v":0},{"$f":"SUMPRODUCT((Feuil1!$A$2:$A$31=$A$1)*(Feuil1!$B$2:$B$31=$B15)*(Feuil1!$D$2:$D$31=N$3)*(Feuil1!$E$2:$E$31))","v":0},{"$f":"SUMPRODUCT((Feuil1!$A$2:$A$31=$A$1)*(Feuil1!$B$2:$B$31=$B15)*(Feuil1!$D$2:$D$31=O$3)*(Feuil1!$E$2:$E$31))","v":0}]
{"$rows_left_out":28}