{"text_format":"1","workbook":"xlsx","n_sheets":3,"sheets":["البيانات الأساسية","شيت الترم الأول","شهادات الترم الأول"],"not_rendered":{"charts":0,"images":0,"macros":1,"external_links":0,"defined_names":5,"comments":0,"pivot_tables":0},"unopened":[],"bounds":{"document_bytes":16777216,"sheet_cells":100000,"rows_first":2000,"rows_last":500,"rows_between":2000,"halvings":0,"cell_chars":16384,"cell_head_chars":4096},"cells_cut":0,"cells_raw":0,"read":"whole","date_system":"1900"}

{"sheet":"البيانات الأساسية","index":0,"n_rows":9,"n_cols":18,"rows_kept":9,"cut":false,"hidden":false,"merged":[[0,0,0,1]]}
["البيانات الأساسية"]
["محافظة","الاسكندرية"]
["إدارة","المنتزه التعليمية"]
["مدرسة","محمد اسماعيل",null,null,null,null,null,null,null,null,null,null,null,null,null,null,null,"الصف الأول الإعدادي"]
["عام دراسي",null,null,null,null,null,null,null,null,null,null,null,null,null,null,null,null,"الصف الثاني الإعدادي"]
["الصف","الصف الأول الإعدادي"]
["رئيس الكنترول","محمد علي"]
["مدير المدرسة","محمود علي"]
["مدير إدارة المدرسة","السيد علي"]

{"sheet":"شيت الترم الأول","index":1,"n_rows":533,"n_cols":73,"rows_kept":533,"cut":false,"hidden":false,"merged":[[1,28,1,33],[2,1,2,3],[1,1,1,3],[0,1,0,3],[2,11,2,12],[1,12,1,27],[2,21,2,23],[2,13,2,14],[2,19,2,20],[4,0,6,0],[4,1,6,1],[4,3,5,3],[4,4,5,4],[4,6,6,6],[5,57,5,63],[4,12,4,14],[4,15,4,17],[4,39,4,41],[4,5,6,5],[4,7,6,7],[4,36,4,38],[4,18,4,21],[4,22,4,25],[4,26,4,28],[4,33,4,35],[4,29,4,32],[4,8,6,8],[4,9,4,11]]}
["محافظة",{"$f":"IF('البيانات الأساسية'!B2=\"\",\"\",'البيانات الأساسية'!B2)","v":"الاسكندرية"}]
["إدارة",{"$f":"IF('البيانات الأساسية'!B3=\"\",\"\",'البيانات الأساسية'!B3)","v":"المنتزه التعليمية"},null,null,null,null,null,null,null,null,null,null,"كشف رصد درجات نصف العـام \" ينايـر \" للصـــــف",null,null,null,null,null,null,null,null,null,null,null,null,null,null,null,{"$f":"IF('البيانات الأساسية'!B6=\"\",\"\",'البيانات الأساسية'!B6)","v":"الصف الأول الإعدادي"}]
["مدرسة",{"$f":"IF('البيانات الأساسية'!B4=\"\",\"\",'البيانات الأساسية'!B4)","v":"محمد اسماعيل"},null,null,null,null,null,null,null,null,null,null,null,null,null,null,null,null,null,"عام دراسي",null,{"$f":"IF('البيانات الأساسية'!B5=\"\",\"\",'البيانات الأساسية'!B5)","v":""},null,null,null,{"$f":"COUNTA(C8:C507)","v":10},{"$f":"COUNTA(C8:C107)","v":10},{"$f":"COUNTA(C108:C207)","v":0},{"$f":"COUNTA(C208:C307)","v":0},{"$f":"COUNTA(C308:C407)","v":0},{"$f":"COUNTA(C408:C507)","v":0}]
[]
["مسلسل","رقم الجلوس",null,"الفصل","رقم اللجنة ","الديانة","حالة القيد","الرقم السري","الرقم السري","لغة عربية وخط",null,null,"لغة إنجليزية",null,null,"دراسات",null,null,"رياضيات",null,null,null,"العلـــوم",null,null,null,"تربية فنية",null,null,"الكمبيوتر وتكنولوجيا المعلومات",null,null,null,"نشاط مصاحب",null,null,"تربية دينية",null,null,"لغة فرنسية",null,null,null,null,null,null,null,"غ"]
[null,null,"اسم الطالب",null,null,null,null,null,null,"ملف إنجاز الفصل الدراسي الأول","اختبار الفصل الدراسي الأول","المجموع","ملف إنجاز الفصل الدراسي الأول","اختبار الفصل الدراسي الأول","المجموع","ملف إنجاز الفصل الدراسي الأول","اختبار الفصل الدراسي الأول","المجموع","ملف إنجاز الفصل الدراسي الأول","اختبار الجبر والإحصاء","اختبار الهندسة","المجموع","ملف إنجاز الفصل الدراسي الأول","اختبار العملي","اختبار التحريري","المجموع","ملف إنجاز الفصل الدراسي الأول","اختبار الفصل الدراسي الأول","المجموع","ملف إنجاز الفصل الدراسي الأول","اختبار العملي","اختبار التحريري","المجموع","نشاط مصاحب (1)","نشاط مصاحب (2)","المجموع","ملف إنجاز الفصل الدراسي الأول","اختبار الفصل الدراسي الأول","المجموع","ملف إنجاز الفصل الدراسي الأول","اختبار الفصل الدراسي الأول","المجموع",null,null,null,null,null,"صفر",null,null,null,null,null,null,null,null,null,"كشوف المناداة",null,null,null,null,null,null,null,null,null,null,null,null,null,null,"المجموع الكلي 10 أوائل"]
[null,null,null,null,null,null,null,null,null,50,50,100,50,50,100,50,50,100,50,25,25,100,50,10,40,100,50,50,100,50,10,40,100,5,5,10,50,50,100,50,50,100,null,null,null,null,null,null,null,null,"مسلم","باق",null,null,null,"مجموع","ترتيب",null,null,null,null,null,null,null,null,null,null,null,null,null,null,null,{"$f":"SUM(L8,O8,R8,V8,Z8,AC8,AG8)","v":680}]
[{"$f":"IF(B8=\"\",\"\",ROW()-7)","v":1},101,"احمد السيد",null,null,"مسلم","مستجد",null,{"$f":"IF(H8<>\"\",(H8),\"\")","v":""},50,50,100,50,50,100,50,50,100,40,20,20,80,50,10,40,100,50,50,100,50,10,40,100,5,5,10,50,50,100,50,50,100,null,null,null,null,null,0,null,null,"مسيحي","مستجد",null,1,null,{"$f":"SUM(L8,O8,R8,V8,Z8,AC8,AG8)","v":680},{"$f":"IF(OR(C8=\"\",Z8=\"\"),\"\",COUNTIF(BD$8:BD$600,\">\"&BD8)+1)","v":1},{"$f":"IF(B8=\"\",\"\",B8)","v":101},{"$f":"IF(C8=\"\",\"\",C8)","v":"احمد السيد"},{"$f":"IF(D8=\"\",\"\",D8)","v":""},{"$f":"IF(E8=\"\",\"\",E8)","v":""},{"$f":"IF(F8=\"\",\"\",F8)","v":"مسلم"},null,1,1,null,null,null,null,null,null,null,{"$f":"SUM(L9,O9,R9,V9,Z9,AC9,AG9)","v":680}]
[2,102,"باسل علي",null,null,"مسلم","مستجد",null,"",50,50,100,50,50,100,50,50,100,40,20,20,80,50,10,40,100,50,50,100,50,10,40,100,5,5,10,50,50,100,50,50,100,null,null,null,null,null,0.5,null,null,null,null,null,null,2,{"$f":"SUM(L9,O9,R9,V9,Z9,AC9,AG9)","v":680},{"$f":"IF(OR(C9=\"\",Z9=\"\"),\"\",COUNTIF(BD$8:BD$600,\">\"&BD9)+1)","v":1},{"$f":"IF(B9=\"\",\"\",B9)","v":102},{"$f":"IF(C9=\"\",\"\",C9)","v":"باسل علي"},{"$f":"IF(D9=\"\",\"\",D9)","v":""},{"$f":"IF(E9=\"\",\"\",E9)","v":""},{"$f":"IF(F9=\"\",\"\",F9)","v":"مسلم"},null,2,null,2,null,null,null,null,null,null,680]
[3,103,"توفيق محمود",null,null,"مسلم","مستجد",null,"",50,50,100,50,50,100,50,50,100,40,20,20,80,50,10,40,100,50,50,100,50,10,40,100,5,5,10,50,50,100,50,50,100,null,null,null,null,null,1,null,null,null,null,null,3,null,680,1,103,"توفيق محمود","","","مسلم",null,3,null,null,3,null,null,null,null,null,680]
[4,104,"جابر مخمد",null,null,"مسلم","مستجد",null,"",50,50,100,50,50,100,50,50,100,40,20,20,80,50,10,40,100,50,50,100,50,10,40,100,5,5,10,50,50,100,50,50,100,null,null,null,null,null,1.5,null,null,null,null,null,null,4,680,1,104,"جابر مخمد","","","مسلم",null,4,null,null,null,4,null,null,null,null,680]
[5,105,"خالد مصطفى",null,null,"مسلم","مستجد",null,"",50,50,100,50,50,100,50,50,100,40,20,20,80,50,10,40,100,50,50,100,50,10,40,100,5,5,10,50,50,100,50,50,100,null,null,null,null,null,2,null,null,null,null,null,5,null,680,1,105,"خالد مصطفى","","","مسلم",null,5,null,null,null,null,5,null,null,null,680]
[6,106,"سليم مراد",null,null,"مسلم","مستجد",null,"",50,50,100,50,50,100,50,50,100,40,20,20,80,50,10,40,100,50,50,100,50,10,40,100,5,5,10,50,50,100,50,50,100,null,null,null,null,null,2.5,null,null,null,null,null,null,6,680,1,106,"سليم مراد","","","مسلم",null,6,null,null,null,null,null,6,null,null,680]
[7,107,"شاكر محمود",null,null,"مسلم","مستجد",null,"",50,50,100,50,50,100,50,50,100,40,20,20,80,50,10,40,100,50,50,100,50,10,40,100,5,5,10,50,50,100,50,50,100,null,null,null,null,null,3,null,null,null,null,null,7,null,680,1,107,"شاكر محمود","","","مسلم",null,7,null,null,null,null,null,null,7,null,680]
[8,108,"ماهر السيد",null,null,"مسلم","مستجد",null,"",50,50,100,50,50,100,50,50,100,40,20,20,80,50,10,40,100,50,50,100,50,10,40,100,5,5,10,50,50,100,50,50,100,null,null,null,null,null,3.5,null,null,null,null,null,null,8,680,1,108,"ماهر السيد","","","مسلم",null,8,null,null,null,null,null,null,null,8,680]
[9,109,"محمد حامد",null,null,"مسلم","مستجد",null,"",50,50,100,50,50,100,50,50,100,40,20,20,80,50,10,40,100,50,50,100,50,10,40,100,5,5,10,50,50,100,50,50,100,null,null,null,null,null,4,null,null,null,null,null,9,null,680,1,109,"محمد حامد","","","مسلم",null,9,9,null,null,null,null,null,null,null,680]
[10,110,"محمد جابر علي",null,null,"مسلم","مستجد",null,"",50,50,100,50,50,100,50,50,100,40,20,20,80,50,10,40,100,50,50,100,50,10,40,100,5,5,10,50,50,100,50,50,100,null,null,null,null,null,4.5,null,null,null,null,null,null,10,680,1,110,"محمد جابر علي","","","مسلم",null,10,null,10,null,null,null,null,null,null,0]
["",null,null,null,null,null,null,null,"",null,null,null,null,null,null,null,null,null,null,null,null,null,null,null,null,null,null,null,null,null,null,null,null,null,null,null,null,null,null,null,null,null,null,null,null,null,null,5,null,null,null,null,null,11,null,0,"","","","","","",null,11,null,null,11,null,null,null,null,null,0]
["",null,null,null,null,null,null,null,"",null,null,null,null,null,null,null,null,null,null,null,null,null,null,null,null,null,null,null,null,null,null,null,null,null,null,null,null,null,null,null,null,null,null,null,null,null,null,5.5,null,null,null,null,null,null,12,0,"","","","","","",null,12,null,null,null,12,null,null,null,null,0]
["",null,null,null,null,null,null,null,"",null,null,null,null,null,null,null,null,null,null,null,null,null,null,null,null,null,null,null,null,null,null,null,null,null,null,null,null,null,null,null,null,null,null,null,null,null,null,6,null,null,null,null,null,13,null,0,"","","","","","",null,13,null,null,null,null,13,null,null,null,0]
["",null,null,null,null,null,null,null,"",null,null,null,null,null,null,null,null,null,null,null,null,null,null,null,null,null,null,null,null,null,null,null,null,null,null,null,null,null,null,null,null,null,null,null,null,null,null,6.5,null,null,null,null,null,null,14,0,"","","","","","",null,14,null,null,null,null,null,14,null,null,0]
["",null,null,null,null,null,null,null,"",null,null,null,null,null,null,null,null,null,null,null,null,null,null,null,null,null,null,null,null,null,null,null,null,null,null,null,null,null,null,null,null,null,null,null,null,null,null,7,null,null,null,null,null,15,null,0,"","","","","","",null,15,null,null,null,null,null,null,15,null,0]
["",null,null,null,null,null,null,null,"",null,null,null,null,null,null,null,null,null,null,null,null,null,null,null,null,null,null,null,null,null,null,null,null,null,null,null,null,null,null,null,null,null,null,null,null,null,null,7.5,null,null,null,null,null,null,16,0,"","","","","","",null,16,null,null,null,null,null,null,null,16,0]
["",null,null,null,null,null,null,null,"",null,null,null,null,null,null,null,null,null,null,null,null,null,null,null,null,null,null,null,null,null,null,null,null,null,null,null,null,null,null,null,null,null,null,null,null,null,null,8,null,null,null,null,null,17,null,0,"","","","","","",null,17,17,null,null,null,null,null,null,null,0]
["",null,null,null,null,null,null,null,"",null,null,null,null,null,null,null,null,null,null,null,null,null,null,null,null,null,null,null,null,null,null,null,null,null,null,null,null,null,null,null,null,null,null,null,null,null,null,8.5,null,null,null,null,null,null,18,0,"","","","","","",null,18,null,18,null,null,null,null,null,null,0]
["",null,null,null,null,null,null,null,"",null,null,null,null,null,null,null,null,null,null,null,null,null,null,null,null,null,null,null,null,null,null,null,null,null,null,null,null,null,null,null,null,null,null,null,null,null,null,9,null,null,null,null,null,19,null,0,"","","","","","",null,19,null,null,19,null,null,null,null,null,0]
["",null,null,null,null,null,null,null,"",null,null,null,null,null,null,null,null,null,null,null,null,null,null,null,null,null,null,null,null,null,null,null,null,null,null,null,null,null,null,null,null,null,null,null,null,null,null,9.5,null,null,null,null,null,null,20,0,"","","","","","",null,20,null,null,null,20,null,null,null,null,0]
["",null,null,null,null,null,null,null,"",null,null,null,null,null,null,null,null,null,null,null,null,null,null,null,null,null,null,null,null,null,null,null,null,null,null,null,null,null,null,null,null,null,null,null,null,null,null,10,null,null,null,null,null,21,null,0,"","","","","","",null,21,null,null,null,null,21,null,null,null,0]
["",null,null,null,null,null,null,null,"",null,null,null,null,null,null,null,null,null,null,null,null,null,null,null,null,null,null,null,null,null,null,null,null,null,null,null,null,null,null,null,null,null,null,null,null,null,null,10.5,null,null,null,null,null,null,22,0,"","","","","","",null,22,null,null,null,null,null,22,null,null,0]
["",null,null,null,null,null,null,null,"",null,null,null,null,null,null,null,null,null,null,null,null,null,null,null,null,null,null,null,null,null,null,null,null,null,null,null,null,null,null,null,null,null,null,null,null,null,null,11,null,null,null,null,null,23,null,0,"","","","","","",null,23,null,null,null,null,null,null,23,null,0]
["",null,null,null,null,null,null,null,"",null,null,null,null,null,null,null,null,null,null,null,null,null,null,null,null,null,null,null,null,null,null,null,null,null,null,null,null,null,null,null,null,null,null,null,null,null,null,11.5,null,null,null,null,null,null,24,0,"","","","","","",null,24,null,null,null,null,null,null,null,24,0]
["",null,null,null,null,null,null,null,"",null,null,null,null,null,null,null,null,null,null,null,null,null,null,null,null,null,null,null,null,null,null,null,null,null,null,null,null,null,null,null,null,null,null,null,null,null,null,12,null,null,null,null,null,25,null,0,"","","","","","",null,25,25,null,null,null,null,null,null,null,0]
["",null,null,null,null,null,null,null,"",null,null,null,null,null,null,null,null,null,null,null,null,null,null,null,null,null,null,null,null,null,null,null,null,null,null,null,null,null,null,null,null,null,null,null,null,null,null,12.5,null,null,null,null,null,null,26,0,"","","","","","",null,26,null,26,null,null,null,null,null,null,0]
["",null,null,null,null,null,null,null,"",null,null,null,null,null,null,null,null,null,null,null,null,null,null,null,null,null,null,null,null,null,null,null,null,null,null,null,null,null,null,null,null,null,null,null,null,null,null,13,null,null,null,null,null,27,null,0,"","","","","","",null,27,null,null,27,null,null,null,null,null,0]
["",null,null,null,null,null,null,null,"",null,null,null,null,null,null,null,null,null,null,null,null,null,null,null,null,null,null,null,null,null,null,null,null,null,null,null,null,null,null,null,null,null,null,null,null,null,null,13.5,null,null,null,null,null,null,28,0,"","","","","","",null,28,null,null,null,28,null,null,null,null,0]
["",null,null,null,null,null,null,null,"",null,null,null,null,null,null,null,null,null,null,null,null,null,null,null,null,null,null,null,null,null,null,null,null,null,null,null,null,null,null,null,null,null,null,null,null,null,null,14,null,null,null,null,null,29,null,0,"","","","","","",null,29,null,null,null,null,29,null,null,null,0]
["",null,null,null,null,null,null,null,"",null,null,null,null,null,null,null,null,null,null,null,null,null,null,null,null,null,null,null,null,null,null,null,null,null,null,null,null,null,null,null,null,null,null,null,null,null,null,14.5,null,null,null,null,null,null,30,0,"","","","","","",null,30,null,null,null,null,null,30,null,null,0]
["",null,null,null,null,null,null,null,"",null,null,null,null,null,null,null,null,null,null,null,null,null,null,null,null,null,null,null,null,null,null,null,null,null,null,null,null,null,null,null,null,null,null,null,null,null,null,15,null,null,null,null,null,31,null,0,"","","","","","",null,31,null,null,null,null,null,null,31,null,0]
["",null,null,null,null,null,null,null,"",null,null,null,null,null,null,null,null,null,null,null,null,null,null,null,null,null,null,null,null,null,null,null,null,null,null,null,null,null,null,null,null,null,null,null,null,null,null,15.5,null,null,null,null,null,null,32,0,"","","","","","",null,32,null,null,null,null,null,null,null,32,0]
["",null,null,null,null,null,null,null,"",null,null,null,null,null,null,null,null,null,null,null,null,null,null,null,null,null,null,null,null,null,null,null,null,null,null,null,null,null,null,null,null,null,null,null,null,null,null,16,null,null,null,null,null,33,null,0,"","","","","","",null,33,33,null,null,null,null,null,null,null,0]
{"$rows_left_out":494}
{"sheet":"شهادات الترم الأول","index":2,"n_rows":36,"n_cols":16,"rows_kept":36,"cut":false,"hidden":false,"merged":[[10,15,12,15],[10,13,12,14],[16,1,16,4],[16,7,16,8],[16,11,16,15],[1,2,1,5],[2,2,2,5],[5,11,5,12],[5,13,5,15],[5,1,5,2],[5,3,5,8],[2,13,2,15],[11,1,12,12],[14,1,14,4],[14,7,14,8],[14,11,14,15],[7,13,7,15],[8,13,9,15],[21,2,21,5],[24,1,24,2],[24,3,24,8],[21,13,21,15],[20,2,20,5],[30,1,31,12],[24,11,24,12],[24,13,24,15],[26,13,26,15],[27,13,28,15],[29,13,31,14],[29,15,31,15],[33,1,33,4],[33,7,33,8],[33,11,33,15],[35,1,35,4],[35,7,35,8],[35,11,35,15]]}
[]
[null,"إدارة",{"$f":"IF('البيانات الأساسية'!B3=\"\",\"\",'البيانات الأساسية'!B3)","v":"المنتزه التعليمية"}]
[null,"مدرسة",{"$f":"IF('البيانات الأساسية'!B4=\"\",\"\",'البيانات الأساسية'!B4)","v":"محمد اسماعيل"},null,null,null,null,4,null,null,null,null,"الصف",{"$f":"IF('البيانات الأساسية'!B6=\"\",\"\",'البيانات الأساسية'!B6)","v":"الصف الأول الإعدادي"}]
[]
[]
[null,"اسم الطالب",null,null,null,null,null,null,null,null,null,"رقم الجلوس",null,{"$f":"IF($H$3>0,LOOKUP($H$3,'شيت الترم الأول'!$BB$8:$BB$507,'شيت الترم الأول'!$B$8:$B$507),\"\")","v":103}]
[null,null,{"$f":"'شيت الترم الأول'!AA3","v":10},{"$f":"'شيت الترم الأول'!AB3","v":0},{"$f":"'شيت الترم الأول'!AC3","v":0},{"$f":"'شيت الترم الأول'!AD3","v":0},{"$f":"'شيت الترم الأول'!AE3","v":0},null,null,{"$f":"'شيت الترم الأول'!Z3","v":10}]
[null,"المادة","عربي","انجليزي","دراسات","رياضيات","علوم","التربية \nالفنية","الحاسب\n الآلي","المجموع\nالكلي","نشاط\n مصاحب","التربية \nالدينية","اللغة\nالفرنسية","ملاحظـــات"]
[null,"العظمى",100,100,100,100,100,100,100,700,10,100,100,"الكشط أو التعديل\n يلغي الشهادة"]
[null,"درجات الطالب",{"$f":"IF($H$3>0,LOOKUP($H$3,'شيت الترم الأول'!$BB$8:$BB$507,'شيت الترم الأول'!$L$8:$L$507),\"\")","v":100},{"$f":"IF($H$3>0,LOOKUP($H$3,'شيت الترم الأول'!$BB$8:$BB$507,'شيت الترم الأول'!$O$8:$O$507),\"\")","v":100},{"$f":"IF($H$3>0,LOOKUP($H$3,'شيت الترم الأول'!$BB$8:$BB$507,'شيت الترم الأول'!$R$8:$R$507),\"\")","v":100},{"$f":"IF($H$3>0,LOOKUP($H$3,'شيت الترم الأول'!$BB$8:$BB$507,'شيت الترم الأول'!$V$8:$V$507),\"\")","v":80},{"$f":"IF($H$3>0,LOOKUP($H$3,'شيت الترم الأول'!$BB$8:$BB$507,'شيت الترم الأول'!$Z$8:$Z$507),\"\")","v":100},{"$f":"IF($H$3>0,LOOKUP($H$3,'شيت الترم الأول'!$BB$8:$BB$507,'شيت الترم الأول'!$AC$8:$AC$507),\"\")","v":100},{"$f":"IF($H$3>0,LOOKUP($H$3,'شيت الترم الأول'!$BB$8:$BB$507,'شيت الترم الأول'!$AG$8:$AG$507),\"\")","v":100},{"$f":"IF(C10=\"\",\"\",SUM(C10:I10))","v":680},{"$f":"IF($H$3>0,LOOKUP($H$3,'شيت الترم الأول'!$BB$8:$BB$507,'شيت الترم الأول'!$AJ$8:$AJ$507),\"\")","v":10},{"$f":"IF($H$3>0,LOOKUP($H$3,'شيت الترم الأول'!$BB$8:$BB$507,'شيت الترم الأول'!$AM$8:$AM$507),\"\")","v":100},{"$f":"IF($H$3>0,LOOKUP($H$3,'شيت الترم الأول'!$BB$8:$BB$507,'شيت الترم الأول'!$AP$8:$AP$507),\"\")","v":100}]
[null,"التقدير",{"$f":"IF(C10=\"\",\"\",IF(C10=\"غ\",\"غ\",IF(C10<50,\"دون المستوى\",IF(AND(C10>=50,C10<65),\"مقبول\",IF(AND(C10>=65,C10<75),\"جيد\",IF(AND(C10>=75,C10<85),\"جيد جداً\",\"ممتاز\"))))))","v":"ممتاز"},{"$f":"IF(D10=\"\",\"\",IF(D10=\"غ\",\"غ\",IF(D10<50,\"دون المستوى\",IF(AND(D10>=50,D10<65),\"مقبول\",IF(AND(D10>=65,D10<75),\"جيد\",IF(AND(D10>=75,D10<85),\"جيد جداً\",\"ممتاز\"))))))","v":"ممتاز"},"ممتاز","جيد جداً","ممتاز","ممتاز","ممتاز",{"$f":"IF(J10=\"\",\"\",IF(J10=\"غ\",\"غ\",IF(J10<350,\"دون المستوى\",IF(AND(J10>=350,J10<455),\"مقبول\",IF(AND(J10>=455,J10<525),\"جيد\",IF(AND(J10>=525,J10<595),\"جيد جداً\",\"ممتاز\"))))))","v":"ممتاز"},{"$f":"IF(K10=\"\",\"\",IF(K10=\"غ\",\"غ\",IF(K10<5,\"دون المستوى\",IF(AND(K10>=5,K10<6.5),\"مقبول\",IF(AND(K10>=6.5,K10<7.5),\"جيد\",IF(AND(K10>=7.5,K10<8.5),\"جيد جداً\",\"ممتاز\"))))))","v":"ممتاز"},{"$f":"IF(L10=\"\",\"\",IF(L10=\"غ\",\"غ\",IF(L10<50,\"دون المستوى\",IF(AND(L10>=50,L10<65),\"مقبول\",IF(AND(L10>=65,L10<75),\"جيد\",IF(AND(L10>=75,L10<85),\"جيد جداً\",\"ممتاز\"))))))","v":"ممتاز"},{"$f":"IF(M10=\"\",\"\",IF(M10=\"غ\",\"غ\",IF(M10<50,\"دون المستوى\",IF(AND(M10>=50,M10<65),\"مقبول\",IF(AND(M10>=65,M10<75),\"جيد\",IF(AND(M10>=75,M10<85),\"جيد جداً\",\"ممتاز\"))))))","v":"ممتاز"},"الترتيب",null,{"$f":"IF($H$3>0,LOOKUP($H$3,'شيت الترم الأول'!$BB$8:$BB$509,'شيت الترم الأول'!$BE$8:$BE$509),\"\")","v":1}]
[null,"برمجة وتصميم : أ / محمود السايح مدرس العلوم بمدرسة / د . رفعت المحجوب ع . م . بنين ت : 0107510869"]
[]
[]
[null,"رئيس لجنة النظام والمراقبة",null,null,null,null,null,"مدير المدرسة",null,null,null,"مدير إدارة المدرسة"]
[]
[null,{"$f":"IF('البيانات الأساسية'!B7=\"\",\"\",'البيانات الأساسية'!B7)","v":"محمد علي"},null,null,null,null,null,{"$f":"IF('البيانات الأساسية'!B8=\"\",\"\",'البيانات الأساسية'!B8)","v":"محمود علي"},null,null,null,{"$f":"IF('البيانات الأساسية'!B9=\"\",\"\",'البيانات الأساسية'!B9)","v":"السيد علي"}]
[]
[]
[]
[null,"إدارة",{"$f":"IF('البيانات الأساسية'!B3=\"\",\"\",'البيانات الأساسية'!B3)","v":"المنتزه التعليمية"}]
[null,"مدرسة",{"$f":"IF('البيانات الأساسية'!B4=\"\",\"\",'البيانات الأساسية'!B4)","v":"محمد اسماعيل"},null,null,null,null,null,null,null,null,null,"الصف",{"$f":"IF('البيانات الأساسية'!B6=\"\",\"\",'البيانات الأساسية'!B6)","v":"الصف الأول الإعدادي"}]
[]
[]
[null,"اسم الطالب",null,{"$f":"IF($H$3>0,LOOKUP($H$3,'شيت الترم الأول'!$BC$8:$BC$507,'شيت الترم الأول'!$C$8:$C$507),\"\")","v":"جابر مخمد"},null,null,null,null,null,null,null,"رقم الجلوس","رقم الجلوس",{"$f":"IF($H$3>0,LOOKUP($H$3,'شيت الترم الأول'!$BC$8:$BC$507,'شيت الترم الأول'!$B$8:$B$507),\"\")","v":104}]
[]
[null,"المادة","عربي","انجليزي","دراسات","رياضيات","علوم","التربية \nالفنية","الحاسب\n الآلي","المجموع\nالكلي","نشاط \nمصاحب","التربية \nالدينية","اللغة\nالفرنسية","ملاحظـــات"]
[null,"العظمى",100,100,100,100,100,100,100,700,10,100,100,"الكشط أو التعديل\n يلغي الشهادة"]
[null,"درجات الطالب",{"$f":"IF($H$3>0,LOOKUP($H$3,'شيت الترم الأول'!$BC$8:$BC$507,'شيت الترم الأول'!$L$8:$L$507),\"\")","v":100},{"$f":"IF($H$3>0,LOOKUP($H$3,'شيت الترم الأول'!$BC$8:$BC$507,'شيت الترم الأول'!$O$8:$O$507),\"\")","v":100},{"$f":"IF($H$3>0,LOOKUP($H$3,'شيت الترم الأول'!$BC$8:$BC$507,'شيت الترم الأول'!$R$8:$R$507),\"\")","v":100},{"$f":"IF($H$3>0,LOOKUP($H$3,'شيت الترم الأول'!$BC$8:$BC$507,'شيت الترم الأول'!$V$8:$V$507),\"\")","v":80},{"$f":"IF($H$3>0,LOOKUP($H$3,'شيت الترم الأول'!$BC$8:$BC$507,'شيت الترم الأول'!$Z$8:$Z$507),\"\")","v":100},{"$f":"IF($H$3>0,LOOKUP($H$3,'شيت الترم الأول'!$BC$8:$BC$507,'شيت الترم الأول'!$AC$8:$AC$507),\"\")","v":100},{"$f":"IF($H$3>0,LOOKUP($H$3,'شيت الترم الأول'!$BC$8:$BC$507,'شيت الترم الأول'!$AG$8:$AG$507),\"\")","v":100},{"$f":"IF(C29=\"\",\"\",SUM(C29:I29))","v":680},{"$f":"IF($H$3>0,LOOKUP($H$3,'شيت الترم الأول'!$BC$8:$BC$507,'شيت الترم الأول'!$AJ$8:$AJ$507),\"\")","v":10},{"$f":"IF($H$3>0,LOOKUP($H$3,'شيت الترم الأول'!$BC$8:$BC$507,'شيت الترم الأول'!$AM$8:$AM$507),\"\")","v":100},{"$f":"IF($H$3>0,LOOKUP($H$3,'شيت الترم الأول'!$BC$8:$BC$507,'شيت الترم الأول'!$AP$8:$AP$507),\"\")","v":100}]
[null,"التقدير",{"$f":"IF(C29=\"\",\"\",IF(C29=\"غ\",\"غ\",IF(C29<50,\"دون المستوى\",IF(AND(C29>=50,C29<65),\"مقبول\",IF(AND(C29>=65,C29<75),\"جيد\",IF(AND(C29>=75,C29<85),\"جيد جداً\",\"ممتاز\"))))))","v":"ممتاز"},{"$f":"IF(D29=\"\",\"\",IF(D29=\"غ\",\"غ\",IF(D29<50,\"دون المستوى\",IF(AND(D29>=50,D29<65),\"مقبول\",IF(AND(D29>=65,D29<75),\"جيد\",IF(AND(D29>=75,D29<85),\"جيد جداً\",\"ممتاز\"))))))","v":"ممتاز"},"ممتاز","جيد جداً","ممتاز","ممتاز","ممتاز",{"$f":"IF(J29=\"\",\"\",IF(J29=\"غ\",\"غ\",IF(J29<350,\"دون المستوى\",IF(AND(J29>=350,J29<455),\"مقبول\",IF(AND(J29>=455,J29<525),\"جيد\",IF(AND(J29>=525,J29<595),\"جيد جداً\",\"ممتاز\"))))))","v":"ممتاز"},{"$f":"IF(K29=\"\",\"\",IF(K29=\"غ\",\"غ\",IF(K29<5,\"دون المستوى\",IF(AND(K29>=5,K29<6.5),\"مقبول\",IF(AND(K29>=6.5,K29<7.5),\"جيد\",IF(AND(K29>=7.5,K29<8.5),\"جيد جداً\",\"ممتاز\"))))))","v":"ممتاز"},"ممتاز","ممتاز","الترتيب",null,{"$f":"IF($H$3>0,LOOKUP($H$3,'شيت الترم الأول'!$BC$8:$BC$509,'شيت الترم الأول'!$BE$8:$BE$509),\"\")","v":1}]
[null,"برمجة وتصميم : أ / محمود السايح مدرس العلوم بمدرسة / د . رفعت المحجوب ع . م . بنين ت : 0107510869"]
[]
[]
[null,"رئيس لجنة النظام والمراقبة",null,null,null,null,null,"مدير المدرسة",null,null,null,"مدير إدارة المدرسة"]
[]
[null,{"$f":"IF('البيانات الأساسية'!B7=\"\",\"\",'البيانات الأساسية'!B7)","v":"محمد علي"},null,null,null,null,null,{"$f":"IF('البيانات الأساسية'!B8=\"\",\"\",'البيانات الأساسية'!B8)","v":"محمود علي"},null,null,null,{"$f":"IF('البيانات الأساسية'!B9=\"\",\"\",'البيانات الأساسية'!B9)","v":"السيد علي"}]