{"text_format":"1","workbook":"xlsx","n_sheets":3,"sheets":["Accmove","يونيو","يوليو"],"not_rendered":{"charts":0,"images":0,"macros":1,"external_links":1,"defined_names":3,"comments":0,"pivot_tables":0},"unopened":[],"bounds":{"document_bytes":16777216,"sheet_cells":100000,"rows_first":2000,"rows_last":500,"rows_between":2000,"halvings":0,"cell_chars":16384,"cell_head_chars":4096},"cells_cut":0,"cells_raw":0,"read":"whole","date_system":"1900"}

{"sheet":"Accmove","index":0,"n_rows":43,"n_cols":21,"rows_kept":43,"cut":false,"hidden":false,"merged":[]}
[null,null,null,null,null,null,null,null,null,null,null,null,null,null,{"$f":"COLUMN()","v":15},{"$f":"COLUMN()","v":16},{"$f":"COLUMN()","v":17},{"$f":"COLUMN()","v":18},{"$f":"COLUMN()","v":19}]
[0,"الرصيد",null,null,null,null,null,{"$f":"SUBTOTAL(9,H$4:$H89369)","v":2690},{"$f":"SUBTOTAL(9,$I$4:I89369)","v":2690},{"$f":"H2-I2","v":0},null,{"$f":"SUBTOTAL(9,L4:L5)","v":0},null,{"$f":"SUBTOTAL(9,N4:N5)","v":0}]
["م","كود االحساب","اسم الحساب","رقم امر التوريد","رقم الاذن","يدوي","تاريخ الحركة","مدين","دائن","الرصيد",null,"ض مبيعات",null,"ض ا ت ص","التصنيف","نوع الحركة","group","الاذن مسلسل","البيان","الشهر"]
[{"$f":"IF((A3)<>\"م\",(A3)+1,1)","v":1},2," مصطفى محمد سعد",null,null,null,"2022-01-01"," ",null,{"$f":"SUMIFS(H$4:H4,B$4:B4,B4)-SUMIFS(I$4:I4,B$4:B4,B4)","v":0},null,null,null,null,null,"انشاء حساب",{"$f":"CHOOSE(T4,\"يناير\",\"فبراير\",\"مارس\",\"ابريل\",\"مايو\",\"يونيو\",\"يوليو\",\"اغسطس\",\"سبتمبر\",\"اكتوبر\",\"نوفمبر\",\"ديسمبر\")","v":"يناير"},null,null,1]
[2,3," احمد عبد الستار",null,null,null,"2022-01-01"," ",null,{"$f":"SUMIFS(H$4:H5,B$4:B5,B5)-SUMIFS(I$4:I5,B$4:B5,B5)","v":0},null,null,null,null,null,"انشاء حساب",{"$f":"CHOOSE(T5,\"يناير\",\"فبراير\",\"مارس\",\"ابريل\",\"مايو\",\"يونيو\",\"يوليو\",\"اغسطس\",\"سبتمبر\",\"اكتوبر\",\"نوفمبر\",\"ديسمبر\")","v":"يناير"},null,null,1]
[3,4,"محمود انيس",null,null,null,"2022-01-01"," ",null,{"$f":"SUMIFS(H$4:H6,B$4:B6,B6)-SUMIFS(I$4:I6,B$4:B6,B6)","v":0},null,null,null,null,null,"انشاء حساب","يناير",null,null,1]
[4,5," محمود سعد",null,null,null,"2022-01-01"," ",null,{"$f":"SUMIFS(H$4:H7,B$4:B7,B7)-SUMIFS(I$4:I7,B$4:B7,B7)","v":0},null,null,null,null,null,"انشاء حساب","يناير",null,null,1]
[5,6,"شيماء يوسف",null,null,null,"2022-01-01"," ",null,{"$f":"SUMIFS(H$4:H8,B$4:B8,B8)-SUMIFS(I$4:I8,B$4:B8,B8)","v":0},null,null,null,null,null,"انشاء حساب","يناير",null,null,1]
[6,7,"سناء- عبد القادر",null,null,null,"2022-01-01"," ",null,{"$f":"SUMIFS(H$4:H9,B$4:B9,B9)-SUMIFS(I$4:I9,B$4:B9,B9)","v":0},null,null,null,null,null,"انشاء حساب","فبراير",null,null,2]
[7,8,"عبده عباس ابو السعود",null,null,null,"2022-01-01"," ",null,{"$f":"SUMIFS(H$4:H10,B$4:B10,B10)-SUMIFS(I$4:I10,B$4:B10,B10)","v":0},null,null,null,null,null,"انشاء حساب","فبراير",null,null,2]
[8,9,"فريد الحسينى الشبراوى",null,null,null,"2022-01-01"," ",null,{"$f":"SUMIFS(H$4:H11,B$4:B11,B11)-SUMIFS(I$4:I11,B$4:B11,B11)","v":0},null,null,null,null,null,"انشاء حساب","فبراير",null,null,2]
[9,10,"يحيى العجمى",null,null,null,"2022-01-01"," ",null,{"$f":"SUMIFS(H$4:H12,B$4:B12,B12)-SUMIFS(I$4:I12,B$4:B12,B12)","v":0},null,null,null,null,null,"انشاء حساب","فبراير",null,null,2]
[10,11,"ابراهيم محمد ابراهيم",null,null,null,"2022-01-01"," ",null,{"$f":"SUMIFS(H$4:H13,B$4:B13,B13)-SUMIFS(I$4:I13,B$4:B13,B13)","v":0},null,null,null,null,null,"انشاء حساب","فبراير",null,null,2]
[11,12,"عبد العزيز بشير",null,null,null,"2022-01-01"," ",null,{"$f":"SUMIFS(H$4:H14,B$4:B14,B14)-SUMIFS(I$4:I14,B$4:B14,B14)","v":0},null,null,null,null,null,"انشاء حساب","فبراير",null,null,2]
[12,13,"محمود محمد الشيخ",null,null,null,"2022-01-01"," ",null,{"$f":"SUMIFS(H$4:H15,B$4:B15,B15)-SUMIFS(I$4:I15,B$4:B15,B15)","v":0},null,null,null,null,null,"انشاء حساب","مارس",null,null,3]
{"$rows_left_out":29}
{"sheet":"يونيو","index":1,"n_rows":8,"n_cols":13,"rows_kept":8,"cut":false,"hidden":false,"merged":[[2,6,3,6],[2,0,3,0],[2,1,3,1],[2,2,3,2],[2,3,3,3],[2,4,3,4],[2,5,3,5]]}
[null,null,null,null,null,null,null,null,null,"يونيو",2022,6]
[null,null,null,null,{"$f":"IFERROR(SUBTOTAL(9,E5:E20000),0)","v":240},null,null,{"$f":"IFERROR(SUBTOTAL(9,H5:H20000),0)","v":0},0,2160,2160,2160,2160]
["م","كود العميل"," ","التاريخ","القسط","الوكيل","عميل فرعى","رصيداول المده",null,"حركة",{"$f":"J1","v":"يونيو"},"الاجمالى"]
[null,null,null,null,null,null,null,"مدين ","دائن","مدين ","دائن","مدين ","دائن"]
[{"$f":"IF((A4)<>\"م\",(A4)+1,1)","v":1},2," مصطفى محمد سعد","2022-06-25",{"$f":"IFERROR(VLOOKUP(C5,[1]credit!D:N,10,FALSE),0)","v":120},{"$f":"IFERROR(VLOOKUP(C5,[1]credit!D:N,3,FALSE),0)","v":"test1"},{"$f":"IFERROR(VLOOKUP(C5,[1]credit!D:N,2,FALSE),0)","v":" احمد محمد سعد"},{"$f":"IF(SUMIFS(Accmove!H:H,Accmove!B:B,B5,Accmove!T:T,\"<\"&L$1)-SUMIFS(Accmove!I:I,Accmove!B:B,B5,Accmove!T:T,\"<\"&L$1)>0,SUMIFS(Accmove!H:H,Accmove!B:B,B5,Accmove!T:T,\"<\"&L$1)-SUMIFS(Accmove!I:I,Accmove!B:B,B5,Accmove!T:T,\"<\"&L$1),0)","v":0},{"$f":"IF(SUMIFS(Accmove!H:H,Accmove!B:B,B5,Accmove!T:T,\"<\"&L$1)-SUMIFS(Accmove!I:I,Accmove!B:B,B5,Accmove!T:T,\"<\"&L$1)<0,SUMIFS(Accmove!H:H,Accmove!B:B,B5,Accmove!T:T,\"<\"&L$1)-SUMIFS(Accmove!I:I,Accmove!B:B,B5,Accmove!T:T,\"<\"&L$1),0)*-1","v":0},{"$f":"IF(SUMIFS(Accmove!H:H,Accmove!B:B,B5,Accmove!Q:Q,J$1)-SUMIFS(Accmove!I:I,Accmove!B:B,B5,Accmove!Q:Q,J$1)>0,SUMIFS(Accmove!H:H,Accmove!B:B,B5,Accmove!Q:Q,J$1)-SUMIFS(Accmove!I:I,Accmove!B:B,B5,Accmove!Q:Q,J$1),0)","v":1080},{"$f":"IF(SUMIFS(Accmove!H:H,Accmove!B:B,B5,Accmove!Q:Q,J$1)-SUMIFS(Accmove!I:I,Accmove!B:B,B5,Accmove!Q:Q,J$1)<0,SUMIFS(Accmove!H:H,Accmove!B:B,B5,Accmove!Q:Q,J$1)-SUMIFS(Accmove!I:I,Accmove!B:B,B5,Accmove!Q:Q,J$1),0)*-1","v":0},{"$f":"IF(H5-I5+J5-K5>0,H5-I5+J5-K5,0)","v":1080},{"$f":"IF(H5-I5+J5-K5<0,H5-I5+J5-K5,0)*-1","v":0}]
[{"$f":"IF((A5)<>\"م\",(A5)+1,1)","v":2},1,"test1","2022-06-25",{"$f":"IFERROR(VLOOKUP(C6,[1]credit!D:N,10,FALSE),0)","v":0},{"$f":"IFERROR(VLOOKUP(C6,[1]credit!D:N,3,FALSE),0)","v":0},{"$f":"IFERROR(VLOOKUP(C6,[1]credit!D:N,2,FALSE),0)","v":0},{"$f":"IF(SUMIFS(Accmove!H:H,Accmove!B:B,B6,Accmove!T:T,\"<\"&L$1)-SUMIFS(Accmove!I:I,Accmove!B:B,B6,Accmove!T:T,\"<\"&L$1)>0,SUMIFS(Accmove!H:H,Accmove!B:B,B6,Accmove!T:T,\"<\"&L$1)-SUMIFS(Accmove!I:I,Accmove!B:B,B6,Accmove!T:T,\"<\"&L$1),0)","v":0},{"$f":"IF(SUMIFS(Accmove!H:H,Accmove!B:B,B6,Accmove!T:T,\"<\"&L$1)-SUMIFS(Accmove!I:I,Accmove!B:B,B6,Accmove!T:T,\"<\"&L$1)<0,SUMIFS(Accmove!H:H,Accmove!B:B,B6,Accmove!T:T,\"<\"&L$1)-SUMIFS(Accmove!I:I,Accmove!B:B,B6,Accmove!T:T,\"<\"&L$1),0)*-1","v":0},{"$f":"IF(SUMIFS(Accmove!H:H,Accmove!B:B,B6,Accmove!Q:Q,J$1)-SUMIFS(Accmove!I:I,Accmove!B:B,B6,Accmove!Q:Q,J$1)>0,SUMIFS(Accmove!H:H,Accmove!B:B,B6,Accmove!Q:Q,J$1)-SUMIFS(Accmove!I:I,Accmove!B:B,B6,Accmove!Q:Q,J$1),0)","v":0},{"$f":"IF(SUMIFS(Accmove!H:H,Accmove!B:B,B6,Accmove!Q:Q,J$1)-SUMIFS(Accmove!I:I,Accmove!B:B,B6,Accmove!Q:Q,J$1)<0,SUMIFS(Accmove!H:H,Accmove!B:B,B6,Accmove!Q:Q,J$1)-SUMIFS(Accmove!I:I,Accmove!B:B,B6,Accmove!Q:Q,J$1),0)*-1","v":1080},{"$f":"IF(H6-I6+J6-K6>0,H6-I6+J6-K6,0)","v":0},{"$f":"IF(H6-I6+J6-K6<0,H6-I6+J6-K6,0)*-1","v":1080}]
[{"$f":"IF((A6)<>\"م\",(A6)+1,1)","v":3},2," مصطفى محمد سعد","24/6/2022",{"$f":"IFERROR(VLOOKUP(C7,[1]credit!D:N,10,FALSE),0)","v":120},{"$f":"IFERROR(VLOOKUP(C7,[1]credit!D:N,3,FALSE),0)","v":"test1"},{"$f":"IFERROR(VLOOKUP(C7,[1]credit!D:N,2,FALSE),0)","v":" احمد محمد سعد"},{"$f":"IF(SUMIFS(Accmove!H:H,Accmove!B:B,B7,Accmove!T:T,\"<\"&L$1)-SUMIFS(Accmove!I:I,Accmove!B:B,B7,Accmove!T:T,\"<\"&L$1)>0,SUMIFS(Accmove!H:H,Accmove!B:B,B7,Accmove!T:T,\"<\"&L$1)-SUMIFS(Accmove!I:I,Accmove!B:B,B7,Accmove!T:T,\"<\"&L$1),0)","v":0},{"$f":"IF(SUMIFS(Accmove!H:H,Accmove!B:B,B7,Accmove!T:T,\"<\"&L$1)-SUMIFS(Accmove!I:I,Accmove!B:B,B7,Accmove!T:T,\"<\"&L$1)<0,SUMIFS(Accmove!H:H,Accmove!B:B,B7,Accmove!T:T,\"<\"&L$1)-SUMIFS(Accmove!I:I,Accmove!B:B,B7,Accmove!T:T,\"<\"&L$1),0)*-1","v":0},{"$f":"IF(SUMIFS(Accmove!H:H,Accmove!B:B,B7,Accmove!Q:Q,J$1)-SUMIFS(Accmove!I:I,Accmove!B:B,B7,Accmove!Q:Q,J$1)>0,SUMIFS(Accmove!H:H,Accmove!B:B,B7,Accmove!Q:Q,J$1)-SUMIFS(Accmove!I:I,Accmove!B:B,B7,Accmove!Q:Q,J$1),0)","v":1080},{"$f":"IF(SUMIFS(Accmove!H:H,Accmove!B:B,B7,Accmove!Q:Q,J$1)-SUMIFS(Accmove!I:I,Accmove!B:B,B7,Accmove!Q:Q,J$1)<0,SUMIFS(Accmove!H:H,Accmove!B:B,B7,Accmove!Q:Q,J$1)-SUMIFS(Accmove!I:I,Accmove!B:B,B7,Accmove!Q:Q,J$1),0)*-1","v":0},{"$f":"IF(H7-I7+J7-K7>0,H7-I7+J7-K7,0)","v":1080},{"$f":"IF(H7-I7+J7-K7<0,H7-I7+J7-K7,0)*-1","v":0}]
[{"$f":"IF((A7)<>\"م\",(A7)+1,1)","v":4},1,"ح/صندوق الاقساط","24/6/2022",{"$f":"IFERROR(VLOOKUP(C8,[1]credit!D:N,10,FALSE),0)","v":0},{"$f":"IFERROR(VLOOKUP(C8,[1]credit!D:N,3,FALSE),0)","v":0},{"$f":"IFERROR(VLOOKUP(C8,[1]credit!D:N,2,FALSE),0)","v":0},{"$f":"IF(SUMIFS(Accmove!H:H,Accmove!B:B,B8,Accmove!T:T,\"<\"&L$1)-SUMIFS(Accmove!I:I,Accmove!B:B,B8,Accmove!T:T,\"<\"&L$1)>0,SUMIFS(Accmove!H:H,Accmove!B:B,B8,Accmove!T:T,\"<\"&L$1)-SUMIFS(Accmove!I:I,Accmove!B:B,B8,Accmove!T:T,\"<\"&L$1),0)","v":0},{"$f":"IF(SUMIFS(Accmove!H:H,Accmove!B:B,B8,Accmove!T:T,\"<\"&L$1)-SUMIFS(Accmove!I:I,Accmove!B:B,B8,Accmove!T:T,\"<\"&L$1)<0,SUMIFS(Accmove!H:H,Accmove!B:B,B8,Accmove!T:T,\"<\"&L$1)-SUMIFS(Accmove!I:I,Accmove!B:B,B8,Accmove!T:T,\"<\"&L$1),0)*-1","v":0},{"$f":"IF(SUMIFS(Accmove!H:H,Accmove!B:B,B8,Accmove!Q:Q,J$1)-SUMIFS(Accmove!I:I,Accmove!B:B,B8,Accmove!Q:Q,J$1)>0,SUMIFS(Accmove!H:H,Accmove!B:B,B8,Accmove!Q:Q,J$1)-SUMIFS(Accmove!I:I,Accmove!B:B,B8,Accmove!Q:Q,J$1),0)","v":0},{"$f":"IF(SUMIFS(Accmove!H:H,Accmove!B:B,B8,Accmove!Q:Q,J$1)-SUMIFS(Accmove!I:I,Accmove!B:B,B8,Accmove!Q:Q,J$1)<0,SUMIFS(Accmove!H:H,Accmove!B:B,B8,Accmove!Q:Q,J$1)-SUMIFS(Accmove!I:I,Accmove!B:B,B8,Accmove!Q:Q,J$1),0)*-1","v":1080},{"$f":"IF(H8-I8+J8-K8>0,H8-I8+J8-K8,0)","v":0},{"$f":"IF(H8-I8+J8-K8<0,H8-I8+J8-K8,0)*-1","v":1080}]

{"sheet":"يوليو","index":2,"n_rows":17,"n_cols":13,"rows_kept":17,"cut":false,"hidden":false,"merged":[[2,6,3,6],[2,0,3,0],[2,1,3,1],[2,2,3,2],[2,3,3,3],[2,4,3,4],[2,5,3,5]]}
[7,null,null,null,null,null,null,null,null,"يوليو",2022,7]
[null,null,null,null,{"$f":"IFERROR(SUBTOTAL(9,E5:E20000),0)","v":484},null,null,{"$f":"IFERROR(SUBTOTAL(9,H5:H20000),0)","v":5400},5400,1440,3600,3490,5650]
["م","كود العميل"," ","التاريخ","القسط","الوكيل","عميل فرعى","رصيداول المده",null,"حركة",{"$f":"J1","v":"يوليو"},"الاجمالى"]
[null,null,null,null,null,null,null,"مدين ","دائن","مدين ","دائن","مدين ","دائن"]
[{"$f":"IF((A4)<>\"م\",(A4)+1,1)","v":1},2," مصطفى محمد سعد","2022-07-05",{"$f":"IFERROR(VLOOKUP(C5,[1]credit!D:N,10,FALSE),0)","v":120},{"$f":"IFERROR(VLOOKUP(C5,[1]credit!D:N,3,FALSE),0)","v":"test1"},{"$f":"IFERROR(VLOOKUP(C5,[1]credit!D:N,2,FALSE),0)","v":" احمد محمد سعد"},{"$f":"IF(SUMIFS(Accmove!H:H,Accmove!B:B,B5,Accmove!T:T,\"<\"&L$1)-SUMIFS(Accmove!I:I,Accmove!B:B,B5,Accmove!T:T,\"<\"&L$1)>0,SUMIFS(Accmove!H:H,Accmove!B:B,B5,Accmove!T:T,\"<\"&L$1)-SUMIFS(Accmove!I:I,Accmove!B:B,B5,Accmove!T:T,\"<\"&L$1),0)","v":1080},{"$f":"IF(SUMIFS(Accmove!H:H,Accmove!B:B,B5,Accmove!T:T,\"<\"&L$1)-SUMIFS(Accmove!I:I,Accmove!B:B,B5,Accmove!T:T,\"<\"&L$1)<0,SUMIFS(Accmove!H:H,Accmove!B:B,B5,Accmove!T:T,\"<\"&L$1)-SUMIFS(Accmove!I:I,Accmove!B:B,B5,Accmove!T:T,\"<\"&L$1),0)*-1","v":0},{"$f":"IF(SUMIFS(Accmove!H:H,Accmove!B:B,B5,Accmove!Q:Q,J$1)-SUMIFS(Accmove!I:I,Accmove!B:B,B5,Accmove!Q:Q,J$1)>0,SUMIFS(Accmove!H:H,Accmove!B:B,B5,Accmove!Q:Q,J$1)-SUMIFS(Accmove!I:I,Accmove!B:B,B5,Accmove!Q:Q,J$1),0)","v":0},{"$f":"IF(SUMIFS(Accmove!H:H,Accmove!B:B,B5,Accmove!Q:Q,J$1)-SUMIFS(Accmove!I:I,Accmove!B:B,B5,Accmove!Q:Q,J$1)<0,SUMIFS(Accmove!H:H,Accmove!B:B,B5,Accmove!Q:Q,J$1)-SUMIFS(Accmove!I:I,Accmove!B:B,B5,Accmove!Q:Q,J$1),0)*-1","v":670},{"$f":"IF(H5-I5+J5-K5>0,H5-I5+J5-K5,0)","v":410},{"$f":"IF(H5-I5+J5-K5<0,H5-I5+J5-K5,0)*-1","v":0}]
[{"$f":"IF((A5)<>\"م\",(A5)+1,1)","v":2},1,"ح/صندوق الاقساط","2022-07-05",{"$f":"IFERROR(VLOOKUP(C6,[1]credit!D:N,10,FALSE),0)","v":0},{"$f":"IFERROR(VLOOKUP(C6,[1]credit!D:N,3,FALSE),0)","v":0},{"$f":"IFERROR(VLOOKUP(C6,[1]credit!D:N,2,FALSE),0)","v":0},{"$f":"IF(SUMIFS(Accmove!H:H,Accmove!B:B,B6,Accmove!T:T,\"<\"&L$1)-SUMIFS(Accmove!I:I,Accmove!B:B,B6,Accmove!T:T,\"<\"&L$1)>0,SUMIFS(Accmove!H:H,Accmove!B:B,B6,Accmove!T:T,\"<\"&L$1)-SUMIFS(Accmove!I:I,Accmove!B:B,B6,Accmove!T:T,\"<\"&L$1),0)","v":0},{"$f":"IF(SUMIFS(Accmove!H:H,Accmove!B:B,B6,Accmove!T:T,\"<\"&L$1)-SUMIFS(Accmove!I:I,Accmove!B:B,B6,Accmove!T:T,\"<\"&L$1)<0,SUMIFS(Accmove!H:H,Accmove!B:B,B6,Accmove!T:T,\"<\"&L$1)-SUMIFS(Accmove!I:I,Accmove!B:B,B6,Accmove!T:T,\"<\"&L$1),0)*-1","v":1080},{"$f":"IF(SUMIFS(Accmove!H:H,Accmove!B:B,B6,Accmove!Q:Q,J$1)-SUMIFS(Accmove!I:I,Accmove!B:B,B6,Accmove!Q:Q,J$1)>0,SUMIFS(Accmove!H:H,Accmove!B:B,B6,Accmove!Q:Q,J$1)-SUMIFS(Accmove!I:I,Accmove!B:B,B6,Accmove!Q:Q,J$1),0)","v":0},{"$f":"IF(SUMIFS(Accmove!H:H,Accmove!B:B,B6,Accmove!Q:Q,J$1)-SUMIFS(Accmove!I:I,Accmove!B:B,B6,Accmove!Q:Q,J$1)<0,SUMIFS(Accmove!H:H,Accmove!B:B,B6,Accmove!Q:Q,J$1)-SUMIFS(Accmove!I:I,Accmove!B:B,B6,Accmove!Q:Q,J$1),0)*-1","v":50},{"$f":"IF(H6-I6+J6-K6>0,H6-I6+J6-K6,0)","v":0},{"$f":"IF(H6-I6+J6-K6<0,H6-I6+J6-K6,0)*-1","v":1130}]
[{"$f":"IF((A6)<>\"م\",(A6)+1,1)","v":3},2," مصطفى محمد سعد","2022-07-05",{"$f":"IFERROR(VLOOKUP(C7,[1]credit!D:N,10,FALSE),0)","v":120},{"$f":"IFERROR(VLOOKUP(C7,[1]credit!D:N,3,FALSE),0)","v":"test1"},{"$f":"IFERROR(VLOOKUP(C7,[1]credit!D:N,2,FALSE),0)","v":" احمد محمد سعد"},{"$f":"IF(SUMIFS(Accmove!H:H,Accmove!B:B,B7,Accmove!T:T,\"<\"&L$1)-SUMIFS(Accmove!I:I,Accmove!B:B,B7,Accmove!T:T,\"<\"&L$1)>0,SUMIFS(Accmove!H:H,Accmove!B:B,B7,Accmove!T:T,\"<\"&L$1)-SUMIFS(Accmove!I:I,Accmove!B:B,B7,Accmove!T:T,\"<\"&L$1),0)","v":1080},{"$f":"IF(SUMIFS(Accmove!H:H,Accmove!B:B,B7,Accmove!T:T,\"<\"&L$1)-SUMIFS(Accmove!I:I,Accmove!B:B,B7,Accmove!T:T,\"<\"&L$1)<0,SUMIFS(Accmove!H:H,Accmove!B:B,B7,Accmove!T:T,\"<\"&L$1)-SUMIFS(Accmove!I:I,Accmove!B:B,B7,Accmove!T:T,\"<\"&L$1),0)*-1","v":0},{"$f":"IF(SUMIFS(Accmove!H:H,Accmove!B:B,B7,Accmove!Q:Q,J$1)-SUMIFS(Accmove!I:I,Accmove!B:B,B7,Accmove!Q:Q,J$1)>0,SUMIFS(Accmove!H:H,Accmove!B:B,B7,Accmove!Q:Q,J$1)-SUMIFS(Accmove!I:I,Accmove!B:B,B7,Accmove!Q:Q,J$1),0)","v":0},{"$f":"IF(SUMIFS(Accmove!H:H,Accmove!B:B,B7,Accmove!Q:Q,J$1)-SUMIFS(Accmove!I:I,Accmove!B:B,B7,Accmove!Q:Q,J$1)<0,SUMIFS(Accmove!H:H,Accmove!B:B,B7,Accmove!Q:Q,J$1)-SUMIFS(Accmove!I:I,Accmove!B:B,B7,Accmove!Q:Q,J$1),0)*-1","v":670},{"$f":"IF(H7-I7+J7-K7>0,H7-I7+J7-K7,0)","v":410},{"$f":"IF(H7-I7+J7-K7<0,H7-I7+J7-K7,0)*-1","v":0}]
[{"$f":"IF((A7)<>\"م\",(A7)+1,1)","v":4},1,"ح/صندوق الاقساط","2022-07-05",{"$f":"IFERROR(VLOOKUP(C8,[1]credit!D:N,10,FALSE),0)","v":0},{"$f":"IFERROR(VLOOKUP(C8,[1]credit!D:N,3,FALSE),0)","v":0},{"$f":"IFERROR(VLOOKUP(C8,[1]credit!D:N,2,FALSE),0)","v":0},{"$f":"IF(SUMIFS(Accmove!H:H,Accmove!B:B,B8,Accmove!T:T,\"<\"&L$1)-SUMIFS(Accmove!I:I,Accmove!B:B,B8,Accmove!T:T,\"<\"&L$1)>0,SUMIFS(Accmove!H:H,Accmove!B:B,B8,Accmove!T:T,\"<\"&L$1)-SUMIFS(Accmove!I:I,Accmove!B:B,B8,Accmove!T:T,\"<\"&L$1),0)","v":0},{"$f":"IF(SUMIFS(Accmove!H:H,Accmove!B:B,B8,Accmove!T:T,\"<\"&L$1)-SUMIFS(Accmove!I:I,Accmove!B:B,B8,Accmove!T:T,\"<\"&L$1)<0,SUMIFS(Accmove!H:H,Accmove!B:B,B8,Accmove!T:T,\"<\"&L$1)-SUMIFS(Accmove!I:I,Accmove!B:B,B8,Accmove!T:T,\"<\"&L$1),0)*-1","v":1080},{"$f":"IF(SUMIFS(Accmove!H:H,Accmove!B:B,B8,Accmove!Q:Q,J$1)-SUMIFS(Accmove!I:I,Accmove!B:B,B8,Accmove!Q:Q,J$1)>0,SUMIFS(Accmove!H:H,Accmove!B:B,B8,Accmove!Q:Q,J$1)-SUMIFS(Accmove!I:I,Accmove!B:B,B8,Accmove!Q:Q,J$1),0)","v":0},{"$f":"IF(SUMIFS(Accmove!H:H,Accmove!B:B,B8,Accmove!Q:Q,J$1)-SUMIFS(Accmove!I:I,Accmove!B:B,B8,Accmove!Q:Q,J$1)<0,SUMIFS(Accmove!H:H,Accmove!B:B,B8,Accmove!Q:Q,J$1)-SUMIFS(Accmove!I:I,Accmove!B:B,B8,Accmove!Q:Q,J$1),0)*-1","v":50},{"$f":"IF(H8-I8+J8-K8>0,H8-I8+J8-K8,0)","v":0},{"$f":"IF(H8-I8+J8-K8<0,H8-I8+J8-K8,0)*-1","v":1130}]
[{"$f":"IF((A8)<>\"م\",(A8)+1,1)","v":5},2," مصطفى محمد سعد","2022-07-05",{"$f":"IFERROR(VLOOKUP(C9,[1]credit!D:N,10,FALSE),0)","v":120},{"$f":"IFERROR(VLOOKUP(C9,[1]credit!D:N,3,FALSE),0)","v":"test1"},{"$f":"IFERROR(VLOOKUP(C9,[1]credit!D:N,2,FALSE),0)","v":" احمد محمد سعد"},{"$f":"IF(SUMIFS(Accmove!H:H,Accmove!B:B,B9,Accmove!T:T,\"<\"&L$1)-SUMIFS(Accmove!I:I,Accmove!B:B,B9,Accmove!T:T,\"<\"&L$1)>0,SUMIFS(Accmove!H:H,Accmove!B:B,B9,Accmove!T:T,\"<\"&L$1)-SUMIFS(Accmove!I:I,Accmove!B:B,B9,Accmove!T:T,\"<\"&L$1),0)","v":1080},{"$f":"IF(SUMIFS(Accmove!H:H,Accmove!B:B,B9,Accmove!T:T,\"<\"&L$1)-SUMIFS(Accmove!I:I,Accmove!B:B,B9,Accmove!T:T,\"<\"&L$1)<0,SUMIFS(Accmove!H:H,Accmove!B:B,B9,Accmove!T:T,\"<\"&L$1)-SUMIFS(Accmove!I:I,Accmove!B:B,B9,Accmove!T:T,\"<\"&L$1),0)*-1","v":0},{"$f":"IF(SUMIFS(Accmove!H:H,Accmove!B:B,B9,Accmove!Q:Q,J$1)-SUMIFS(Accmove!I:I,Accmove!B:B,B9,Accmove!Q:Q,J$1)>0,SUMIFS(Accmove!H:H,Accmove!B:B,B9,Accmove!Q:Q,J$1)-SUMIFS(Accmove!I:I,Accmove!B:B,B9,Accmove!Q:Q,J$1),0)","v":0},{"$f":"IF(SUMIFS(Accmove!H:H,Accmove!B:B,B9,Accmove!Q:Q,J$1)-SUMIFS(Accmove!I:I,Accmove!B:B,B9,Accmove!Q:Q,J$1)<0,SUMIFS(Accmove!H:H,Accmove!B:B,B9,Accmove!Q:Q,J$1)-SUMIFS(Accmove!I:I,Accmove!B:B,B9,Accmove!Q:Q,J$1),0)*-1","v":670},{"$f":"IF(H9-I9+J9-K9>0,H9-I9+J9-K9,0)","v":410},{"$f":"IF(H9-I9+J9-K9<0,H9-I9+J9-K9,0)*-1","v":0}]
[{"$f":"IF((A9)<>\"م\",(A9)+1,1)","v":6},1,"ح/صندوق الاقساط","2022-07-05",{"$f":"IFERROR(VLOOKUP(C10,[1]credit!D:N,10,FALSE),0)","v":0},{"$f":"IFERROR(VLOOKUP(C10,[1]credit!D:N,3,FALSE),0)","v":0},{"$f":"IFERROR(VLOOKUP(C10,[1]credit!D:N,2,FALSE),0)","v":0},{"$f":"IF(SUMIFS(Accmove!H:H,Accmove!B:B,B10,Accmove!T:T,\"<\"&L$1)-SUMIFS(Accmove!I:I,Accmove!B:B,B10,Accmove!T:T,\"<\"&L$1)>0,SUMIFS(Accmove!H:H,Accmove!B:B,B10,Accmove!T:T,\"<\"&L$1)-SUMIFS(Accmove!I:I,Accmove!B:B,B10,Accmove!T:T,\"<\"&L$1),0)","v":0},{"$f":"IF(SUMIFS(Accmove!H:H,Accmove!B:B,B10,Accmove!T:T,\"<\"&L$1)-SUMIFS(Accmove!I:I,Accmove!B:B,B10,Accmove!T:T,\"<\"&L$1)<0,SUMIFS(Accmove!H:H,Accmove!B:B,B10,Accmove!T:T,\"<\"&L$1)-SUMIFS(Accmove!I:I,Accmove!B:B,B10,Accmove!T:T,\"<\"&L$1),0)*-1","v":1080},{"$f":"IF(SUMIFS(Accmove!H:H,Accmove!B:B,B10,Accmove!Q:Q,J$1)-SUMIFS(Accmove!I:I,Accmove!B:B,B10,Accmove!Q:Q,J$1)>0,SUMIFS(Accmove!H:H,Accmove!B:B,B10,Accmove!Q:Q,J$1)-SUMIFS(Accmove!I:I,Accmove!B:B,B10,Accmove!Q:Q,J$1),0)","v":0},{"$f":"IF(SUMIFS(Accmove!H:H,Accmove!B:B,B10,Accmove!Q:Q,J$1)-SUMIFS(Accmove!I:I,Accmove!B:B,B10,Accmove!Q:Q,J$1)<0,SUMIFS(Accmove!H:H,Accmove!B:B,B10,Accmove!Q:Q,J$1)-SUMIFS(Accmove!I:I,Accmove!B:B,B10,Accmove!Q:Q,J$1),0)*-1","v":50},{"$f":"IF(H10-I10+J10-K10>0,H10-I10+J10-K10,0)","v":0},{"$f":"IF(H10-I10+J10-K10<0,H10-I10+J10-K10,0)*-1","v":1130}]
[{"$f":"IF((A10)<>\"م\",(A10)+1,1)","v":7},2," مصطفى محمد سعد","2022-07-05",{"$f":"IFERROR(VLOOKUP(C11,[1]credit!D:N,10,FALSE),0)","v":120},{"$f":"IFERROR(VLOOKUP(C11,[1]credit!D:N,3,FALSE),0)","v":"test1"},{"$f":"IFERROR(VLOOKUP(C11,[1]credit!D:N,2,FALSE),0)","v":" احمد محمد سعد"},{"$f":"IF(SUMIFS(Accmove!H:H,Accmove!B:B,B11,Accmove!T:T,\"<\"&L$1)-SUMIFS(Accmove!I:I,Accmove!B:B,B11,Accmove!T:T,\"<\"&L$1)>0,SUMIFS(Accmove!H:H,Accmove!B:B,B11,Accmove!T:T,\"<\"&L$1)-SUMIFS(Accmove!I:I,Accmove!B:B,B11,Accmove!T:T,\"<\"&L$1),0)","v":1080},{"$f":"IF(SUMIFS(Accmove!H:H,Accmove!B:B,B11,Accmove!T:T,\"<\"&L$1)-SUMIFS(Accmove!I:I,Accmove!B:B,B11,Accmove!T:T,\"<\"&L$1)<0,SUMIFS(Accmove!H:H,Accmove!B:B,B11,Accmove!T:T,\"<\"&L$1)-SUMIFS(Accmove!I:I,Accmove!B:B,B11,Accmove!T:T,\"<\"&L$1),0)*-1","v":0},{"$f":"IF(SUMIFS(Accmove!H:H,Accmove!B:B,B11,Accmove!Q:Q,J$1)-SUMIFS(Accmove!I:I,Accmove!B:B,B11,Accmove!Q:Q,J$1)>0,SUMIFS(Accmove!H:H,Accmove!B:B,B11,Accmove!Q:Q,J$1)-SUMIFS(Accmove!I:I,Accmove!B:B,B11,Accmove!Q:Q,J$1),0)","v":0},{"$f":"IF(SUMIFS(Accmove!H:H,Accmove!B:B,B11,Accmove!Q:Q,J$1)-SUMIFS(Accmove!I:I,Accmove!B:B,B11,Accmove!Q:Q,J$1)<0,SUMIFS(Accmove!H:H,Accmove!B:B,B11,Accmove!Q:Q,J$1)-SUMIFS(Accmove!I:I,Accmove!B:B,B11,Accmove!Q:Q,J$1),0)*-1","v":670},{"$f":"IF(H11-I11+J11-K11>0,H11-I11+J11-K11,0)","v":410},{"$f":"IF(H11-I11+J11-K11<0,H11-I11+J11-K11,0)*-1","v":0}]
[{"$f":"IF((A11)<>\"م\",(A11)+1,1)","v":8},1,"ح/صندوق الاقساط","2022-07-05",{"$f":"IFERROR(VLOOKUP(C12,[1]credit!D:N,10,FALSE),0)","v":0},{"$f":"IFERROR(VLOOKUP(C12,[1]credit!D:N,3,FALSE),0)","v":0},{"$f":"IFERROR(VLOOKUP(C12,[1]credit!D:N,2,FALSE),0)","v":0},{"$f":"IF(SUMIFS(Accmove!H:H,Accmove!B:B,B12,Accmove!T:T,\"<\"&L$1)-SUMIFS(Accmove!I:I,Accmove!B:B,B12,Accmove!T:T,\"<\"&L$1)>0,SUMIFS(Accmove!H:H,Accmove!B:B,B12,Accmove!T:T,\"<\"&L$1)-SUMIFS(Accmove!I:I,Accmove!B:B,B12,Accmove!T:T,\"<\"&L$1),0)","v":0},{"$f":"IF(SUMIFS(Accmove!H:H,Accmove!B:B,B12,Accmove!T:T,\"<\"&L$1)-SUMIFS(Accmove!I:I,Accmove!B:B,B12,Accmove!T:T,\"<\"&L$1)<0,SUMIFS(Accmove!H:H,Accmove!B:B,B12,Accmove!T:T,\"<\"&L$1)-SUMIFS(Accmove!I:I,Accmove!B:B,B12,Accmove!T:T,\"<\"&L$1),0)*-1","v":1080},{"$f":"IF(SUMIFS(Accmove!H:H,Accmove!B:B,B12,Accmove!Q:Q,J$1)-SUMIFS(Accmove!I:I,Accmove!B:B,B12,Accmove!Q:Q,J$1)>0,SUMIFS(Accmove!H:H,Accmove!B:B,B12,Accmove!Q:Q,J$1)-SUMIFS(Accmove!I:I,Accmove!B:B,B12,Accmove!Q:Q,J$1),0)","v":0},{"$f":"IF(SUMIFS(Accmove!H:H,Accmove!B:B,B12,Accmove!Q:Q,J$1)-SUMIFS(Accmove!I:I,Accmove!B:B,B12,Accmove!Q:Q,J$1)<0,SUMIFS(Accmove!H:H,Accmove!B:B,B12,Accmove!Q:Q,J$1)-SUMIFS(Accmove!I:I,Accmove!B:B,B12,Accmove!Q:Q,J$1),0)*-1","v":50},{"$f":"IF(H12-I12+J12-K12>0,H12-I12+J12-K12,0)","v":0},{"$f":"IF(H12-I12+J12-K12<0,H12-I12+J12-K12,0)*-1","v":1130}]
[{"$f":"IF((A12)<>\"م\",(A12)+1,1)","v":9},24,"test1","2022-07-05",{"$f":"IFERROR(VLOOKUP(C13,[1]credit!D:N,10,FALSE),0)","v":0},{"$f":"IFERROR(VLOOKUP(C13,[1]credit!D:N,3,FALSE),0)","v":0},{"$f":"IFERROR(VLOOKUP(C13,[1]credit!D:N,2,FALSE),0)","v":0},{"$f":"IF(SUMIFS(Accmove!H:H,Accmove!B:B,B13,Accmove!T:T,\"<\"&L$1)-SUMIFS(Accmove!I:I,Accmove!B:B,B13,Accmove!T:T,\"<\"&L$1)>0,SUMIFS(Accmove!H:H,Accmove!B:B,B13,Accmove!T:T,\"<\"&L$1)-SUMIFS(Accmove!I:I,Accmove!B:B,B13,Accmove!T:T,\"<\"&L$1),0)","v":0},{"$f":"IF(SUMIFS(Accmove!H:H,Accmove!B:B,B13,Accmove!T:T,\"<\"&L$1)-SUMIFS(Accmove!I:I,Accmove!B:B,B13,Accmove!T:T,\"<\"&L$1)<0,SUMIFS(Accmove!H:H,Accmove!B:B,B13,Accmove!T:T,\"<\"&L$1)-SUMIFS(Accmove!I:I,Accmove!B:B,B13,Accmove!T:T,\"<\"&L$1),0)*-1","v":0},{"$f":"IF(SUMIFS(Accmove!H:H,Accmove!B:B,B13,Accmove!Q:Q,J$1)-SUMIFS(Accmove!I:I,Accmove!B:B,B13,Accmove!Q:Q,J$1)>0,SUMIFS(Accmove!H:H,Accmove!B:B,B13,Accmove!Q:Q,J$1)-SUMIFS(Accmove!I:I,Accmove!B:B,B13,Accmove!Q:Q,J$1),0)","v":720},{"$f":"IF(SUMIFS(Accmove!H:H,Accmove!B:B,B13,Accmove!Q:Q,J$1)-SUMIFS(Accmove!I:I,Accmove!B:B,B13,Accmove!Q:Q,J$1)<0,SUMIFS(Accmove!H:H,Accmove!B:B,B13,Accmove!Q:Q,J$1)-SUMIFS(Accmove!I:I,Accmove!B:B,B13,Accmove!Q:Q,J$1),0)*-1","v":0},{"$f":"IF(H13-I13+J13-K13>0,H13-I13+J13-K13,0)","v":720},{"$f":"IF(H13-I13+J13-K13<0,H13-I13+J13-K13,0)*-1","v":0}]
[{"$f":"IF((A13)<>\"م\",(A13)+1,1)","v":10},1,"ح/صندوق الاقساط","2022-07-05",{"$f":"IFERROR(VLOOKUP(C14,[1]credit!D:N,10,FALSE),0)","v":0},{"$f":"IFERROR(VLOOKUP(C14,[1]credit!D:N,3,FALSE),0)","v":0},{"$f":"IFERROR(VLOOKUP(C14,[1]credit!D:N,2,FALSE),0)","v":0},{"$f":"IF(SUMIFS(Accmove!H:H,Accmove!B:B,B14,Accmove!T:T,\"<\"&L$1)-SUMIFS(Accmove!I:I,Accmove!B:B,B14,Accmove!T:T,\"<\"&L$1)>0,SUMIFS(Accmove!H:H,Accmove!B:B,B14,Accmove!T:T,\"<\"&L$1)-SUMIFS(Accmove!I:I,Accmove!B:B,B14,Accmove!T:T,\"<\"&L$1),0)","v":0},{"$f":"IF(SUMIFS(Accmove!H:H,Accmove!B:B,B14,Accmove!T:T,\"<\"&L$1)-SUMIFS(Accmove!I:I,Accmove!B:B,B14,Accmove!T:T,\"<\"&L$1)<0,SUMIFS(Accmove!H:H,Accmove!B:B,B14,Accmove!T:T,\"<\"&L$1)-SUMIFS(Accmove!I:I,Accmove!B:B,B14,Accmove!T:T,\"<\"&L$1),0)*-1","v":1080},{"$f":"IF(SUMIFS(Accmove!H:H,Accmove!B:B,B14,Accmove!Q:Q,J$1)-SUMIFS(Accmove!I:I,Accmove!B:B,B14,Accmove!Q:Q,J$1)>0,SUMIFS(Accmove!H:H,Accmove!B:B,B14,Accmove!Q:Q,J$1)-SUMIFS(Accmove!I:I,Accmove!B:B,B14,Accmove!Q:Q,J$1),0)","v":0},{"$f":"IF(SUMIFS(Accmove!H:H,Accmove!B:B,B14,Accmove!Q:Q,J$1)-SUMIFS(Accmove!I:I,Accmove!B:B,B14,Accmove!Q:Q,J$1)<0,SUMIFS(Accmove!H:H,Accmove!B:B,B14,Accmove!Q:Q,J$1)-SUMIFS(Accmove!I:I,Accmove!B:B,B14,Accmove!Q:Q,J$1),0)*-1","v":50},{"$f":"IF(H14-I14+J14-K14>0,H14-I14+J14-K14,0)","v":0},{"$f":"IF(H14-I14+J14-K14<0,H14-I14+J14-K14,0)*-1","v":1130}]
[{"$f":"IF((A14)<>\"م\",(A14)+1,1)","v":11},25," test me","2022-07-18",{"$f":"IFERROR(VLOOKUP(C15,[1]credit!D:N,10,FALSE),0)","v":2},{"$f":"IFERROR(VLOOKUP(C15,[1]credit!D:N,3,FALSE),0)","v":"test1"},{"$f":"IFERROR(VLOOKUP(C15,[1]credit!D:N,2,FALSE),0)","v":"test me"},{"$f":"IF(SUMIFS(Accmove!H:H,Accmove!B:B,B15,Accmove!T:T,\"<\"&L$1)-SUMIFS(Accmove!I:I,Accmove!B:B,B15,Accmove!T:T,\"<\"&L$1)>0,SUMIFS(Accmove!H:H,Accmove!B:B,B15,Accmove!T:T,\"<\"&L$1)-SUMIFS(Accmove!I:I,Accmove!B:B,B15,Accmove!T:T,\"<\"&L$1),0)","v":0},{"$f":"IF(SUMIFS(Accmove!H:H,Accmove!B:B,B15,Accmove!T:T,\"<\"&L$1)-SUMIFS(Accmove!I:I,Accmove!B:B,B15,Accmove!T:T,\"<\"&L$1)<0,SUMIFS(Accmove!H:H,Accmove!B:B,B15,Accmove!T:T,\"<\"&L$1)-SUMIFS(Accmove!I:I,Accmove!B:B,B15,Accmove!T:T,\"<\"&L$1),0)*-1","v":0},{"$f":"IF(SUMIFS(Accmove!H:H,Accmove!B:B,B15,Accmove!Q:Q,J$1)-SUMIFS(Accmove!I:I,Accmove!B:B,B15,Accmove!Q:Q,J$1)>0,SUMIFS(Accmove!H:H,Accmove!B:B,B15,Accmove!Q:Q,J$1)-SUMIFS(Accmove!I:I,Accmove!B:B,B15,Accmove!Q:Q,J$1),0)","v":0},{"$f":"IF(SUMIFS(Accmove!H:H,Accmove!B:B,B15,Accmove!Q:Q,J$1)-SUMIFS(Accmove!I:I,Accmove!B:B,B15,Accmove!Q:Q,J$1)<0,SUMIFS(Accmove!H:H,Accmove!B:B,B15,Accmove!Q:Q,J$1)-SUMIFS(Accmove!I:I,Accmove!B:B,B15,Accmove!Q:Q,J$1),0)*-1","v":0},{"$f":"IF(H15-I15+J15-K15>0,H15-I15+J15-K15,0)","v":0},{"$f":"IF(H15-I15+J15-K15<0,H15-I15+J15-K15,0)*-1","v":0}]
{"$rows_left_out":2}