{"text_format":"1","workbook":"xlsx","n_sheets":5,"sheets":["cum","T-B3C1","T-B3A1","T-B3A4","T-B3A3"],"not_rendered":{"charts":0,"images":0,"macros":1,"external_links":0,"defined_names":10,"comments":0,"pivot_tables":0},"unopened":[],"bounds":{"document_bytes":16777216,"sheet_cells":100000,"rows_first":2000,"rows_last":500,"rows_between":2000,"halvings":0,"cell_chars":16384,"cell_head_chars":4096},"cells_cut":0,"cells_raw":0,"read":"whole","date_system":"1900"}

{"sheet":"cum","index":0,"n_rows":236,"n_cols":6,"rows_kept":236,"cut":false,"hidden":false,"merged":[]}
["Activity ID","Activity Name","T-B3C1","T-B3A1","T-B3A4","T-B3A3"]
["A1210","أعمال الردم حتى منسوب الميد",{"$f":"VLOOKUP(Table6[[#This Row],[Activity ID]],'T-B3C1'!A:F,6,0)/100","v":0},{"$f":"VLOOKUP(Table6[[#This Row],[Activity ID]],'T-B3A1'!A:F,6,0)/100","v":0},{"$f":"VLOOKUP(Table6[[#This Row],[Activity ID]],'T-B3A4'!A:F,6,0)/100","v":0},{"$f":"VLOOKUP(Table6[[#This Row],[Activity ID]],'T-B3A3'!A:F,6,0)/100","v":0}]
["A1230","الردم حتى منسوب الدكة"]
["A1080","أعمال الردم حول الأساسات"]
["A1100","خرسانة دكه الأرضيات"]
["16-10","الخرسانة المسلحة للأعمدة والحوائط- الدور الخامس"]
["16-50","صب الخرسانة للسقف- الدور الخامس"]
["16-3110","الخرسانة المسلحة للأعمدة والحوائط- الملحق"]
["16-3150","صب الخرسانة للسقف- الملحق"]
["Ro-10","الخرسانة المسلحة للأعمدة والحوائط- غرف المصاعد وبيت الدرج"]
["Ro-50","صب الخرسانة للسقف- غرف المصاعد وبيت الدرج"]
["A1150","مباني قصية الردم"]
["Gr-90","أعمال المباني- الدور الأرضي"]
["01-90","أعمال المباني- الدور الأول"]
["02-90","أعمال المباني- الدور الثاني"]
["03-90","أعمال المباني- الدور الثالث"]
["04-90","أعمال المباني- الدور الرابع"]
["16-90","أعمال المباني- الدور الخامس"]
["16-3190","أعمال المباني- الملحق"]
["Ro-90","أعمال المباني- للسطح"]
["A1450","عزل اللبشة ورقاب الأعمدة وقصية الردم"]
["A1120","عزل الميد"]
["A1330","عزل الحوائط الخارجية للخزان"]
["Gr-210","عزل رطوبة لدورات المياه والمطابخ-الدور الأرضي"]
["01-210","عزل رطوبة لدورات المياه- الدور الأول"]
["02-360","عزل رطوبة لدورات المياه والمطابخ- الدور الثاني"]
["03-210","عزل رطوبة لدورات المياه- الدور الثالث"]
["04-210","عزل رطوبة لدورات المياه والمطابخ- الدور الرابع"]
["16-210","عزل رطوبة لدورات المياه - الدور الخامس"]
["16-3340","عزل رطوبة لدورات المياه والمطابخ- الملحق"]
["Ro-210","عزل الرطوبة والحرارة- للسطح"]
["A1510","عزل رطوبة للمناور وبئر المصعد"]
["Ro-320","خرسانة الميول- للسطح"]
["Gr-110","بؤج وطرطشة- الدور الأرضي"]
["01-110","بؤج وطرطشة- الدور الأول"]
["02-100","بؤج وطرطشة- الدور الثاني"]
["03-110","بؤج وطرطشة- الدور الثالث"]
["04-110","بؤج وطرطشة- الدور الرابع"]
["16-110","بؤج وطرطشة- الدور الخامس"]
["Ro-110","بؤج وطرطشة- للسطح"]
["16-3200","بؤج وطرطشة- الملحق"]
["A1160","لياسة قصية الردم"]
["Gr-170","أعمال اللياسة- الدور الأرضي"]
["01-170","أعمال اللياسة- الدور الأول"]
["02-280","أعمال اللياسة- الدور الثاني"]
["03-170","أعمال اللياسة- الدور الثالث"]
["04-170","أعمال اللياسة- الدور الرابع"]
["16-170","أعمال اللياسة- الدور الخامس"]
["16-3300","أعمال اللياسة- الملحق"]
["Ro-170","أعمال اللياسة- للسطح"]
["A1790","لياسة الواجهات والمناور"]
["Gr-200","أعمال الدهانات مرحله أولى- الدور الأرضي"]
["01-200","أعمال الدهانات مرحله أولى- الدور الأول"]
["02-350","أعمال الدهانات مرحله أولى- الدور الثاني"]
["03-200","أعمال الدهانات مرحله أولى- الدور الثالث"]
["04-200","أعمال الدهانات مرحله أولى- الدور الرابع"]
["16-200","أعمال الدهانات مرحله أولى- الدور الخامس"]
["16-3330","أعمال الدهانات مرحله أولى- الملحق"]
["Ro-200","أعمال الدهانات مرحله أولى- للسطح"]
["Gr-250","أعمال الدهانات مرحله ثانيه- الدور الأرضي"]
{"$rows_left_out":177}
{"sheet":"T-B3C1","index":1,"n_rows":272,"n_cols":6,"rows_kept":272,"cut":false,"hidden":false,"merged":[]}
["Activity ID","Activity Name","Actual Start","Original Duration(d)","Actual Finish","(*)Performance % Complete(%)"]
["A1000","بداية المشروع","2021-10-31T08:00:00",0,"",100]
["A1260","أعمال تمهيد الموقع واعتماد الخطة اللوجيستية","2021-10-31T08:00:00",15,"2021-11-16T16:00:00",100]
["A1020","أعمال الحفر لأساسات المبنى","2021-11-17T08:00:00",15,"2021-11-28T16:00:00",100]
["A1070","رش المبيدات أسفل أساسات المبنى","2021-11-30T08:00:00",1,"2021-11-30T16:00:00",100]
["A1300","الخرسانة العادية لأساسات المبنى","2021-11-30T08:00:00",2,"2021-11-30T16:00:00",100]
["A1410","معالجة الخرسانة العادية لأساسات المبنى","2021-12-01T08:00:00",1,"2021-12-01T16:00:00",100]
["A1310","الخرسانة المسلحة لأساسات المبنى","2021-12-20",15,"2022-01-01",100]
["A1290","التأريض","2021-12-25",150,"",20]
["A1150","مباني قصية الردم","2022-03-15",3,"2022-04-05",100]
["A1170","الخرسانة المسلحة لرقاب الأعمدة","2022-01-02",7,"2022-01-23",100]
["A1400","معالجة الخرسانة المسلحة لأساسات المبنى","2022-01-02",3,"2022-01-03",100]
["A1160","لياسة قصية الردم","2022-03-23",3,"",20]
["A1450","عزل اللبشة ورقاب الأعمدة وقصية الردم","2021-12-15",3,"",75]
["A1210","أعمال الردم حتى منسوب الميد","",3,"",0]
["A1220","الخرسانة المسلحة للميد","",7,"",0]
["A1120","عزل الميد","2022-05-15",3,"",75]
["A1230","الردم حتى منسوب الدكة","",5,"",0]
["A1100","خرسانة دكه الأرضيات","",1,"",0]
["Gr-10","الخرسانة المسلحة للأعمدة والحوائط- الدور الأرضي","2022-01-02",5,"2022-01-23",100]
["Gr-20","الخرسانة المسلحة للسقف- الدور الأرضي","2022-01-26",8,"2022-02-13",100]
["Gr-40","تمديدات الإلكتروميكانيك للسقف- الدور الأرضي","2022-02-10",2,"2022-02-13",100]
["Gr-50","صب الخرسانة للسقف- الدور الأرضي","2022-02-13",1,"2022-02-13",100]
["01-10","الخرسانة المسلحة للأعمدة والحوائط- الدور الأول","2022-02-14",5,"2022-02-23",100]
["Gr-70","معالجة خرسانة السقف- الدور الأرضي","2022-02-14",3,"2022-02-17",100]
["01-20","الخرسانة المسلحة للسقف- الدور الأول","2022-03-05",8,"2022-03-16",100]
["01-40","تمديدات الإلكتروميكانيك للسقف- الدور الأول","2022-03-14",2,"2022-03-16",100]
["Gr-80","فك الشدة للسقف- الدور الأرضي","2022-03-14",1,"2022-03-14",100]
["Gr-90","أعمال المباني- الدور الأرضي","",10,"",0]
["01-50","صب الخرسانة للسقف- الدور الأول","2022-03-16",1,"2022-03-16",100]
["02-10","الخرسانة المسلحة للأعمدة والحوائط- الدور الثاني","2022-03-17",5,"2022-03-24",100]
["01-70","معالجة خرسانة السقف- الدور الأول","2022-03-17",3,"2022-03-19",100]
["02-20","الخرسانة المسلحة للسقف- الدور الثاني","2022-03-26",8,"2022-04-12",100]
["02-40","تمديدات الإلكتروميكانيك للسقف- الدور الثاني","2022-04-08",2,"2022-04-11",100]
["Gr-100","تأسيس الأعمال الصحية- الدور الأرضي","",4,"",0]
["Gr-110","بؤج وطرطشة- الدور الأرضي","",6,"",0]
["01-80","فك الشدة للسقف- الدور الأول","2022-04-10",1,"2022-04-10",100]
["01-90","أعمال المباني- الدور الأول","2022-05-13",10,"",95]
["02-50","صب الخرسانة للسقف- الدور الثاني","2022-04-11",1,"2022-04-11",100]
["03-10","الخرسانة المسلحة للأعمدة والحوائط- الدور الثالث","2022-04-16",5,"2022-04-25",100]
["Gr-120","تأسيس أعمال التكييف- الدور الأرضي","",3,"",0]
["Gr-130","تأسيس شبكة إطفاء الحريق- الدور الأرضي","",4,"",0]
["Gr-140","تركيب الحلوق- الدور الأرضي","",2,"",0]
["Gr-150","تأسيس الأعمال الكهربائية- الدور الأرضي","",4,"",0]
["Gr-170","أعمال اللياسة- الدور الأرضي","",7,"",0]
["02-70","معالجة خرسانة السقف- الدور الثاني","2022-05-06",3,"2022-05-06",100]
["03-20","الخرسانة المسلحة للسقف- الدور الثالث","2022-05-07",8,"2022-05-15",100]
["03-40","تمديدات الإلكتروميكانيك للسقف- الدور الثالث","2022-05-12",2,"2022-05-15",100]
["01-100","تأسيس الأعمال الصحية- الدور الأول","2022-06-28",4,"",25]
["01-110","بؤج وطرطشة- الدور الأول","",6,"",0]
["Gr-190","أعمال الأسقف المستعارة والكرانيش- الدور الأرضي","",8,"",0]
["02-80","فك الشدة للسقف- الدور الثاني","2022-05-08",1,"2022-05-08",100]
["02-90","أعمال المباني- الدور الثاني","2022-05-28",10,"",95]
["01-120","تأسيس أعمال التكييف- الدور الأول","2022-07-06",3,"",0]
["01-130","تأسيس شبكة إطفاء الحريق- الدور الأول","",7,"",0]
["01-140","تركيب الحلوق- الدور الأول","",2,"",0]
["01-150","تأسيس الأعمال الكهربائية- الدور الأول","",4,"",0]
["03-50","صب الخرسانة للسقف- الدور الثالث","2022-05-15",1,"2022-05-15",100]
["04-10","الخرسانة المسلحة للأعمدة والحوائط- الدور الرابع","2022-05-16",5,"2022-05-21",100]
["01-170","أعمال اللياسة- الدور الأول","",7,"",0]
{"$rows_left_out":213}
{"sheet":"T-B3A1","index":2,"n_rows":272,"n_cols":6,"rows_kept":272,"cut":false,"hidden":false,"merged":[]}
["Activity ID","Activity Name","Actual Start","Original Duration(d)","Actual Finish","(*)Performance % Complete(%)"]
["A1000","بداية المشروع","2021-10-31T08:00:00",0,"",100]
["A1260","أعمال تمهيد الموقع واعتماد الخطة اللوجيستية","2021-10-31T08:00:00",15,"2021-11-16T16:00:00",100]
["A1020","أعمال الحفر لأساسات المبنى","2021-11-17T08:00:00",15,"2021-11-28T16:00:00",100]
["A1070","رش المبيدات أسفل أساسات المبنى","2021-12-02T08:00:00",1,"2021-12-02T16:00:00",100]
["A1300","الخرسانة العادية لأساسات المبنى","2021-12-02T08:00:00",2,"2021-12-02T16:00:00",100]
["A1410","معالجة الخرسانة العادية لأساسات المبنى","2021-12-03T08:00:00",1,"2021-12-03T16:00:00",100]
["A1310","الخرسانة المسلحة لأساسات المبنى","2021-12-23",15,"2022-01-03",100]
["A1290","التأريض","2021-12-30",150,"",20]
["A1150","مباني قصية الردم","2022-03-21",3,"",70]
["A1170","الخرسانة المسلحة لرقاب الأعمدة","2022-01-05",7,"2021-01-29",100]
["A1400","معالجة الخرسانة المسلحة لأساسات المبنى","2022-01-04",3,"2022-01-07",100]
["A1160","لياسة قصية الردم","",3,"",0]
["A1450","عزل اللبشة ورقاب الأعمدة وقصية الردم","2021-12-18",3,"",50]
["A1210","أعمال الردم حتى منسوب الميد","",3,"",0]
["A1220","الخرسانة المسلحة للميد","",7,"",0]
["A1120","عزل الميد","",3,"",0]
["A1230","الردم حتى منسوب الدكة","",5,"",0]
["A1100","خرسانة دكه الأرضيات","",1,"",0]
["Gr-10","الخرسانة المسلحة للأعمدة والحوائط- الدور الأرضي","2022-01-05",5,"2021-01-29",100]
["Gr-20","الخرسانة المسلحة للسقف- الدور الأرضي","2022-02-07",8,"2022-03-06",100]
["Gr-40","تمديدات الإلكتروميكانيك للسقف- الدور الأرضي","2022-03-03",2,"2022-03-06",100]
["Gr-50","صب الخرسانة للسقف- الدور الأرضي","2022-03-06",1,"2022-03-06",100]
["01-10","الخرسانة المسلحة للأعمدة والحوائط- الدور الأول","2022-03-07",5,"2022-03-13",100]
["Gr-70","معالجة خرسانة السقف- الدور الأرضي","2022-03-07",3,"2022-03-08",100]
["01-20","الخرسانة المسلحة للسقف- الدور الأول","2022-03-16",8,"2022-03-29",100]
["01-40","تمديدات الإلكتروميكانيك للسقف- الدور الأول","2022-03-27",2,"2022-03-29",100]
["Gr-80","فك الشدة للسقف- الدور الأرضي","2022-03-20",1,"2022-03-20",100]
["Gr-90","أعمال المباني- الدور الأرضي","",10,"",0]
["01-50","صب الخرسانة للسقف- الدور الأول","2022-03-29",1,"2022-03-29",100]
["02-10","الخرسانة المسلحة للأعمدة والحوائط- الدور الثاني","2022-03-30",5,"2022-04-04",100]
["01-70","معالجة خرسانة السقف- الدور الأول","2022-03-30",3,"2022-04-02",100]
["02-20","الخرسانة المسلحة للسقف- الدور الثاني","2022-04-10",8,"2022-04-26",100]
["02-40","تمديدات الإلكتروميكانيك للسقف- الدور الثاني","2022-04-22",2,"2022-04-26",100]
["Gr-100","تأسيس الأعمال الصحية- الدور الأرضي","",4,"",0]
["Gr-110","بؤج وطرطشة- الدور الأرضي","",6,"",0]
["01-80","فك الشدة للسقف- الدور الأول","2022-05-08",1,"2022-05-08",100]
["01-90","أعمال المباني- الدور الأول","2022-05-12",10,"",95]
["02-50","صب الخرسانة للسقف- الدور الثاني","2022-04-26",1,"2022-04-26",100]
["03-10","الخرسانة المسلحة للأعمدة والحوائط- الدور الثالث","2022-05-07",5,"2022-05-09",100]
["Gr-120","تأسيس أعمال التكييف- الدور الأرضي","",3,"",0]
["Gr-130","تأسيس شبكة إطفاء الحريق- الدور الأرضي","",4,"",0]
["Gr-140","تركيب الحلوق- الدور الأرضي","",2,"",0]
["Gr-150","تأسيس الأعمال الكهربائية- الدور الأرضي","",4,"",0]
["Gr-170","أعمال اللياسة- الدور الأرضي","",7,"",0]
["02-70","معالجة خرسانة السقف- الدور الثاني","2022-05-15",3,"2022-05-15",100]
["03-20","الخرسانة المسلحة للسقف- الدور الثالث","2022-05-15",8,"2022-05-30",100]
["03-40","تمديدات الإلكتروميكانيك للسقف- الدور الثالث","2022-05-22",2,"2022-05-30",100]
["01-100","تأسيس الأعمال الصحية- الدور الأول","2022-07-06",4,"",0]
["01-110","بؤج وطرطشة- الدور الأول","",6,"",0]
["Gr-190","أعمال الأسقف المستعارة والكرانيش- الدور الأرضي","",8,"",0]
["02-80","فك الشدة للسقف- الدور الثاني","2022-05-08",1,"2022-05-08",100]
["02-90","أعمال المباني- الدور الثاني","2022-06-25",10,"",50]
["01-120","تأسيس أعمال التكييف- الدور الأول","",3,"",0]
["01-130","تأسيس شبكة إطفاء الحريق- الدور الأول","",7,"",0]
["01-140","تركيب الحلوق- الدور الأول","",2,"",0]
["01-150","تأسيس الأعمال الكهربائية- الدور الأول","",4,"",0]
["03-50","صب الخرسانة للسقف- الدور الثالث","2022-05-30",1,"2022-05-30",100]
["04-10","الخرسانة المسلحة للأعمدة والحوائط- الدور الرابع","2022-05-31",5,"2022-06-09",100]
["01-170","أعمال اللياسة- الدور الأول","",7,"",0]
{"$rows_left_out":213}
{"sheet":"T-B3A4","index":3,"n_rows":272,"n_cols":6,"rows_kept":272,"cut":false,"hidden":false,"merged":[]}
["Activity ID","Activity Name","Actual Start","Original Duration(d)","Actual Finish","(*)Performance % Complete(%)"]
["A1000","بداية المشروع","2021-10-31T08:00:00",0,"",100]
["A1260","أعمال تمهيد الموقع واعتماد الخطة اللوجيستية","2021-10-31T08:00:00",15,"2021-11-16T16:00:00",100]
["A1020","أعمال الحفر لأساسات المبنى","2021-11-17T08:00:00",15,"2021-11-28T16:00:00",100]
["A1070","رش المبيدات أسفل أساسات المبنى","2021-12-02T08:00:00",1,"2021-12-02T16:00:00",100]
["A1300","الخرسانة العادية لأساسات المبنى","2021-12-02T08:00:00",2,"2021-12-02T16:00:00",100]
["A1410","معالجة الخرسانة العادية لأساسات المبنى","2021-12-03T08:00:00",1,"2021-12-03T16:00:00",100]
["A1310","الخرسانة المسلحة لأساسات المبنى","2022-01-03",15,"2022-01-10",100]
["A1290","التأريض","2022-01-05",150,"",20]
["A1150","مباني قصية الردم","2022-04-26",3,"",70]
["A1170","الخرسانة المسلحة لرقاب الأعمدة","2022-01-11",7,"2022-02-03",100]
["A1400","معالجة الخرسانة المسلحة لأساسات المبنى","2022-01-25",3,"2022-01-27",100]
["A1160","لياسة قصية الردم","",3,"",0]
["A1450","عزل اللبشة ورقاب الأعمدة وقصية الردم","2021-12-26",3,"",50]
["A1210","أعمال الردم حتى منسوب الميد","",3,"",0]
["A1220","الخرسانة المسلحة للميد","",7,"",0]
["A1120","عزل الميد","",3,"",0]
["A1230","الردم حتى منسوب الدكة","",5,"",0]
["A1100","خرسانة دكه الأرضيات","",1,"",0]
["Gr-10","الخرسانة المسلحة للأعمدة والحوائط- الدور الأرضي","2022-01-11",5,"2022-02-03",100]
["Gr-20","الخرسانة المسلحة للسقف- الدور الأرضي","2022-02-14",8,"2022-03-12",100]
["Gr-40","تمديدات الإلكتروميكانيك للسقف- الدور الأرضي","2022-03-06",2,"2022-03-08",100]
["Gr-50","صب الخرسانة للسقف- الدور الأرضي","2022-03-12",1,"2022-03-12",100]
["01-10","الخرسانة المسلحة للأعمدة والحوائط- الدور الأول","2022-03-13",5,"2022-03-19",100]
["Gr-70","معالجة خرسانة السقف- الدور الأرضي","2022-03-17",3,"2022-03-19",100]
["01-20","الخرسانة المسلحة للسقف- الدور الأول","2022-03-20",8,"2022-04-04",100]
["01-40","تمديدات الإلكتروميكانيك للسقف- الدور الأول","2022-04-02",2,"2022-04-03",100]
["Gr-80","فك الشدة للسقف- الدور الأرضي","2022-03-20",1,"2022-03-20",100]
["Gr-90","أعمال المباني- الدور الأرضي","",10,"",0]
["01-50","صب الخرسانة للسقف- الدور الأول","2022-04-04",1,"2022-04-04",100]
["02-10","الخرسانة المسلحة للأعمدة والحوائط- الدور الثاني","2022-04-06",5,"2022-04-11",100]
["01-70","معالجة خرسانة السقف- الدور الأول","2022-04-16",3,"2022-04-18",100]
["02-20","الخرسانة المسلحة للسقف- الدور الثاني","2022-04-14",8,"2022-05-10",100]
["02-40","تمديدات الإلكتروميكانيك للسقف- الدور الثاني","2022-05-08",2,"2022-05-10",100]
["Gr-100","تأسيس الأعمال الصحية- الدور الأرضي","",4,"",0]
["Gr-110","بؤج وطرطشة- الدور الأرضي","",6,"",0]
["01-80","فك الشدة للسقف- الدور الأول","2022-05-08",1,"2022-05-08",100]
["01-90","أعمال المباني- الدور الأول","2022-05-22",10,"",90]
["02-50","صب الخرسانة للسقف- الدور الثاني","2022-05-10",1,"2022-05-10",100]
["03-10","الخرسانة المسلحة للأعمدة والحوائط- الدور الثالث","2022-05-11",5,"2022-05-15",100]
["Gr-120","تأسيس أعمال التكييف- الدور الأرضي","",3,"",0]
["Gr-130","تأسيس شبكة إطفاء الحريق- الدور الأرضي","",4,"",0]
["Gr-140","تركيب الحلوق- الدور الأرضي","",2,"",0]
["Gr-150","تأسيس الأعمال الكهربائية- الدور الأرضي","",4,"",0]
["Gr-170","أعمال اللياسة- الدور الأرضي","",7,"",0]
["02-70","معالجة خرسانة السقف- الدور الثاني","2022-05-11",3,"2022-05-13",100]
["03-20","الخرسانة المسلحة للسقف- الدور الثالث","2022-06-05",8,"2022-06-09",100]
["03-40","تمديدات الإلكتروميكانيك للسقف- الدور الثالث","2022-06-07",2,"2022-06-09",100]
["01-100","تأسيس الأعمال الصحية- الدور الأول","",4,"",0]
["01-110","بؤج وطرطشة- الدور الأول","",6,"",0]
["Gr-190","أعمال الأسقف المستعارة والكرانيش- الدور الأرضي","",8,"",0]
["02-80","فك الشدة للسقف- الدور الثاني","2022-05-08",1,"2022-05-08",100]
["02-90","أعمال المباني- الدور الثاني","2022-07-21",10,"",10]
["01-120","تأسيس أعمال التكييف- الدور الأول","",3,"",0]
["01-130","تأسيس شبكة إطفاء الحريق- الدور الأول","",7,"",0]
["01-140","تركيب الحلوق- الدور الأول","",2,"",0]
["01-150","تأسيس الأعمال الكهربائية- الدور الأول","",4,"",0]
["03-50","صب الخرسانة للسقف- الدور الثالث","2022-06-09",1,"2022-06-09",100]
["04-10","الخرسانة المسلحة للأعمدة والحوائط- الدور الرابع","2022-06-11",5,"2022-06-15",100]
["01-170","أعمال اللياسة- الدور الأول","",7,"",0]
{"$rows_left_out":213}
{"sheet":"T-B3A3","index":4,"n_rows":272,"n_cols":6,"rows_kept":272,"cut":false,"hidden":false,"merged":[]}
["Activity ID","Activity Name","Actual Start","Original Duration(d)","Actual Finish","(*)Performance % Complete(%)"]
["A1000","بداية المشروع","2021-10-31T08:00:00",0,"",100]
["A1260","أعمال تمهيد الموقع واعتماد الخطة اللوجيستية","2021-10-31T08:00:00",15,"2021-11-16T16:00:00",100]
["A1020","أعمال الحفر لأساسات المبنى","2021-11-17T08:00:00",15,"2021-11-28T16:00:00",100]
["A1070","رش المبيدات أسفل أساسات المبنى","2021-12-02T08:00:00",1,"2021-12-02T16:00:00",100]
["A1300","الخرسانة العادية لأساسات المبنى","2021-12-02T08:00:00",2,"2021-12-02T16:00:00",100]
["A1410","معالجة الخرسانة العادية لأساسات المبنى","2021-12-03T08:00:00",1,"2021-12-03T16:00:00",100]
["A1310","الخرسانة المسلحة لأساسات المبنى","2022-01-13",15,"2022-01-19",100]
["A1290","التأريض","2022-01-15",150,"",20]
["A1150","مباني قصية الردم","2022-04-26",3,"",70]
["A1170","الخرسانة المسلحة لرقاب الأعمدة","2022-01-22",7,"2022-02-23",100]
["A1400","معالجة الخرسانة المسلحة لأساسات المبنى","2022-01-25",3,"2022-01-27",100]
["A1160","لياسة قصية الردم","",3,"",0]
["A1450","عزل اللبشة ورقاب الأعمدة وقصية الردم","2022-01-05",3,"",50]
["A1210","أعمال الردم حتى منسوب الميد",null,3,"",0]
["A1220","الخرسانة المسلحة للميد","",7,"",0]
["A1120","عزل الميد","",3,"",0]
["A1230","الردم حتى منسوب الدكة","",5,"",0]
["A1100","خرسانة دكه الأرضيات","",1,"",0]
["Gr-10","الخرسانة المسلحة للأعمدة والحوائط- الدور الأرضي","2022-01-22",5,"2022-02-23",100]
["Gr-20","الخرسانة المسلحة للسقف- الدور الأرضي","2022-03-03",8,"2022-03-21",100]
["Gr-40","تمديدات الإلكتروميكانيك للسقف- الدور الأرضي","2022-03-18",2,"2022-03-20",100]
["Gr-50","صب الخرسانة للسقف- الدور الأرضي","2022-03-21",1,"2022-03-21",100]
["01-10","الخرسانة المسلحة للأعمدة والحوائط- الدور الأول","2022-03-22",5,"2022-03-29",100]
["Gr-70","معالجة خرسانة السقف- الدور الأرضي","2022-03-24",3,"2022-03-28",100]
["01-20","الخرسانة المسلحة للسقف- الدور الأول","2022-04-06",8,"2022-04-19",100]
["01-40","تمديدات الإلكتروميكانيك للسقف- الدور الأول","2022-04-16",2,"2022-04-18",100]
["Gr-80","فك الشدة للسقف- الدور الأرضي","2022-04-06",1,"2022-04-06",100]
["Gr-90","أعمال المباني- الدور الأرضي","",10,"",0]
["01-50","صب الخرسانة للسقف- الدور الأول","2022-04-19",1,"2022-04-19",100]
["02-10","الخرسانة المسلحة للأعمدة والحوائط- الدور الثاني","2022-04-23",5,"2022-04-30",100]
["01-70","معالجة خرسانة السقف- الدور الأول","2022-04-22",3,"2022-04-25",100]
["02-20","الخرسانة المسلحة للسقف- الدور الثاني","2022-05-12",8,"2022-05-23",100]
["02-40","تمديدات الإلكتروميكانيك للسقف- الدور الثاني","2022-05-20",2,"2022-05-23",100]
["Gr-100","تأسيس الأعمال الصحية- الدور الأرضي","",4,"",0]
["Gr-110","بؤج وطرطشة- الدور الأرضي","",6,"",0]
["01-80","فك الشدة للسقف- الدور الأول","2022-05-07",1,"2022-05-07",100]
["01-90","أعمال المباني- الدور الأول","2022-06-05",10,"",60]
["02-50","صب الخرسانة للسقف- الدور الثاني","2022-05-23",1,"2022-05-23",100]
["03-10","الخرسانة المسلحة للأعمدة والحوائط- الدور الثالث","2022-05-24",5,"2022-06-02",100]
["Gr-120","تأسيس أعمال التكييف- الدور الأرضي","",3,"",0]
["Gr-130","تأسيس شبكة إطفاء الحريق- الدور الأرضي","",4,"",0]
["Gr-140","تركيب الحلوق- الدور الأرضي","",2,"",0]
["Gr-150","تأسيس الأعمال الكهربائية- الدور الأرضي","",4,"",0]
["Gr-170","أعمال اللياسة- الدور الأرضي","",7,"",0]
["02-70","معالجة خرسانة السقف- الدور الثاني","",3,"",100]
["03-20","الخرسانة المسلحة للسقف- الدور الثالث","2022-06-05",8,"2022-06-23",100]
["03-40","تمديدات الإلكتروميكانيك للسقف- الدور الثالث","2022-06-19",2,"2022-06-21",100]
["01-100","تأسيس الأعمال الصحية- الدور الأول","",4,"",0]
["01-110","بؤج وطرطشة- الدور الأول","",6,"",0]
["Gr-190","أعمال الأسقف المستعارة والكرانيش- الدور الأرضي","",8,"",0]
["02-80","فك الشدة للسقف- الدور الثاني","",1,"",100]
["02-90","أعمال المباني- الدور الثاني","2022-07-21",10,"",25]
["01-120","تأسيس أعمال التكييف- الدور الأول","",3,"",0]
["01-130","تأسيس شبكة إطفاء الحريق- الدور الأول","",7,"",0]
["01-140","تركيب الحلوق- الدور الأول","",2,"",0]
["01-150","تأسيس الأعمال الكهربائية- الدور الأول","",4,"",0]
["03-50","صب الخرسانة للسقف- الدور الثالث","2022-06-23",1,"2022-06-23",100]
["04-10","الخرسانة المسلحة للأعمدة والحوائط- الدور الرابع","2022-06-25",5,"2022-07-03",100]
["01-170","أعمال اللياسة- الدور الأول","",7,"",0]
{"$rows_left_out":212}