{"text_format":"1","workbook":"xlsx","n_sheets":10,"sheets":["Boat1","Boat2","Boat3","Dahab","Thistelgorm","Sharks bay","Stella","H.W.F","Fanar","Milton"],"not_rendered":{"charts":0,"images":1,"macros":1,"external_links":0,"defined_names":10,"comments":0,"pivot_tables":0},"unopened":[],"bounds":{"document_bytes":16777216,"sheet_cells":100000,"rows_first":2000,"rows_last":500,"rows_between":2000,"halvings":0,"cell_chars":16384,"cell_head_chars":4096},"cells_cut":0,"cells_raw":0,"read":"whole","date_system":"1900"}

{"sheet":"Boat1","index":0,"n_rows":57,"n_cols":28,"rows_kept":57,"cut":false,"hidden":false,"merged":[[52,6,52,7],[52,13,56,17],[53,6,53,7],[54,6,54,7],[54,10,54,11],[55,6,55,7],[56,6,56,7],[0,13,1,14],[2,13,2,14],[0,2,1,2],[50,1,50,7],[51,1,51,7],[51,10,51,11],[51,13,51,17],[0,10,1,11],[2,10,2,11],[0,3,1,3],[0,4,1,4],[0,5,0,6],[0,7,1,8],[0,9,1,9],[8,7,8,8],[2,7,2,8],[6,0,9,1],[10,7,10,8],[10,10,10,11],[5,10,5,11],[6,10,6,11],[7,10,7,11],[8,10,8,11],[9,10,9,11],[5,7,5,8],[6,7,6,8],[7,7,7,8],[11,10,11,11],[11,7,11,8],[3,2,3,5],[3,6,3,11],[9,7,9,8],[4,10,4,11],[4,7,4,8]]}
[null,null,"التاريخ","اتجاه الرحله","ميناء القيام","الحموله",null,"تاريخ انتهاء الترخيص",null,"رقم التسجيل","اسم اللنش",null,null,"تليفون اللنش"]
[null,null,null,null,null,"عدد الركاب","عدد الطقم"]
[null,null,"2022-08-01",null,null,{"$f":"VLOOKUP($K$3,#REF!,4,FALSE)","v":{"$error":"#REF!"}},{"$f":"VLOOKUP($K$3,#REF!,5,FALSE)","v":{"$error":"#REF!"}},{"$f":"VLOOKUP($K$3,#REF!,3,FALSE)","v":{"$error":"#REF!"}},null,{"$f":"VLOOKUP($K$3,#REF!,2,FALSE)","v":{"$error":"#REF!"}},null,null,null,{"$f":"VLOOKUP($K$3,#REF!,6,FALSE)","v":{"$error":"#REF!"}},{"$f":"VLOOKUP($K$3,#REF!,2,FALSE)","v":{"$error":"#REF!"}}]
[null,null,"طاقم المركب",null,null,null,"المدربين/المرشدين/المصورين",null,null,null,null,null,null,"SNORK"]
[null,null,"تليفون","رقم مزاوله المهنه","الوظيفه","اسماء الطاقم","تليفون","رقم مزاوله المهنه",null,"الوظيفه","الاسماء",null,null,{"$f":"COUNTIF(boat1[Activity\nالنشاط],N4)","v":0},{"$f":"COUNTIF(boat1[Activity\nالنشاط],O4)","v":0},{"$f":"COUNTIF(boat1[Activity\nالنشاط],P4)","v":0},{"$f":"COUNTIF(boat1[Activity\nالنشاط],Q4)","v":0},{"$f":"COUNTIF(boat1[Activity\nالنشاط],R4)","v":0},{"$f":"COUNTIF(boat1[Activity\nالنشاط],S4)","v":0},{"$f":"COUNTIF(boat1[Activity\nالنشاط],T4)","v":0},{"$f":"COUNTIF(boat1[Activity\nالنشاط],U4)","v":0},{"$f":"COUNTIF(boat1[Activity\nالنشاط],\"*DIVE*\")","v":0},{"$f":"COUNTIF(boat1[Activity\nالنشاط],\"*3 DIVES*\")","v":0}]
[null,null,{"$f":"VLOOKUP($K$3,#REF!,10,FALSE)","v":{"$error":"#REF!"}},{"$f":"VLOOKUP($K$3,#REF!,9,FALSE)","v":{"$error":"#REF!"}},{"$f":"VLOOKUP($K$3,#REF!,8,FALSE)","v":{"$error":"#REF!"}},{"$f":"VLOOKUP($K$3,#REF!,7,FALSE)","v":{"$error":"#REF!"}},{"$f":"VLOOKUP($K6,#REF!,4,FALSE)","v":{"$error":"#REF!"}},{"$f":"VLOOKUP($K6,#REF!,3,FALSE)","v":{"$error":"#REF!"}},null,{"$f":"VLOOKUP($K6,#REF!,2,FALSE)","v":{"$error":"#REF!"}}]
{"$rows_left_out":52}
{"sheet":"Boat2","index":1,"n_rows":57,"n_cols":28,"rows_kept":57,"cut":false,"hidden":false,"merged":[[51,13,51,17],[52,6,52,7],[52,13,56,17],[53,6,53,7],[54,6,54,7],[54,10,54,11],[55,6,55,7],[56,6,56,7],[9,7,9,8],[9,10,9,11],[10,7,10,8],[10,10,10,11],[51,1,51,7],[51,10,51,11],[11,7,11,8],[11,10,11,11],[0,13,1,14],[2,7,2,8],[2,10,2,11],[2,13,2,14],[50,1,50,7],[4,7,4,8],[4,10,4,11],[5,7,5,8],[5,10,5,11],[6,0,9,1],[6,7,6,8],[6,10,6,11],[7,7,7,8],[7,10,7,11],[8,7,8,8],[8,10,8,11],[3,2,3,5],[3,6,3,11],[0,2,1,2],[0,3,1,3],[0,4,1,4],[0,5,0,6],[0,7,1,8],[0,9,1,9],[0,10,1,11]]}
[null,null,"التاريخ","اتجاه الرحله","ميناء القيام","الحموله",null,"تاريخ انتهاء الترخيص",null,"رقم التسجيل","اسم اللنش",null,null,"تليفون اللنش"]
[null,null,null,null,null,"عدد الركاب","عدد الطقم"]
[null,null,{"$f":"Boat1!C3","v":"2022-08-01"},null,null,{"$f":"VLOOKUP($K$3,#REF!,4,FALSE)","v":{"$error":"#REF!"}},{"$f":"VLOOKUP($K$3,#REF!,5,FALSE)","v":{"$error":"#REF!"}},{"$f":"VLOOKUP($K$3,#REF!,3,FALSE)","v":{"$error":"#REF!"}},null,{"$f":"VLOOKUP($K$3,#REF!,2,FALSE)","v":{"$error":"#REF!"}},null,null,null,{"$f":"VLOOKUP($K$3,#REF!,6,FALSE)","v":{"$error":"#REF!"}},{"$f":"VLOOKUP($K$3,#REF!,2,FALSE)","v":{"$error":"#REF!"}}]
[null,null,"طاقم المركب",null,null,null,"المدربين/المرشدين/المصورين",null,null,null,null,null,null,"SNORK"]
[null,null,"تليفون","رقم مزاوله المهنه","الوظيفه","اسماء الطاقم","تليفون","رقم مزاوله المهنه",null,"الوظيفه","الاسماء",null,null,{"$f":"COUNTIF(boat2[Activity\nالنشاط],N4)","v":0},{"$f":"COUNTIF(boat2[Activity\nالنشاط],O4)","v":0},{"$f":"COUNTIF(boat2[Activity\nالنشاط],P4)","v":0},{"$f":"COUNTIF(boat2[Activity\nالنشاط],Q4)","v":0},{"$f":"COUNTIF(boat2[Activity\nالنشاط],R4)","v":0},{"$f":"COUNTIF(boat2[Activity\nالنشاط],S4)","v":0},{"$f":"COUNTIF(boat2[Activity\nالنشاط],T4)","v":0},{"$f":"COUNTIF(boat2[Activity\nالنشاط],U4)","v":0},{"$f":"COUNTIF(boat2[Activity\nالنشاط],\"*DIVE*\")","v":0},{"$f":"COUNTIF(boat2[Activity\nالنشاط],\"*3 DIVES*\")","v":0}]
[null,null,{"$f":"VLOOKUP($K$3,#REF!,10,FALSE)","v":{"$error":"#REF!"}},{"$f":"VLOOKUP($K$3,#REF!,9,FALSE)","v":{"$error":"#REF!"}},{"$f":"VLOOKUP($K$3,#REF!,8,FALSE)","v":{"$error":"#REF!"}},{"$f":"VLOOKUP($K$3,#REF!,7,FALSE)","v":{"$error":"#REF!"}},{"$f":"VLOOKUP($K6,#REF!,4,FALSE)","v":{"$error":"#REF!"}},{"$f":"VLOOKUP($K6,#REF!,3,FALSE)","v":{"$error":"#REF!"}},null,{"$f":"VLOOKUP($K6,#REF!,2,FALSE)","v":{"$error":"#REF!"}}]
{"$rows_left_out":52}
{"sheet":"Boat3","index":2,"n_rows":303,"n_cols":28,"rows_kept":303,"cut":false,"hidden":false,"merged":[[51,13,51,17],[52,6,52,7],[52,13,56,17],[53,6,53,7],[54,6,54,7],[54,10,54,11],[55,6,55,7],[56,6,56,7],[9,7,9,8],[9,10,9,11],[10,7,10,8],[10,10,10,11],[51,1,51,7],[51,10,51,11],[11,7,11,8],[11,10,11,11],[0,13,1,14],[2,7,2,8],[2,10,2,11],[2,13,2,14],[50,1,50,7],[4,7,4,8],[4,10,4,11],[5,7,5,8],[5,10,5,11],[6,0,9,1],[6,7,6,8],[6,10,6,11],[7,7,7,8],[7,10,7,11],[8,7,8,8],[8,10,8,11],[3,2,3,5],[3,6,3,11],[0,2,1,2],[0,3,1,3],[0,4,1,4],[0,5,0,6],[0,7,1,8],[0,9,1,9],[0,10,1,11]]}
[null,null,"التاريخ","اتجاه الرحله","ميناء القيام","الحموله",null,"تاريخ انتهاء الترخيص",null,"رقم التسجيل","اسم اللنش",null,null,"تليفون اللنش"]
[null,null,null,null,null,"عدد الركاب","عدد الطقم"]
[null,null,{"$f":"Boat1!C3","v":"2022-08-01"},null,null,{"$f":"VLOOKUP($K$3,#REF!,4,FALSE)","v":{"$error":"#REF!"}},{"$f":"VLOOKUP($K$3,#REF!,5,FALSE)","v":{"$error":"#REF!"}},{"$f":"VLOOKUP($K$3,#REF!,3,FALSE)","v":{"$error":"#REF!"}},null,{"$f":"VLOOKUP($K$3,#REF!,2,FALSE)","v":{"$error":"#REF!"}},null,null,null,{"$f":"VLOOKUP($K$3,#REF!,6,FALSE)","v":{"$error":"#REF!"}},{"$f":"VLOOKUP($K$3,#REF!,2,FALSE)","v":{"$error":"#REF!"}}]
[null,null,"طاقم المركب",null,null,null,"المدربين/المرشدين/المصورين",null,null,null,null,null,null,"SNORK"]
[null,null,"تليفون","رقم مزاوله المهنه","الوظيفه","اسماء الطاقم","تليفون","رقم مزاوله المهنه",null,"الوظيفه","الاسماء"]
[null,null,{"$f":"VLOOKUP($K$3,#REF!,10,FALSE)","v":{"$error":"#REF!"}},{"$f":"VLOOKUP($K$3,#REF!,9,FALSE)","v":{"$error":"#REF!"}},{"$f":"VLOOKUP($K$3,#REF!,8,FALSE)","v":{"$error":"#REF!"}},{"$f":"VLOOKUP($K$3,#REF!,7,FALSE)","v":{"$error":"#REF!"}},{"$f":"VLOOKUP($K6,#REF!,4,FALSE)","v":{"$error":"#REF!"}},{"$f":"VLOOKUP($K6,#REF!,3,FALSE)","v":{"$error":"#REF!"}},null,{"$f":"VLOOKUP($K6,#REF!,2,FALSE)","v":{"$error":"#REF!"}}]
{"$rows_left_out":298}
{"sheet":"Dahab","index":3,"n_rows":304,"n_cols":28,"rows_kept":304,"cut":false,"hidden":false,"merged":[[51,13,51,17],[52,6,52,7],[52,13,56,17],[53,6,53,7],[54,6,54,7],[54,10,54,11],[55,6,55,7],[56,6,56,7],[9,7,9,8],[9,10,9,11],[10,7,10,8],[10,10,10,11],[51,1,51,7],[51,10,51,11],[11,7,11,8],[11,10,11,11],[0,13,1,14],[2,7,2,8],[2,10,2,11],[2,13,2,14],[50,1,50,7],[4,7,4,8],[4,10,4,11],[5,7,5,8],[5,10,5,11],[6,0,9,1],[6,7,6,8],[6,10,6,11],[7,7,7,8],[7,10,7,11],[8,7,8,8],[8,10,8,11],[3,2,3,5],[3,6,3,11],[0,2,1,2],[0,3,1,3],[0,4,1,4],[0,5,0,6],[0,7,1,8],[0,9,1,9],[0,10,1,11]]}
[null,null,"التاريخ","اتجاه الرحله","ميناء القيام","الحموله",null,"تاريخ انتهاء الترخيص",null,"رقم التسجيل","اسم اللنش",null,null,"تليفون اللنش"]
[null,null,null,null,null,"عدد الركاب","عدد الطقم"]
[null,null,{"$f":"Boat1!C3","v":"2022-08-01"},"Dahab",null,{"$f":"VLOOKUP($K$3,#REF!,4,FALSE)","v":{"$error":"#REF!"}},{"$f":"VLOOKUP($K$3,#REF!,5,FALSE)","v":{"$error":"#REF!"}},{"$f":"VLOOKUP($K$3,#REF!,3,FALSE)","v":{"$error":"#REF!"}},null,{"$f":"VLOOKUP($K$3,#REF!,2,FALSE)","v":{"$error":"#REF!"}},null,null,null,{"$f":"VLOOKUP($K$3,#REF!,6,FALSE)","v":{"$error":"#REF!"}},{"$f":"VLOOKUP($K$3,#REF!,2,FALSE)","v":{"$error":"#REF!"}}]
[null,null,"طاقم المركب",null,null,null,"المدربين/المرشدين/المصورين",null,null,null,null,null,null,"GUIDING"]
[null,null,"تليفون","رقم مزاوله المهنه","الوظيفه","اسماء الطاقم","تليفون","رقم مزاوله المهنه",null,"الوظيفه","الاسماء"]
[null,null,{"$f":"VLOOKUP($K$3,#REF!,10,FALSE)","v":{"$error":"#REF!"}},{"$f":"VLOOKUP($K$3,#REF!,9,FALSE)","v":{"$error":"#REF!"}},{"$f":"VLOOKUP($K$3,#REF!,8,FALSE)","v":{"$error":"#REF!"}},{"$f":"VLOOKUP($K$3,#REF!,7,FALSE)","v":{"$error":"#REF!"}},{"$f":"VLOOKUP($K6,#REF!,4,FALSE)","v":{"$error":"#REF!"}},{"$f":"VLOOKUP($K6,#REF!,3,FALSE)","v":{"$error":"#REF!"}},null,{"$f":"VLOOKUP($K6,#REF!,2,FALSE)","v":{"$error":"#REF!"}}]
{"$rows_left_out":299}
{"sheet":"Thistelgorm","index":4,"n_rows":303,"n_cols":28,"rows_kept":303,"cut":false,"hidden":false,"merged":[[51,13,51,17],[52,6,52,7],[52,13,56,17],[53,6,53,7],[54,6,54,7],[54,10,54,11],[55,6,55,7],[56,6,56,7],[9,7,9,8],[9,10,9,11],[10,7,10,8],[10,10,10,11],[51,1,51,7],[51,10,51,11],[11,7,11,8],[11,10,11,11],[0,13,1,14],[2,7,2,8],[2,10,2,11],[2,13,2,14],[50,1,50,7],[4,7,4,8],[4,10,4,11],[5,7,5,8],[5,10,5,11],[6,0,9,1],[6,7,6,8],[6,10,6,11],[7,7,7,8],[7,10,7,11],[8,7,8,8],[8,10,8,11],[3,2,3,5],[3,6,3,11],[0,2,1,2],[0,3,1,3],[0,4,1,4],[0,5,0,6],[0,7,1,8],[0,9,1,9],[0,10,1,11]]}
[null,null,"التاريخ","اتجاه الرحله","ميناء القيام","الحموله",null,"تاريخ انتهاء الترخيص",null,"رقم التسجيل","اسم اللنش",null,null,"تليفون اللنش"]
[null,null,null,null,null,"عدد الركاب","عدد الطقم"]
[null,null,{"$f":"Boat1!C3","v":"2022-08-01"},"Thistelgorm","وطنيه",{"$f":"VLOOKUP($K$3,#REF!,4,FALSE)","v":{"$error":"#REF!"}},{"$f":"VLOOKUP($K$3,#REF!,5,FALSE)","v":{"$error":"#REF!"}},{"$f":"VLOOKUP($K$3,#REF!,3,FALSE)","v":{"$error":"#REF!"}},null,{"$f":"VLOOKUP($K$3,#REF!,2,FALSE)","v":{"$error":"#REF!"}},"وند كي",null,null,{"$f":"VLOOKUP($K$3,#REF!,6,FALSE)","v":{"$error":"#REF!"}},{"$f":"VLOOKUP($K$3,#REF!,2,FALSE)","v":{"$error":"#REF!"}}]
[null,null,"طاقم المركب",null,null,null,"المدربين/المرشدين/المصورين",null,null,null,null,null,null,"GUIDING","3RD"]
[null,null,"تليفون","رقم مزاوله المهنه","الوظيفه","اسماء الطاقم","تليفون","رقم مزاوله المهنه",null,"الوظيفه","الاسماء"]
[null,null,{"$f":"VLOOKUP($K$3,#REF!,10,FALSE)","v":{"$error":"#REF!"}},{"$f":"VLOOKUP($K$3,#REF!,9,FALSE)","v":{"$error":"#REF!"}},{"$f":"VLOOKUP($K$3,#REF!,8,FALSE)","v":{"$error":"#REF!"}},{"$f":"VLOOKUP($K$3,#REF!,7,FALSE)","v":{"$error":"#REF!"}},{"$f":"VLOOKUP($K6,#REF!,4,FALSE)","v":{"$error":"#REF!"}},{"$f":"VLOOKUP($K6,#REF!,3,FALSE)","v":{"$error":"#REF!"}},null,{"$f":"VLOOKUP($K6,#REF!,2,FALSE)","v":{"$error":"#REF!"}}]
{"$rows_left_out":298}
{"sheet":"Sharks bay","index":5,"n_rows":303,"n_cols":28,"rows_kept":303,"cut":false,"hidden":false,"merged":[[51,13,51,17],[52,6,52,7],[52,13,56,17],[53,6,53,7],[54,6,54,7],[54,10,54,11],[55,6,55,7],[56,6,56,7],[9,7,9,8],[9,10,9,11],[10,7,10,8],[10,10,10,11],[51,1,51,7],[51,10,51,11],[11,7,11,8],[11,10,11,11],[0,13,1,14],[2,7,2,8],[2,10,2,11],[2,13,2,14],[50,1,50,7],[4,7,4,8],[4,10,4,11],[5,7,5,8],[5,10,5,11],[6,0,9,1],[6,7,6,8],[6,10,6,11],[7,7,7,8],[7,10,7,11],[8,7,8,8],[8,10,8,11],[3,2,3,5],[3,6,3,11],[0,2,1,2],[0,3,1,3],[0,4,1,4],[0,5,0,6],[0,7,1,8],[0,9,1,9],[0,10,1,11]]}
[null,null,"التاريخ","اتجاه الرحله","ميناء القيام","الحموله",null,"تاريخ انتهاء الترخيص",null,"رقم التسجيل","اسم اللنش",null,null,"تليفون اللنش"]
[null,null,null,null,null,"عدد الركاب","عدد الطقم"]
[null,null,{"$f":"Boat1!C3","v":"2022-08-01"},"Sharks Bay ",null,{"$f":"VLOOKUP($K$3,#REF!,4,FALSE)","v":{"$error":"#REF!"}},{"$f":"VLOOKUP($K$3,#REF!,5,FALSE)","v":{"$error":"#REF!"}},{"$f":"VLOOKUP($K$3,#REF!,3,FALSE)","v":{"$error":"#REF!"}},null,{"$f":"VLOOKUP($K$3,#REF!,2,FALSE)","v":{"$error":"#REF!"}},null,null,null,{"$f":"VLOOKUP($K$3,#REF!,6,FALSE)","v":{"$error":"#REF!"}},{"$f":"VLOOKUP($K$3,#REF!,2,FALSE)","v":{"$error":"#REF!"}}]
[null,null,"طاقم المركب",null,null,null,"المدربين/المرشدين/المصورين",null,null,null,null,null,null,"GUIDING"]
[null,null,"تليفون","رقم مزاوله المهنه","الوظيفه","اسماء الطاقم","تليفون","رقم مزاوله المهنه",null,"الوظيفه","الاسماء"]
[null,null,{"$f":"VLOOKUP($K$3,#REF!,10,FALSE)","v":{"$error":"#REF!"}},{"$f":"VLOOKUP($K$3,#REF!,9,FALSE)","v":{"$error":"#REF!"}},{"$f":"VLOOKUP($K$3,#REF!,8,FALSE)","v":{"$error":"#REF!"}},{"$f":"VLOOKUP($K$3,#REF!,7,FALSE)","v":{"$error":"#REF!"}},{"$f":"VLOOKUP($K6,#REF!,4,FALSE)","v":{"$error":"#REF!"}},{"$f":"VLOOKUP($K6,#REF!,3,FALSE)","v":{"$error":"#REF!"}},null,{"$f":"VLOOKUP($K6,#REF!,2,FALSE)","v":{"$error":"#REF!"}}]
{"$rows_left_out":298}
{"sheet":"Stella","index":6,"n_rows":303,"n_cols":28,"rows_kept":303,"cut":false,"hidden":false,"merged":[[51,13,51,17],[52,6,52,7],[52,13,56,17],[53,6,53,7],[54,6,54,7],[54,10,54,11],[55,6,55,7],[56,6,56,7],[9,7,9,8],[9,10,9,11],[10,7,10,8],[10,10,10,11],[51,1,51,7],[51,10,51,11],[11,7,11,8],[11,10,11,11],[0,13,1,14],[2,7,2,8],[2,10,2,11],[2,13,2,14],[50,1,50,7],[4,7,4,8],[4,10,4,11],[5,7,5,8],[5,10,5,11],[6,0,9,1],[6,7,6,8],[6,10,6,11],[7,7,7,8],[7,10,7,11],[8,7,8,8],[8,10,8,11],[3,2,3,5],[3,6,3,11],[0,2,1,2],[0,3,1,3],[0,4,1,4],[0,5,0,6],[0,7,1,8],[0,9,1,9],[0,10,1,11]]}
[null,null,"التاريخ","اتجاه الرحله","ميناء القيام","الحموله",null,"تاريخ انتهاء الترخيص",null,"رقم التسجيل","اسم اللنش",null,null,"تليفون اللنش"]
[null,null,null,null,null,"عدد الركاب","عدد الطقم"]
[null,null,{"$f":"Boat1!C3","v":"2022-08-01"},"Stella Beach",null,{"$f":"VLOOKUP($K$3,#REF!,4,FALSE)","v":{"$error":"#REF!"}},{"$f":"VLOOKUP($K$3,#REF!,5,FALSE)","v":{"$error":"#REF!"}},{"$f":"VLOOKUP($K$3,#REF!,3,FALSE)","v":{"$error":"#REF!"}},null,{"$f":"VLOOKUP($K$3,#REF!,2,FALSE)","v":{"$error":"#REF!"}},null,null,null,{"$f":"VLOOKUP($K$3,#REF!,6,FALSE)","v":{"$error":"#REF!"}},{"$f":"VLOOKUP($K$3,#REF!,2,FALSE)","v":{"$error":"#REF!"}}]
[null,null,"طاقم المركب",null,null,null,"المدربين/المرشدين/المصورين"]
[null,null,"تليفون","رقم مزاوله المهنه","الوظيفه","اسماء الطاقم","تليفون","رقم مزاوله المهنه",null,"الوظيفه","الاسماء",null,null,{"$f":"COUNTIF(boat217[Activity\nالنشاط],N4)","v":0},{"$f":"COUNTIF(boat217[Activity\nالنشاط],O4)","v":0},{"$f":"COUNTIF(boat217[Activity\nالنشاط],P4)","v":0},{"$f":"COUNTIF(boat217[Activity\nالنشاط],Q4)","v":0},{"$f":"COUNTIF(boat217[Activity\nالنشاط],R4)","v":0},{"$f":"COUNTIF(boat217[Activity\nالنشاط],S4)","v":0},{"$f":"COUNTIF(boat217[Activity\nالنشاط],T4)","v":0},{"$f":"COUNTIF(boat217[Activity\nالنشاط],U4)","v":0},{"$f":"COUNTIF(boat217[Activity\nالنشاط],\"*DIVE*\")","v":0},{"$f":"COUNTIF(boat217[Activity\nالنشاط],\"*3 DIVES*\")","v":0}]
[null,null,{"$f":"VLOOKUP($K$3,#REF!,10,FALSE)","v":{"$error":"#REF!"}},{"$f":"VLOOKUP($K$3,#REF!,9,FALSE)","v":{"$error":"#REF!"}},{"$f":"VLOOKUP($K$3,#REF!,8,FALSE)","v":{"$error":"#REF!"}},{"$f":"VLOOKUP($K$3,#REF!,7,FALSE)","v":{"$error":"#REF!"}},{"$f":"VLOOKUP($K6,#REF!,4,FALSE)","v":{"$error":"#REF!"}},{"$f":"VLOOKUP($K6,#REF!,3,FALSE)","v":{"$error":"#REF!"}},null,{"$f":"VLOOKUP($K6,#REF!,2,FALSE)","v":{"$error":"#REF!"}}]
{"$rows_left_out":298}
{"sheet":"H.W.F","index":7,"n_rows":57,"n_cols":28,"rows_kept":57,"cut":false,"hidden":true,"merged":[[51,13,51,17],[52,6,52,7],[52,13,56,17],[53,6,53,7],[54,6,54,7],[54,10,54,11],[55,6,55,7],[56,6,56,7],[9,7,9,8],[9,10,9,11],[10,7,10,8],[10,10,10,11],[51,1,51,7],[51,10,51,11],[11,7,11,8],[11,10,11,11],[0,13,1,14],[2,7,2,8],[2,10,2,11],[2,13,2,14],[50,1,50,7],[4,7,4,8],[4,10,4,11],[5,7,5,8],[5,10,5,11],[6,0,9,1],[6,7,6,8],[6,10,6,11],[7,7,7,8],[7,10,7,11],[8,7,8,8],[8,10,8,11],[3,2,3,5],[3,6,3,11],[0,2,1,2],[0,3,1,3],[0,4,1,4],[0,5,0,6],[0,7,1,8],[0,9,1,9],[0,10,1,11]]}
[null,null,"التاريخ","اتجاه الرحله","ميناء القيام","الحموله",null,"تاريخ انتهاء الترخيص",null,"رقم التسجيل","اسم اللنش",null,null,"تليفون اللنش"]
[null,null,null,null,null,"عدد الركاب","عدد الطقم"]
[null,null,{"$f":"Boat1!C3","v":"2022-08-01"},"H.W.F Beach",null,{"$f":"VLOOKUP($K$3,#REF!,4,FALSE)","v":{"$error":"#REF!"}},{"$f":"VLOOKUP($K$3,#REF!,5,FALSE)","v":{"$error":"#REF!"}},{"$f":"VLOOKUP($K$3,#REF!,3,FALSE)","v":{"$error":"#REF!"}},null,{"$f":"VLOOKUP($K$3,#REF!,2,FALSE)","v":{"$error":"#REF!"}},null,null,null,{"$f":"VLOOKUP($K$3,#REF!,6,FALSE)","v":{"$error":"#REF!"}},{"$f":"VLOOKUP($K$3,#REF!,2,FALSE)","v":{"$error":"#REF!"}}]
[null,null,"طاقم المركب",null,null,null,"المدربين/المرشدين/المصورين",null,null,null,null,null,null,"GUIDING"]
[null,null,"تليفون","رقم مزاوله المهنه","الوظيفه","اسماء الطاقم","تليفون","رقم مزاوله المهنه",null,"الوظيفه","الاسماء"]
[null,null,{"$f":"VLOOKUP($K$3,#REF!,10,FALSE)","v":{"$error":"#REF!"}},{"$f":"VLOOKUP($K$3,#REF!,9,FALSE)","v":{"$error":"#REF!"}},{"$f":"VLOOKUP($K$3,#REF!,8,FALSE)","v":{"$error":"#REF!"}},{"$f":"VLOOKUP($K$3,#REF!,7,FALSE)","v":{"$error":"#REF!"}},{"$f":"VLOOKUP($K6,#REF!,4,FALSE)","v":{"$error":"#REF!"}},{"$f":"VLOOKUP($K6,#REF!,3,FALSE)","v":{"$error":"#REF!"}},null,{"$f":"VLOOKUP($K6,#REF!,2,FALSE)","v":{"$error":"#REF!"}}]
{"$rows_left_out":52}
{"sheet":"Fanar","index":8,"n_rows":92,"n_cols":28,"rows_kept":92,"cut":false,"hidden":false,"merged":[[51,13,51,17],[52,6,52,7],[52,13,56,17],[53,6,53,7],[54,6,54,7],[54,10,54,11],[55,6,55,7],[56,6,56,7],[9,7,9,8],[9,10,9,11],[10,7,10,8],[10,10,10,11],[51,1,51,7],[51,10,51,11],[11,7,11,8],[11,10,11,11],[0,13,1,14],[2,7,2,8],[2,10,2,11],[2,13,2,14],[50,1,50,7],[4,7,4,8],[4,10,4,11],[5,7,5,8],[5,10,5,11],[6,0,9,1],[6,7,6,8],[6,10,6,11],[7,7,7,8],[7,10,7,11],[8,7,8,8],[8,10,8,11],[3,2,3,5],[3,6,3,11],[0,2,1,2],[0,3,1,3],[0,4,1,4],[0,5,0,6],[0,7,1,8],[0,9,1,9],[0,10,1,11]]}
[null,null,"التاريخ","اتجاه الرحله","ميناء القيام","الحموله",null,"تاريخ انتهاء الترخيص",null,"رقم التسجيل","اسم اللنش",null,null,"تليفون اللنش"]
[null,null,null,null,null,"عدد الركاب","عدد الطقم"]
[null,null,{"$f":"Boat1!C3","v":"2022-08-01"},"Fanar",null,{"$f":"VLOOKUP($K$3,#REF!,4,FALSE)","v":{"$error":"#REF!"}},{"$f":"VLOOKUP($K$3,#REF!,5,FALSE)","v":{"$error":"#REF!"}},{"$f":"VLOOKUP($K$3,#REF!,3,FALSE)","v":{"$error":"#REF!"}},null,{"$f":"VLOOKUP($K$3,#REF!,2,FALSE)","v":{"$error":"#REF!"}},null,null,null,{"$f":"VLOOKUP($K$3,#REF!,6,FALSE)","v":{"$error":"#REF!"}},{"$f":"VLOOKUP($K$3,#REF!,2,FALSE)","v":{"$error":"#REF!"}}]
[null,null,"طاقم المركب",null,null,null,"المدربين/المرشدين/المصورين"]
[null,null,"تليفون","رقم مزاوله المهنه","الوظيفه","اسماء الطاقم","تليفون","رقم مزاوله المهنه",null,"الوظيفه","الاسماء",null,null,{"$f":"COUNTIF(boat219[Activity\nالنشاط],N4)","v":0},null,null,null,null,null,null,null,{"$f":"COUNTIF(boat219[Activity\nالنشاط],\"*DIVE*\")","v":0}]
[null,null,{"$f":"VLOOKUP($K$3,#REF!,10,FALSE)","v":{"$error":"#REF!"}},{"$f":"VLOOKUP($K$3,#REF!,9,FALSE)","v":{"$error":"#REF!"}},{"$f":"VLOOKUP($K$3,#REF!,8,FALSE)","v":{"$error":"#REF!"}},{"$f":"VLOOKUP($K$3,#REF!,7,FALSE)","v":{"$error":"#REF!"}},{"$f":"VLOOKUP($K6,#REF!,4,FALSE)","v":{"$error":"#REF!"}},{"$f":"VLOOKUP($K6,#REF!,3,FALSE)","v":{"$error":"#REF!"}},null,{"$f":"VLOOKUP($K6,#REF!,2,FALSE)","v":{"$error":"#REF!"}}]
{"$rows_left_out":87}
{"sheet":"Milton","index":9,"n_rows":57,"n_cols":28,"rows_kept":57,"cut":false,"hidden":true,"merged":[[51,13,51,17],[52,6,52,7],[52,13,56,17],[53,6,53,7],[54,6,54,7],[54,10,54,11],[55,6,55,7],[56,6,56,7],[9,7,9,8],[9,10,9,11],[10,7,10,8],[10,10,10,11],[51,1,51,7],[51,10,51,11],[11,7,11,8],[11,10,11,11],[0,13,1,14],[2,7,2,8],[2,10,2,11],[2,13,2,14],[50,1,50,7],[4,7,4,8],[4,10,4,11],[5,7,5,8],[5,10,5,11],[6,0,9,1],[6,7,6,8],[6,10,6,11],[7,7,7,8],[7,10,7,11],[8,7,8,8],[8,10,8,11],[3,2,3,5],[3,6,3,11],[0,2,1,2],[0,3,1,3],[0,4,1,4],[0,5,0,6],[0,7,1,8],[0,9,1,9],[0,10,1,11]]}
[null,null,"التاريخ","اتجاه الرحله","ميناء القيام","الحموله",null,"تاريخ انتهاء الترخيص",null,"رقم التسجيل","اسم اللنش",null,null,"تليفون اللنش"]
[null,null,null,null,null,"عدد الركاب","عدد الطقم"]
[null,null,{"$f":"Boat1!C3","v":"2022-08-01"},"Milton Beach",null,{"$f":"VLOOKUP($K$3,#REF!,4,FALSE)","v":{"$error":"#REF!"}},{"$f":"VLOOKUP($K$3,#REF!,5,FALSE)","v":{"$error":"#REF!"}},{"$f":"VLOOKUP($K$3,#REF!,3,FALSE)","v":{"$error":"#REF!"}},null,{"$f":"VLOOKUP($K$3,#REF!,2,FALSE)","v":{"$error":"#REF!"}},null,null,null,{"$f":"VLOOKUP($K$3,#REF!,6,FALSE)","v":{"$error":"#REF!"}},{"$f":"VLOOKUP($K$3,#REF!,2,FALSE)","v":{"$error":"#REF!"}}]
[null,null,"طاقم المركب",null,null,null,"المدربين/المرشدين/المصورين",null,null,null,null,null,null,"GUIDING"]
[null,null,"تليفون","رقم مزاوله المهنه","الوظيفه","اسماء الطاقم","تليفون","رقم مزاوله المهنه",null,"الوظيفه","الاسماء"]
[null,null,{"$f":"VLOOKUP($K$3,#REF!,10,FALSE)","v":{"$error":"#REF!"}},{"$f":"VLOOKUP($K$3,#REF!,9,FALSE)","v":{"$error":"#REF!"}},{"$f":"VLOOKUP($K$3,#REF!,8,FALSE)","v":{"$error":"#REF!"}},{"$f":"VLOOKUP($K$3,#REF!,7,FALSE)","v":{"$error":"#REF!"}},{"$f":"VLOOKUP($K6,#REF!,4,FALSE)","v":{"$error":"#REF!"}},{"$f":"VLOOKUP($K6,#REF!,3,FALSE)","v":{"$error":"#REF!"}},null,{"$f":"VLOOKUP($K6,#REF!,2,FALSE)","v":{"$error":"#REF!"}}]
{"$rows_left_out":51}