{"text_format":"1","workbook":"xlsx","n_sheets":2,"sheets":["ورقة1","ورقة3"],"not_rendered":{"charts":0,"images":0,"macros":0,"external_links":0,"defined_names":0,"comments":0,"pivot_tables":0},"unopened":[],"bounds":{"document_bytes":16777216,"sheet_cells":100000,"rows_first":2000,"rows_last":500,"rows_between":2000,"halvings":0,"cell_chars":16384,"cell_head_chars":4096},"cells_cut":0,"cells_raw":0,"read":"whole","date_system":"1900"}

{"sheet":"ورقة1","index":0,"n_rows":20,"n_cols":14,"rows_kept":20,"cut":false,"hidden":false,"merged":[[3,10,3,12],[4,6,5,17],[7,6,8,17]]}
["الصنف","رصيد اول","رصيد اخر","التاريخ"]
["صنف1",1,100,"2022-07-01"]
["صنف2",5,105,"2022-07-01"]
["صنف1",100,200,"2022-08-01",null,null,null,null,null,null,"المطلوب كمثال"]
["صنف2",105,205,"2022-08-01",null,null,"عند اختيار التاريخ  2022-07-01 لصنف1 تجلب رصيد اول هو ( 1 ) وعند اختيار التاريخ  2022-07-31 تجلب رصيد اخر هو ( 100 ) وهاكذا صنف2"]
["صنف1",200,300,"2022-09-01"]
["صنف2",205,305,"2022-09-01"]
["صنف1",300,400,"2022-10-01",null,null,"عند اختيار التاريخ  2022-08-01 لصنف1 تجلب رصيد اول هو ( 100 ) وعند اختيار التاريخ  2022-08-31 تجلب رصيد اخر هو ( 200 ) وهاكذا صنف2"]
["صنف2",305,405,"2022-10-01"]
[]
[]
[]
[null,null,null,null,null,null,null,null,null,"جلب البيانات من شيت رقم 2"]
[]
[]
[null,null,null,null,null,null,null,null,null,null,null,null,null,"2022-07-13"]
[null,null,null,null,null,null,null,null,null,null,null,null,null,"2022-07-14"]
[null,null,null,null,null,null,null,null,null,null,null,null,null,"2022-07-15"]
[null,null,null,null,null,null,null,null,null,null,null,null,null,"2022-07-16"]
[null,null,null,null,null,null,null,null,null,null,null,null,null,"2022-07-17"]

{"sheet":"ورقة3","index":1,"n_rows":50,"n_cols":3,"rows_kept":50,"cut":false,"hidden":false,"merged":[]}
[null,"التاريخ الاول","التاريخ الثاني"]
[null,"2022-07-01","2022-07-31"]
["الصنف","رصيد اول","رصيد اخر"]
[{"$f":"IFERROR(INDEX(ورقة1!A$2:A$20,SMALL(IF(ورقة1!$D$2:$D$20>=$B$2,IF(ورقة1!$D$2:$D$20<=$C$2,IF(ورقة1!A$2:A$20<>\"\",ROW(B$7:B$184)-ROW(B$7)+1))),ROWS($A$4:A4))),\"\")","v":""},{"$f":"IFERROR(INDEX(ورقة1!B$2:B$20,SMALL(IF(ورقة1!$D$2:$D$20>=$B$2,IF(ورقة1!$D$2:$D$20<=$C$2,IF(ورقة1!B$2:B$20<>\"\",ROW(C$7:C$184)-ROW(C$7)+1))),ROWS($A$4:B4))),\"\")","v":""},{"$f":"IFERROR(INDEX(ورقة1!C$2:C$20,SMALL(IF(ورقة1!$D$2:$D$20>=$B$2,IF(ورقة1!$D$2:$D$20<=$C$2,IF(ورقة1!C$2:C$20<>\"\",ROW(D$7:D$184)-ROW(D$7)+1))),ROWS($A$4:C4))),\"\")","v":""}]
[{"$f":"IFERROR(INDEX(ورقة1!A$2:A$20,SMALL(IF(ورقة1!$D$2:$D$20>=$B$2,IF(ورقة1!$D$2:$D$20<=$C$2,IF(ورقة1!A$2:A$20<>\"\",ROW(B$7:B$184)-ROW(B$7)+1))),ROWS($A$4:A5))),\"\")","v":""},{"$f":"IFERROR(INDEX(ورقة1!B$2:B$20,SMALL(IF(ورقة1!$D$2:$D$20>=$B$2,IF(ورقة1!$D$2:$D$20<=$C$2,IF(ورقة1!B$2:B$20<>\"\",ROW(C$7:C$184)-ROW(C$7)+1))),ROWS($A$4:B5))),\"\")","v":""},{"$f":"IFERROR(INDEX(ورقة1!C$2:C$20,SMALL(IF(ورقة1!$D$2:$D$20>=$B$2,IF(ورقة1!$D$2:$D$20<=$C$2,IF(ورقة1!C$2:C$20<>\"\",ROW(D$7:D$184)-ROW(D$7)+1))),ROWS($A$4:C5))),\"\")","v":""}]
[{"$f":"IFERROR(INDEX(ورقة1!A$2:A$20,SMALL(IF(ورقة1!$D$2:$D$20>=$B$2,IF(ورقة1!$D$2:$D$20<=$C$2,IF(ورقة1!A$2:A$20<>\"\",ROW(B$7:B$184)-ROW(B$7)+1))),ROWS($A$4:A6))),\"\")","v":""},{"$f":"IFERROR(INDEX(ورقة1!B$2:B$20,SMALL(IF(ورقة1!$D$2:$D$20>=$B$2,IF(ورقة1!$D$2:$D$20<=$C$2,IF(ورقة1!B$2:B$20<>\"\",ROW(C$7:C$184)-ROW(C$7)+1))),ROWS($A$4:B6))),\"\")","v":""},{"$f":"IFERROR(INDEX(ورقة1!C$2:C$20,SMALL(IF(ورقة1!$D$2:$D$20>=$B$2,IF(ورقة1!$D$2:$D$20<=$C$2,IF(ورقة1!C$2:C$20<>\"\",ROW(D$7:D$184)-ROW(D$7)+1))),ROWS($A$4:C6))),\"\")","v":""}]
[{"$f":"IFERROR(INDEX(ورقة1!A$2:A$20,SMALL(IF(ورقة1!$D$2:$D$20>=$B$2,IF(ورقة1!$D$2:$D$20<=$C$2,IF(ورقة1!A$2:A$20<>\"\",ROW(B$7:B$184)-ROW(B$7)+1))),ROWS($A$4:A7))),\"\")","v":""},{"$f":"IFERROR(INDEX(ورقة1!B$2:B$20,SMALL(IF(ورقة1!$D$2:$D$20>=$B$2,IF(ورقة1!$D$2:$D$20<=$C$2,IF(ورقة1!B$2:B$20<>\"\",ROW(C$7:C$184)-ROW(C$7)+1))),ROWS($A$4:B7))),\"\")","v":""},{"$f":"IFERROR(INDEX(ورقة1!C$2:C$20,SMALL(IF(ورقة1!$D$2:$D$20>=$B$2,IF(ورقة1!$D$2:$D$20<=$C$2,IF(ورقة1!C$2:C$20<>\"\",ROW(D$7:D$184)-ROW(D$7)+1))),ROWS($A$4:C7))),\"\")","v":""}]
[{"$f":"IFERROR(INDEX(ورقة1!A$2:A$20,SMALL(IF(ورقة1!$D$2:$D$20>=$B$2,IF(ورقة1!$D$2:$D$20<=$C$2,IF(ورقة1!A$2:A$20<>\"\",ROW(B$7:B$184)-ROW(B$7)+1))),ROWS($A$4:A8))),\"\")","v":""},{"$f":"IFERROR(INDEX(ورقة1!B$2:B$20,SMALL(IF(ورقة1!$D$2:$D$20>=$B$2,IF(ورقة1!$D$2:$D$20<=$C$2,IF(ورقة1!B$2:B$20<>\"\",ROW(C$7:C$184)-ROW(C$7)+1))),ROWS($A$4:B8))),\"\")","v":""},{"$f":"IFERROR(INDEX(ورقة1!C$2:C$20,SMALL(IF(ورقة1!$D$2:$D$20>=$B$2,IF(ورقة1!$D$2:$D$20<=$C$2,IF(ورقة1!C$2:C$20<>\"\",ROW(D$7:D$184)-ROW(D$7)+1))),ROWS($A$4:C8))),\"\")","v":""}]
[{"$f":"IFERROR(INDEX(ورقة1!A$2:A$20,SMALL(IF(ورقة1!$D$2:$D$20>=$B$2,IF(ورقة1!$D$2:$D$20<=$C$2,IF(ورقة1!A$2:A$20<>\"\",ROW(B$7:B$184)-ROW(B$7)+1))),ROWS($A$4:A9))),\"\")","v":""},{"$f":"IFERROR(INDEX(ورقة1!B$2:B$20,SMALL(IF(ورقة1!$D$2:$D$20>=$B$2,IF(ورقة1!$D$2:$D$20<=$C$2,IF(ورقة1!B$2:B$20<>\"\",ROW(C$7:C$184)-ROW(C$7)+1))),ROWS($A$4:B9))),\"\")","v":""},{"$f":"IFERROR(INDEX(ورقة1!C$2:C$20,SMALL(IF(ورقة1!$D$2:$D$20>=$B$2,IF(ورقة1!$D$2:$D$20<=$C$2,IF(ورقة1!C$2:C$20<>\"\",ROW(D$7:D$184)-ROW(D$7)+1))),ROWS($A$4:C9))),\"\")","v":""}]
[{"$f":"IFERROR(INDEX(ورقة1!A$2:A$20,SMALL(IF(ورقة1!$D$2:$D$20>=$B$2,IF(ورقة1!$D$2:$D$20<=$C$2,IF(ورقة1!A$2:A$20<>\"\",ROW(B$7:B$184)-ROW(B$7)+1))),ROWS($A$4:A10))),\"\")","v":""},{"$f":"IFERROR(INDEX(ورقة1!B$2:B$20,SMALL(IF(ورقة1!$D$2:$D$20>=$B$2,IF(ورقة1!$D$2:$D$20<=$C$2,IF(ورقة1!B$2:B$20<>\"\",ROW(C$7:C$184)-ROW(C$7)+1))),ROWS($A$4:B10))),\"\")","v":""},{"$f":"IFERROR(INDEX(ورقة1!C$2:C$20,SMALL(IF(ورقة1!$D$2:$D$20>=$B$2,IF(ورقة1!$D$2:$D$20<=$C$2,IF(ورقة1!C$2:C$20<>\"\",ROW(D$7:D$184)-ROW(D$7)+1))),ROWS($A$4:C10))),\"\")","v":""}]
[{"$f":"IFERROR(INDEX(ورقة1!A$2:A$20,SMALL(IF(ورقة1!$D$2:$D$20>=$B$2,IF(ورقة1!$D$2:$D$20<=$C$2,IF(ورقة1!A$2:A$20<>\"\",ROW(B$7:B$184)-ROW(B$7)+1))),ROWS($A$4:A11))),\"\")","v":""},{"$f":"IFERROR(INDEX(ورقة1!B$2:B$20,SMALL(IF(ورقة1!$D$2:$D$20>=$B$2,IF(ورقة1!$D$2:$D$20<=$C$2,IF(ورقة1!B$2:B$20<>\"\",ROW(C$7:C$184)-ROW(C$7)+1))),ROWS($A$4:B11))),\"\")","v":""},{"$f":"IFERROR(INDEX(ورقة1!C$2:C$20,SMALL(IF(ورقة1!$D$2:$D$20>=$B$2,IF(ورقة1!$D$2:$D$20<=$C$2,IF(ورقة1!C$2:C$20<>\"\",ROW(D$7:D$184)-ROW(D$7)+1))),ROWS($A$4:C11))),\"\")","v":""}]
[{"$f":"IFERROR(INDEX(ورقة1!A$2:A$20,SMALL(IF(ورقة1!$D$2:$D$20>=$B$2,IF(ورقة1!$D$2:$D$20<=$C$2,IF(ورقة1!A$2:A$20<>\"\",ROW(B$7:B$184)-ROW(B$7)+1))),ROWS($A$4:A12))),\"\")","v":""},{"$f":"IFERROR(INDEX(ورقة1!B$2:B$20,SMALL(IF(ورقة1!$D$2:$D$20>=$B$2,IF(ورقة1!$D$2:$D$20<=$C$2,IF(ورقة1!B$2:B$20<>\"\",ROW(C$7:C$184)-ROW(C$7)+1))),ROWS($A$4:B12))),\"\")","v":""},{"$f":"IFERROR(INDEX(ورقة1!C$2:C$20,SMALL(IF(ورقة1!$D$2:$D$20>=$B$2,IF(ورقة1!$D$2:$D$20<=$C$2,IF(ورقة1!C$2:C$20<>\"\",ROW(D$7:D$184)-ROW(D$7)+1))),ROWS($A$4:C12))),\"\")","v":""}]
[{"$f":"IFERROR(INDEX(ورقة1!A$2:A$20,SMALL(IF(ورقة1!$D$2:$D$20>=$B$2,IF(ورقة1!$D$2:$D$20<=$C$2,IF(ورقة1!A$2:A$20<>\"\",ROW(B$7:B$184)-ROW(B$7)+1))),ROWS($A$4:A13))),\"\")","v":""},{"$f":"IFERROR(INDEX(ورقة1!B$2:B$20,SMALL(IF(ورقة1!$D$2:$D$20>=$B$2,IF(ورقة1!$D$2:$D$20<=$C$2,IF(ورقة1!B$2:B$20<>\"\",ROW(C$7:C$184)-ROW(C$7)+1))),ROWS($A$4:B13))),\"\")","v":""},{"$f":"IFERROR(INDEX(ورقة1!C$2:C$20,SMALL(IF(ورقة1!$D$2:$D$20>=$B$2,IF(ورقة1!$D$2:$D$20<=$C$2,IF(ورقة1!C$2:C$20<>\"\",ROW(D$7:D$184)-ROW(D$7)+1))),ROWS($A$4:C13))),\"\")","v":""}]
[{"$f":"IFERROR(INDEX(ورقة1!A$2:A$20,SMALL(IF(ورقة1!$D$2:$D$20>=$B$2,IF(ورقة1!$D$2:$D$20<=$C$2,IF(ورقة1!A$2:A$20<>\"\",ROW(B$7:B$184)-ROW(B$7)+1))),ROWS($A$4:A14))),\"\")","v":""},{"$f":"IFERROR(INDEX(ورقة1!B$2:B$20,SMALL(IF(ورقة1!$D$2:$D$20>=$B$2,IF(ورقة1!$D$2:$D$20<=$C$2,IF(ورقة1!B$2:B$20<>\"\",ROW(C$7:C$184)-ROW(C$7)+1))),ROWS($A$4:B14))),\"\")","v":""},{"$f":"IFERROR(INDEX(ورقة1!C$2:C$20,SMALL(IF(ورقة1!$D$2:$D$20>=$B$2,IF(ورقة1!$D$2:$D$20<=$C$2,IF(ورقة1!C$2:C$20<>\"\",ROW(D$7:D$184)-ROW(D$7)+1))),ROWS($A$4:C14))),\"\")","v":""}]
[{"$f":"IFERROR(INDEX(ورقة1!A$2:A$20,SMALL(IF(ورقة1!$D$2:$D$20>=$B$2,IF(ورقة1!$D$2:$D$20<=$C$2,IF(ورقة1!A$2:A$20<>\"\",ROW(B$7:B$184)-ROW(B$7)+1))),ROWS($A$4:A15))),\"\")","v":""},{"$f":"IFERROR(INDEX(ورقة1!B$2:B$20,SMALL(IF(ورقة1!$D$2:$D$20>=$B$2,IF(ورقة1!$D$2:$D$20<=$C$2,IF(ورقة1!B$2:B$20<>\"\",ROW(C$7:C$184)-ROW(C$7)+1))),ROWS($A$4:B15))),\"\")","v":""},{"$f":"IFERROR(INDEX(ورقة1!C$2:C$20,SMALL(IF(ورقة1!$D$2:$D$20>=$B$2,IF(ورقة1!$D$2:$D$20<=$C$2,IF(ورقة1!C$2:C$20<>\"\",ROW(D$7:D$184)-ROW(D$7)+1))),ROWS($A$4:C15))),\"\")","v":""}]
[{"$f":"IFERROR(INDEX(ورقة1!A$2:A$20,SMALL(IF(ورقة1!$D$2:$D$20>=$B$2,IF(ورقة1!$D$2:$D$20<=$C$2,IF(ورقة1!A$2:A$20<>\"\",ROW(B$7:B$184)-ROW(B$7)+1))),ROWS($A$4:A16))),\"\")","v":""},{"$f":"IFERROR(INDEX(ورقة1!B$2:B$20,SMALL(IF(ورقة1!$D$2:$D$20>=$B$2,IF(ورقة1!$D$2:$D$20<=$C$2,IF(ورقة1!B$2:B$20<>\"\",ROW(C$7:C$184)-ROW(C$7)+1))),ROWS($A$4:B16))),\"\")","v":""},{"$f":"IFERROR(INDEX(ورقة1!C$2:C$20,SMALL(IF(ورقة1!$D$2:$D$20>=$B$2,IF(ورقة1!$D$2:$D$20<=$C$2,IF(ورقة1!C$2:C$20<>\"\",ROW(D$7:D$184)-ROW(D$7)+1))),ROWS($A$4:C16))),\"\")","v":""}]
[{"$f":"IFERROR(INDEX(ورقة1!A$2:A$20,SMALL(IF(ورقة1!$D$2:$D$20>=$B$2,IF(ورقة1!$D$2:$D$20<=$C$2,IF(ورقة1!A$2:A$20<>\"\",ROW(B$7:B$184)-ROW(B$7)+1))),ROWS($A$4:A17))),\"\")","v":""},{"$f":"IFERROR(INDEX(ورقة1!B$2:B$20,SMALL(IF(ورقة1!$D$2:$D$20>=$B$2,IF(ورقة1!$D$2:$D$20<=$C$2,IF(ورقة1!B$2:B$20<>\"\",ROW(C$7:C$184)-ROW(C$7)+1))),ROWS($A$4:B17))),\"\")","v":""},{"$f":"IFERROR(INDEX(ورقة1!C$2:C$20,SMALL(IF(ورقة1!$D$2:$D$20>=$B$2,IF(ورقة1!$D$2:$D$20<=$C$2,IF(ورقة1!C$2:C$20<>\"\",ROW(D$7:D$184)-ROW(D$7)+1))),ROWS($A$4:C17))),\"\")","v":""}]
[{"$f":"IFERROR(INDEX(ورقة1!A$2:A$20,SMALL(IF(ورقة1!$D$2:$D$20>=$B$2,IF(ورقة1!$D$2:$D$20<=$C$2,IF(ورقة1!A$2:A$20<>\"\",ROW(B$7:B$184)-ROW(B$7)+1))),ROWS($A$4:A18))),\"\")","v":""},{"$f":"IFERROR(INDEX(ورقة1!B$2:B$20,SMALL(IF(ورقة1!$D$2:$D$20>=$B$2,IF(ورقة1!$D$2:$D$20<=$C$2,IF(ورقة1!B$2:B$20<>\"\",ROW(C$7:C$184)-ROW(C$7)+1))),ROWS($A$4:B18))),\"\")","v":""},{"$f":"IFERROR(INDEX(ورقة1!C$2:C$20,SMALL(IF(ورقة1!$D$2:$D$20>=$B$2,IF(ورقة1!$D$2:$D$20<=$C$2,IF(ورقة1!C$2:C$20<>\"\",ROW(D$7:D$184)-ROW(D$7)+1))),ROWS($A$4:C18))),\"\")","v":""}]
[{"$f":"IFERROR(INDEX(ورقة1!A$2:A$20,SMALL(IF(ورقة1!$D$2:$D$20>=$B$2,IF(ورقة1!$D$2:$D$20<=$C$2,IF(ورقة1!A$2:A$20<>\"\",ROW(B$7:B$184)-ROW(B$7)+1))),ROWS($A$4:A19))),\"\")","v":""},{"$f":"IFERROR(INDEX(ورقة1!B$2:B$20,SMALL(IF(ورقة1!$D$2:$D$20>=$B$2,IF(ورقة1!$D$2:$D$20<=$C$2,IF(ورقة1!B$2:B$20<>\"\",ROW(C$7:C$184)-ROW(C$7)+1))),ROWS($A$4:B19))),\"\")","v":""},{"$f":"IFERROR(INDEX(ورقة1!C$2:C$20,SMALL(IF(ورقة1!$D$2:$D$20>=$B$2,IF(ورقة1!$D$2:$D$20<=$C$2,IF(ورقة1!C$2:C$20<>\"\",ROW(D$7:D$184)-ROW(D$7)+1))),ROWS($A$4:C19))),\"\")","v":""}]
[{"$f":"IFERROR(INDEX(ورقة1!A$2:A$20,SMALL(IF(ورقة1!$D$2:$D$20>=$B$2,IF(ورقة1!$D$2:$D$20<=$C$2,IF(ورقة1!A$2:A$20<>\"\",ROW(B$7:B$184)-ROW(B$7)+1))),ROWS($A$4:A20))),\"\")","v":""},{"$f":"IFERROR(INDEX(ورقة1!B$2:B$20,SMALL(IF(ورقة1!$D$2:$D$20>=$B$2,IF(ورقة1!$D$2:$D$20<=$C$2,IF(ورقة1!B$2:B$20<>\"\",ROW(C$7:C$184)-ROW(C$7)+1))),ROWS($A$4:B20))),\"\")","v":""},{"$f":"IFERROR(INDEX(ورقة1!C$2:C$20,SMALL(IF(ورقة1!$D$2:$D$20>=$B$2,IF(ورقة1!$D$2:$D$20<=$C$2,IF(ورقة1!C$2:C$20<>\"\",ROW(D$7:D$184)-ROW(D$7)+1))),ROWS($A$4:C20))),\"\")","v":""}]
[{"$f":"IFERROR(INDEX(ورقة1!A$2:A$20,SMALL(IF(ورقة1!$D$2:$D$20>=$B$2,IF(ورقة1!$D$2:$D$20<=$C$2,IF(ورقة1!A$2:A$20<>\"\",ROW(B$7:B$184)-ROW(B$7)+1))),ROWS($A$4:A21))),\"\")","v":""},{"$f":"IFERROR(INDEX(ورقة1!B$2:B$20,SMALL(IF(ورقة1!$D$2:$D$20>=$B$2,IF(ورقة1!$D$2:$D$20<=$C$2,IF(ورقة1!B$2:B$20<>\"\",ROW(C$7:C$184)-ROW(C$7)+1))),ROWS($A$4:B21))),\"\")","v":""},{"$f":"IFERROR(INDEX(ورقة1!C$2:C$20,SMALL(IF(ورقة1!$D$2:$D$20>=$B$2,IF(ورقة1!$D$2:$D$20<=$C$2,IF(ورقة1!C$2:C$20<>\"\",ROW(D$7:D$184)-ROW(D$7)+1))),ROWS($A$4:C21))),\"\")","v":""}]
[{"$f":"IFERROR(INDEX(ورقة1!A$2:A$20,SMALL(IF(ورقة1!$D$2:$D$20>=$B$2,IF(ورقة1!$D$2:$D$20<=$C$2,IF(ورقة1!A$2:A$20<>\"\",ROW(B$7:B$184)-ROW(B$7)+1))),ROWS($A$4:A22))),\"\")","v":""},{"$f":"IFERROR(INDEX(ورقة1!B$2:B$20,SMALL(IF(ورقة1!$D$2:$D$20>=$B$2,IF(ورقة1!$D$2:$D$20<=$C$2,IF(ورقة1!B$2:B$20<>\"\",ROW(C$7:C$184)-ROW(C$7)+1))),ROWS($A$4:B22))),\"\")","v":""},{"$f":"IFERROR(INDEX(ورقة1!C$2:C$20,SMALL(IF(ورقة1!$D$2:$D$20>=$B$2,IF(ورقة1!$D$2:$D$20<=$C$2,IF(ورقة1!C$2:C$20<>\"\",ROW(D$7:D$184)-ROW(D$7)+1))),ROWS($A$4:C22))),\"\")","v":""}]
[{"$f":"IFERROR(INDEX(ورقة1!A$2:A$20,SMALL(IF(ورقة1!$D$2:$D$20>=$B$2,IF(ورقة1!$D$2:$D$20<=$C$2,IF(ورقة1!A$2:A$20<>\"\",ROW(B$7:B$184)-ROW(B$7)+1))),ROWS($A$4:A23))),\"\")","v":""},{"$f":"IFERROR(INDEX(ورقة1!B$2:B$20,SMALL(IF(ورقة1!$D$2:$D$20>=$B$2,IF(ورقة1!$D$2:$D$20<=$C$2,IF(ورقة1!B$2:B$20<>\"\",ROW(C$7:C$184)-ROW(C$7)+1))),ROWS($A$4:B23))),\"\")","v":""},{"$f":"IFERROR(INDEX(ورقة1!C$2:C$20,SMALL(IF(ورقة1!$D$2:$D$20>=$B$2,IF(ورقة1!$D$2:$D$20<=$C$2,IF(ورقة1!C$2:C$20<>\"\",ROW(D$7:D$184)-ROW(D$7)+1))),ROWS($A$4:C23))),\"\")","v":""}]
[{"$f":"IFERROR(INDEX(ورقة1!A$2:A$20,SMALL(IF(ورقة1!$D$2:$D$20>=$B$2,IF(ورقة1!$D$2:$D$20<=$C$2,IF(ورقة1!A$2:A$20<>\"\",ROW(B$7:B$184)-ROW(B$7)+1))),ROWS($A$4:A24))),\"\")","v":""},{"$f":"IFERROR(INDEX(ورقة1!B$2:B$20,SMALL(IF(ورقة1!$D$2:$D$20>=$B$2,IF(ورقة1!$D$2:$D$20<=$C$2,IF(ورقة1!B$2:B$20<>\"\",ROW(C$7:C$184)-ROW(C$7)+1))),ROWS($A$4:B24))),\"\")","v":""},{"$f":"IFERROR(INDEX(ورقة1!C$2:C$20,SMALL(IF(ورقة1!$D$2:$D$20>=$B$2,IF(ورقة1!$D$2:$D$20<=$C$2,IF(ورقة1!C$2:C$20<>\"\",ROW(D$7:D$184)-ROW(D$7)+1))),ROWS($A$4:C24))),\"\")","v":""}]
[{"$f":"IFERROR(INDEX(ورقة1!A$2:A$20,SMALL(IF(ورقة1!$D$2:$D$20>=$B$2,IF(ورقة1!$D$2:$D$20<=$C$2,IF(ورقة1!A$2:A$20<>\"\",ROW(B$7:B$184)-ROW(B$7)+1))),ROWS($A$4:A25))),\"\")","v":""},{"$f":"IFERROR(INDEX(ورقة1!B$2:B$20,SMALL(IF(ورقة1!$D$2:$D$20>=$B$2,IF(ورقة1!$D$2:$D$20<=$C$2,IF(ورقة1!B$2:B$20<>\"\",ROW(C$7:C$184)-ROW(C$7)+1))),ROWS($A$4:B25))),\"\")","v":""},{"$f":"IFERROR(INDEX(ورقة1!C$2:C$20,SMALL(IF(ورقة1!$D$2:$D$20>=$B$2,IF(ورقة1!$D$2:$D$20<=$C$2,IF(ورقة1!C$2:C$20<>\"\",ROW(D$7:D$184)-ROW(D$7)+1))),ROWS($A$4:C25))),\"\")","v":""}]
[{"$f":"IFERROR(INDEX(ورقة1!A$2:A$20,SMALL(IF(ورقة1!$D$2:$D$20>=$B$2,IF(ورقة1!$D$2:$D$20<=$C$2,IF(ورقة1!A$2:A$20<>\"\",ROW(B$7:B$184)-ROW(B$7)+1))),ROWS($A$4:A26))),\"\")","v":""},{"$f":"IFERROR(INDEX(ورقة1!B$2:B$20,SMALL(IF(ورقة1!$D$2:$D$20>=$B$2,IF(ورقة1!$D$2:$D$20<=$C$2,IF(ورقة1!B$2:B$20<>\"\",ROW(C$7:C$184)-ROW(C$7)+1))),ROWS($A$4:B26))),\"\")","v":""},{"$f":"IFERROR(INDEX(ورقة1!C$2:C$20,SMALL(IF(ورقة1!$D$2:$D$20>=$B$2,IF(ورقة1!$D$2:$D$20<=$C$2,IF(ورقة1!C$2:C$20<>\"\",ROW(D$7:D$184)-ROW(D$7)+1))),ROWS($A$4:C26))),\"\")","v":""}]
[{"$f":"IFERROR(INDEX(ورقة1!A$2:A$20,SMALL(IF(ورقة1!$D$2:$D$20>=$B$2,IF(ورقة1!$D$2:$D$20<=$C$2,IF(ورقة1!A$2:A$20<>\"\",ROW(B$7:B$184)-ROW(B$7)+1))),ROWS($A$4:A27))),\"\")","v":""},{"$f":"IFERROR(INDEX(ورقة1!B$2:B$20,SMALL(IF(ورقة1!$D$2:$D$20>=$B$2,IF(ورقة1!$D$2:$D$20<=$C$2,IF(ورقة1!B$2:B$20<>\"\",ROW(C$7:C$184)-ROW(C$7)+1))),ROWS($A$4:B27))),\"\")","v":""},{"$f":"IFERROR(INDEX(ورقة1!C$2:C$20,SMALL(IF(ورقة1!$D$2:$D$20>=$B$2,IF(ورقة1!$D$2:$D$20<=$C$2,IF(ورقة1!C$2:C$20<>\"\",ROW(D$7:D$184)-ROW(D$7)+1))),ROWS($A$4:C27))),\"\")","v":""}]
[{"$f":"IFERROR(INDEX(ورقة1!A$2:A$20,SMALL(IF(ورقة1!$D$2:$D$20>=$B$2,IF(ورقة1!$D$2:$D$20<=$C$2,IF(ورقة1!A$2:A$20<>\"\",ROW(B$7:B$184)-ROW(B$7)+1))),ROWS($A$4:A28))),\"\")","v":""},{"$f":"IFERROR(INDEX(ورقة1!B$2:B$20,SMALL(IF(ورقة1!$D$2:$D$20>=$B$2,IF(ورقة1!$D$2:$D$20<=$C$2,IF(ورقة1!B$2:B$20<>\"\",ROW(C$7:C$184)-ROW(C$7)+1))),ROWS($A$4:B28))),\"\")","v":""},{"$f":"IFERROR(INDEX(ورقة1!C$2:C$20,SMALL(IF(ورقة1!$D$2:$D$20>=$B$2,IF(ورقة1!$D$2:$D$20<=$C$2,IF(ورقة1!C$2:C$20<>\"\",ROW(D$7:D$184)-ROW(D$7)+1))),ROWS($A$4:C28))),\"\")","v":""}]
[{"$f":"IFERROR(INDEX(ورقة1!A$2:A$20,SMALL(IF(ورقة1!$D$2:$D$20>=$B$2,IF(ورقة1!$D$2:$D$20<=$C$2,IF(ورقة1!A$2:A$20<>\"\",ROW(B$7:B$184)-ROW(B$7)+1))),ROWS($A$4:A29))),\"\")","v":""},{"$f":"IFERROR(INDEX(ورقة1!B$2:B$20,SMALL(IF(ورقة1!$D$2:$D$20>=$B$2,IF(ورقة1!$D$2:$D$20<=$C$2,IF(ورقة1!B$2:B$20<>\"\",ROW(C$7:C$184)-ROW(C$7)+1))),ROWS($A$4:B29))),\"\")","v":""},{"$f":"IFERROR(INDEX(ورقة1!C$2:C$20,SMALL(IF(ورقة1!$D$2:$D$20>=$B$2,IF(ورقة1!$D$2:$D$20<=$C$2,IF(ورقة1!C$2:C$20<>\"\",ROW(D$7:D$184)-ROW(D$7)+1))),ROWS($A$4:C29))),\"\")","v":""}]
[{"$f":"IFERROR(INDEX(ورقة1!A$2:A$20,SMALL(IF(ورقة1!$D$2:$D$20>=$B$2,IF(ورقة1!$D$2:$D$20<=$C$2,IF(ورقة1!A$2:A$20<>\"\",ROW(B$7:B$184)-ROW(B$7)+1))),ROWS($A$4:A30))),\"\")","v":""},{"$f":"IFERROR(INDEX(ورقة1!B$2:B$20,SMALL(IF(ورقة1!$D$2:$D$20>=$B$2,IF(ورقة1!$D$2:$D$20<=$C$2,IF(ورقة1!B$2:B$20<>\"\",ROW(C$7:C$184)-ROW(C$7)+1))),ROWS($A$4:B30))),\"\")","v":""},{"$f":"IFERROR(INDEX(ورقة1!C$2:C$20,SMALL(IF(ورقة1!$D$2:$D$20>=$B$2,IF(ورقة1!$D$2:$D$20<=$C$2,IF(ورقة1!C$2:C$20<>\"\",ROW(D$7:D$184)-ROW(D$7)+1))),ROWS($A$4:C30))),\"\")","v":""}]
[{"$f":"IFERROR(INDEX(ورقة1!A$2:A$20,SMALL(IF(ورقة1!$D$2:$D$20>=$B$2,IF(ورقة1!$D$2:$D$20<=$C$2,IF(ورقة1!A$2:A$20<>\"\",ROW(B$7:B$184)-ROW(B$7)+1))),ROWS($A$4:A31))),\"\")","v":""},{"$f":"IFERROR(INDEX(ورقة1!B$2:B$20,SMALL(IF(ورقة1!$D$2:$D$20>=$B$2,IF(ورقة1!$D$2:$D$20<=$C$2,IF(ورقة1!B$2:B$20<>\"\",ROW(C$7:C$184)-ROW(C$7)+1))),ROWS($A$4:B31))),\"\")","v":""},{"$f":"IFERROR(INDEX(ورقة1!C$2:C$20,SMALL(IF(ورقة1!$D$2:$D$20>=$B$2,IF(ورقة1!$D$2:$D$20<=$C$2,IF(ورقة1!C$2:C$20<>\"\",ROW(D$7:D$184)-ROW(D$7)+1))),ROWS($A$4:C31))),\"\")","v":""}]
[{"$f":"IFERROR(INDEX(ورقة1!A$2:A$20,SMALL(IF(ورقة1!$D$2:$D$20>=$B$2,IF(ورقة1!$D$2:$D$20<=$C$2,IF(ورقة1!A$2:A$20<>\"\",ROW(B$7:B$184)-ROW(B$7)+1))),ROWS($A$4:A32))),\"\")","v":""},{"$f":"IFERROR(INDEX(ورقة1!B$2:B$20,SMALL(IF(ورقة1!$D$2:$D$20>=$B$2,IF(ورقة1!$D$2:$D$20<=$C$2,IF(ورقة1!B$2:B$20<>\"\",ROW(C$7:C$184)-ROW(C$7)+1))),ROWS($A$4:B32))),\"\")","v":""},{"$f":"IFERROR(INDEX(ورقة1!C$2:C$20,SMALL(IF(ورقة1!$D$2:$D$20>=$B$2,IF(ورقة1!$D$2:$D$20<=$C$2,IF(ورقة1!C$2:C$20<>\"\",ROW(D$7:D$184)-ROW(D$7)+1))),ROWS($A$4:C32))),\"\")","v":""}]
[{"$f":"IFERROR(INDEX(ورقة1!A$2:A$20,SMALL(IF(ورقة1!$D$2:$D$20>=$B$2,IF(ورقة1!$D$2:$D$20<=$C$2,IF(ورقة1!A$2:A$20<>\"\",ROW(B$7:B$184)-ROW(B$7)+1))),ROWS($A$4:A33))),\"\")","v":""},{"$f":"IFERROR(INDEX(ورقة1!B$2:B$20,SMALL(IF(ورقة1!$D$2:$D$20>=$B$2,IF(ورقة1!$D$2:$D$20<=$C$2,IF(ورقة1!B$2:B$20<>\"\",ROW(C$7:C$184)-ROW(C$7)+1))),ROWS($A$4:B33))),\"\")","v":""},{"$f":"IFERROR(INDEX(ورقة1!C$2:C$20,SMALL(IF(ورقة1!$D$2:$D$20>=$B$2,IF(ورقة1!$D$2:$D$20<=$C$2,IF(ورقة1!C$2:C$20<>\"\",ROW(D$7:D$184)-ROW(D$7)+1))),ROWS($A$4:C33))),\"\")","v":""}]
[{"$f":"IFERROR(INDEX(ورقة1!A$2:A$20,SMALL(IF(ورقة1!$D$2:$D$20>=$B$2,IF(ورقة1!$D$2:$D$20<=$C$2,IF(ورقة1!A$2:A$20<>\"\",ROW(B$7:B$184)-ROW(B$7)+1))),ROWS($A$4:A34))),\"\")","v":""},{"$f":"IFERROR(INDEX(ورقة1!B$2:B$20,SMALL(IF(ورقة1!$D$2:$D$20>=$B$2,IF(ورقة1!$D$2:$D$20<=$C$2,IF(ورقة1!B$2:B$20<>\"\",ROW(C$7:C$184)-ROW(C$7)+1))),ROWS($A$4:B34))),\"\")","v":""},{"$f":"IFERROR(INDEX(ورقة1!C$2:C$20,SMALL(IF(ورقة1!$D$2:$D$20>=$B$2,IF(ورقة1!$D$2:$D$20<=$C$2,IF(ورقة1!C$2:C$20<>\"\",ROW(D$7:D$184)-ROW(D$7)+1))),ROWS($A$4:C34))),\"\")","v":""}]
[{"$f":"IFERROR(INDEX(ورقة1!A$2:A$20,SMALL(IF(ورقة1!$D$2:$D$20>=$B$2,IF(ورقة1!$D$2:$D$20<=$C$2,IF(ورقة1!A$2:A$20<>\"\",ROW(B$7:B$184)-ROW(B$7)+1))),ROWS($A$4:A35))),\"\")","v":""},{"$f":"IFERROR(INDEX(ورقة1!B$2:B$20,SMALL(IF(ورقة1!$D$2:$D$20>=$B$2,IF(ورقة1!$D$2:$D$20<=$C$2,IF(ورقة1!B$2:B$20<>\"\",ROW(C$7:C$184)-ROW(C$7)+1))),ROWS($A$4:B35))),\"\")","v":""},{"$f":"IFERROR(INDEX(ورقة1!C$2:C$20,SMALL(IF(ورقة1!$D$2:$D$20>=$B$2,IF(ورقة1!$D$2:$D$20<=$C$2,IF(ورقة1!C$2:C$20<>\"\",ROW(D$7:D$184)-ROW(D$7)+1))),ROWS($A$4:C35))),\"\")","v":""}]
[{"$f":"IFERROR(INDEX(ورقة1!A$2:A$20,SMALL(IF(ورقة1!$D$2:$D$20>=$B$2,IF(ورقة1!$D$2:$D$20<=$C$2,IF(ورقة1!A$2:A$20<>\"\",ROW(B$7:B$184)-ROW(B$7)+1))),ROWS($A$4:A36))),\"\")","v":""},{"$f":"IFERROR(INDEX(ورقة1!B$2:B$20,SMALL(IF(ورقة1!$D$2:$D$20>=$B$2,IF(ورقة1!$D$2:$D$20<=$C$2,IF(ورقة1!B$2:B$20<>\"\",ROW(C$7:C$184)-ROW(C$7)+1))),ROWS($A$4:B36))),\"\")","v":""},{"$f":"IFERROR(INDEX(ورقة1!C$2:C$20,SMALL(IF(ورقة1!$D$2:$D$20>=$B$2,IF(ورقة1!$D$2:$D$20<=$C$2,IF(ورقة1!C$2:C$20<>\"\",ROW(D$7:D$184)-ROW(D$7)+1))),ROWS($A$4:C36))),\"\")","v":""}]
[{"$f":"IFERROR(INDEX(ورقة1!A$2:A$20,SMALL(IF(ورقة1!$D$2:$D$20>=$B$2,IF(ورقة1!$D$2:$D$20<=$C$2,IF(ورقة1!A$2:A$20<>\"\",ROW(B$7:B$184)-ROW(B$7)+1))),ROWS($A$4:A37))),\"\")","v":""},{"$f":"IFERROR(INDEX(ورقة1!B$2:B$20,SMALL(IF(ورقة1!$D$2:$D$20>=$B$2,IF(ورقة1!$D$2:$D$20<=$C$2,IF(ورقة1!B$2:B$20<>\"\",ROW(C$7:C$184)-ROW(C$7)+1))),ROWS($A$4:B37))),\"\")","v":""},{"$f":"IFERROR(INDEX(ورقة1!C$2:C$20,SMALL(IF(ورقة1!$D$2:$D$20>=$B$2,IF(ورقة1!$D$2:$D$20<=$C$2,IF(ورقة1!C$2:C$20<>\"\",ROW(D$7:D$184)-ROW(D$7)+1))),ROWS($A$4:C37))),\"\")","v":""}]
[{"$f":"IFERROR(INDEX(ورقة1!A$2:A$20,SMALL(IF(ورقة1!$D$2:$D$20>=$B$2,IF(ورقة1!$D$2:$D$20<=$C$2,IF(ورقة1!A$2:A$20<>\"\",ROW(B$7:B$184)-ROW(B$7)+1))),ROWS($A$4:A38))),\"\")","v":""},{"$f":"IFERROR(INDEX(ورقة1!B$2:B$20,SMALL(IF(ورقة1!$D$2:$D$20>=$B$2,IF(ورقة1!$D$2:$D$20<=$C$2,IF(ورقة1!B$2:B$20<>\"\",ROW(C$7:C$184)-ROW(C$7)+1))),ROWS($A$4:B38))),\"\")","v":""},{"$f":"IFERROR(INDEX(ورقة1!C$2:C$20,SMALL(IF(ورقة1!$D$2:$D$20>=$B$2,IF(ورقة1!$D$2:$D$20<=$C$2,IF(ورقة1!C$2:C$20<>\"\",ROW(D$7:D$184)-ROW(D$7)+1))),ROWS($A$4:C38))),\"\")","v":""}]
[{"$f":"IFERROR(INDEX(ورقة1!A$2:A$20,SMALL(IF(ورقة1!$D$2:$D$20>=$B$2,IF(ورقة1!$D$2:$D$20<=$C$2,IF(ورقة1!A$2:A$20<>\"\",ROW(B$7:B$184)-ROW(B$7)+1))),ROWS($A$4:A39))),\"\")","v":""},{"$f":"IFERROR(INDEX(ورقة1!B$2:B$20,SMALL(IF(ورقة1!$D$2:$D$20>=$B$2,IF(ورقة1!$D$2:$D$20<=$C$2,IF(ورقة1!B$2:B$20<>\"\",ROW(C$7:C$184)-ROW(C$7)+1))),ROWS($A$4:B39))),\"\")","v":""},{"$f":"IFERROR(INDEX(ورقة1!C$2:C$20,SMALL(IF(ورقة1!$D$2:$D$20>=$B$2,IF(ورقة1!$D$2:$D$20<=$C$2,IF(ورقة1!C$2:C$20<>\"\",ROW(D$7:D$184)-ROW(D$7)+1))),ROWS($A$4:C39))),\"\")","v":""}]
[{"$f":"IFERROR(INDEX(ورقة1!A$2:A$20,SMALL(IF(ورقة1!$D$2:$D$20>=$B$2,IF(ورقة1!$D$2:$D$20<=$C$2,IF(ورقة1!A$2:A$20<>\"\",ROW(B$7:B$184)-ROW(B$7)+1))),ROWS($A$4:A40))),\"\")","v":""},{"$f":"IFERROR(INDEX(ورقة1!B$2:B$20,SMALL(IF(ورقة1!$D$2:$D$20>=$B$2,IF(ورقة1!$D$2:$D$20<=$C$2,IF(ورقة1!B$2:B$20<>\"\",ROW(C$7:C$184)-ROW(C$7)+1))),ROWS($A$4:B40))),\"\")","v":""},{"$f":"IFERROR(INDEX(ورقة1!C$2:C$20,SMALL(IF(ورقة1!$D$2:$D$20>=$B$2,IF(ورقة1!$D$2:$D$20<=$C$2,IF(ورقة1!C$2:C$20<>\"\",ROW(D$7:D$184)-ROW(D$7)+1))),ROWS($A$4:C40))),\"\")","v":""}]
{"$rows_left_out":10}