{"text_format":"1","workbook":"xlsx","n_sheets":3,"sheets":["Nesma","Wheels","Parts"],"not_rendered":{"charts":0,"images":1,"macros":1,"external_links":2,"defined_names":39,"comments":0,"pivot_tables":0},"unopened":[],"bounds":{"document_bytes":16777216,"sheet_cells":100000,"rows_first":2000,"rows_last":500,"rows_between":2000,"halvings":0,"cell_chars":16384,"cell_head_chars":4096},"cells_cut":0,"cells_raw":0,"read":"whole","date_system":"1900"}

{"sheet":"Nesma","index":0,"n_rows":107,"n_cols":14,"rows_kept":107,"cut":false,"hidden":false,"merged":[[1,6,1,8],[1,10,1,12]]}
[]
[null,null,null,null,null,null,"Installation",null,null,null,"Removal"]
["S/N Installed","P/N Installed","Discreption","A/C","Position","TLB","Date","TSN","CSN","Date","TSN","CSN","T.HRS","T.CYC"]
[45253,"C20195162","NOSE WHEEL #1",null,null,null,null,null,null,null,{"$f":"IFERROR(VLOOKUP(F4,'[2]AC TLB'!$A$7:$F$1199,5,1)-'[2]AC TLB'!$E$6+H4/24,\"\")","v":""},{"$f":"IFERROR(IF(OR(COUNT(A4=\"A9197\",A4=\"A8538\",A4=\"43815\",A4=\"43637\",A4=\"43236\",A4=\"43059\",A4=\"14138\",A4=\"17644\",A4=\"14216\")),VLOOKUP(F4,'[2]AC TLB'!$A$7:$F$1199,6,1)-'[2]AC TLB'!$F$6+I4,0),\"\")","v":""},{"$f":"K4-H4/24","v":{"$error":"#VALUE!"}},{"$f":"L4-I4","v":{"$error":"#VALUE!"}}]
[43059,"C20195162","NOSE WHEEL #1",null,null,null,null,null,null,null,{"$f":"IFERROR(VLOOKUP(F5,'[2]AC TLB'!$A$7:$F$1199,5,1)-'[2]AC TLB'!$E$6+H5/24,\"\")","v":""},{"$f":"IFERROR(IF(OR(COUNT(A5=\"A9197\",A5=\"A8538\",A5=\"43815\",A5=\"43637\",A5=\"43236\",A5=\"43059\",A5=\"14138\",A5=\"17644\",A5=\"14216\")),VLOOKUP(F5,'[2]AC TLB'!$A$7:$F$1199,6,1)-'[2]AC TLB'!$F$6+I5,0),\"\")","v":""},{"$error":"#VALUE!"},{"$error":"#VALUE!"}]
[43078,"C20195162","NOSE WHEEL #2",null,null,null,null,null,null,null,{"$f":"IFERROR(VLOOKUP(F6,'[2]AC TLB'!$A$7:$F$1199,5,1)-'[2]AC TLB'!$E$6+H6/24,\"\")","v":""},{"$f":"IFERROR(IF(OR(COUNT(A6=\"A9197\",A6=\"A8538\",A6=\"43815\",A6=\"43637\",A6=\"43236\",A6=\"43059\",A6=\"14138\",A6=\"17644\",A6=\"14216\")),VLOOKUP(F6,'[2]AC TLB'!$A$7:$F$1199,6,1)-'[2]AC TLB'!$F$6+I6,0),\"\")","v":""},{"$error":"#VALUE!"},{"$error":"#VALUE!"}]
[55385,"C20195162","LOGO LT R.H.S",null,null,null,null,null,null,null,{"$f":"IFERROR(VLOOKUP(F7,'[2]AC TLB'!$A$7:$F$1199,5,1)-'[2]AC TLB'!$E$6+H7/24,\"\")","v":""},{"$f":"IFERROR(IF(OR(COUNT(A7=\"A9197\",A7=\"A8538\",A7=\"43815\",A7=\"43637\",A7=\"43236\",A7=\"43059\",A7=\"14138\",A7=\"17644\",A7=\"14216\")),VLOOKUP(F7,'[2]AC TLB'!$A$7:$F$1199,6,1)-'[2]AC TLB'!$F$6+I7,0),\"\")","v":""},{"$error":"#VALUE!"},{"$error":"#VALUE!"}]
["28787","C20195162","TAKE OFF LT",null,null,null,null,null,null,null,{"$f":"IFERROR(VLOOKUP(F8,'[2]AC TLB'!$A$7:$F$1199,5,1)-'[2]AC TLB'!$E$6+H8/24,\"\")","v":""},{"$f":"IFERROR(IF(OR(COUNT(A8=\"A9197\",A8=\"A8538\",A8=\"43815\",A8=\"43637\",A8=\"43236\",A8=\"43059\",A8=\"14138\",A8=\"17644\",A8=\"14216\")),VLOOKUP(F8,'[2]AC TLB'!$A$7:$F$1199,6,1)-'[2]AC TLB'!$F$6+I8,0),\"\")","v":""},{"$error":"#VALUE!"},{"$error":"#VALUE!"}]
["44998","C20195162","TURN OFF LAMP L.H.S",null,null,null,null,null,null,null,{"$f":"IFERROR(VLOOKUP(F9,'[2]AC TLB'!$A$7:$F$1199,5,1)-'[2]AC TLB'!$E$6+H9/24,\"\")","v":""},{"$f":"IFERROR(IF(OR(COUNT(A9=\"A9197\",A9=\"A8538\",A9=\"43815\",A9=\"43637\",A9=\"43236\",A9=\"43059\",A9=\"14138\",A9=\"17644\",A9=\"14216\")),VLOOKUP(F9,'[2]AC TLB'!$A$7:$F$1199,6,1)-'[2]AC TLB'!$F$6+I9,0),\"\")","v":""},{"$error":"#VALUE!"},{"$error":"#VALUE!"}]
["32381","C20195162","DMC #3",null,null,null,null,null,null,null,{"$f":"IFERROR(VLOOKUP(F10,'[2]AC TLB'!$A$7:$F$1199,5,1)-'[2]AC TLB'!$E$6+H10/24,\"\")","v":""},{"$f":"IFERROR(IF(OR(COUNT(A10=\"A9197\",A10=\"A8538\",A10=\"43815\",A10=\"43637\",A10=\"43236\",A10=\"43059\",A10=\"14138\",A10=\"17644\",A10=\"14216\")),VLOOKUP(F10,'[2]AC TLB'!$A$7:$F$1199,6,1)-'[2]AC TLB'!$F$6+I10,0),\"\")","v":""},{"$error":"#VALUE!"},{"$error":"#VALUE!"}]
["27448","C20195162","MAIN WHEEL #4",null,null,null,null,null,null,null,{"$f":"IFERROR(VLOOKUP(F11,'[2]AC TLB'!$A$7:$F$1199,5,1)-'[2]AC TLB'!$E$6+H11/24,\"\")","v":""},{"$f":"IFERROR(IF(OR(COUNT(A11=\"A9197\",A11=\"A8538\",A11=\"43815\",A11=\"43637\",A11=\"43236\",A11=\"43059\",A11=\"14138\",A11=\"17644\",A11=\"14216\")),VLOOKUP(F11,'[2]AC TLB'!$A$7:$F$1199,6,1)-'[2]AC TLB'!$F$6+I11,0),\"\")","v":""},{"$error":"#VALUE!"},{"$error":"#VALUE!"}]
["49303","C20195162","MAIN WHEEL #2",null,null,null,null,null,null,null,{"$f":"IFERROR(VLOOKUP(F12,'[2]AC TLB'!$A$7:$F$1199,5,1)-'[2]AC TLB'!$E$6+H12/24,\"\")","v":""},{"$f":"IFERROR(IF(OR(COUNT(A12=\"A9197\",A12=\"A8538\",A12=\"43815\",A12=\"43637\",A12=\"43236\",A12=\"43059\",A12=\"14138\",A12=\"17644\",A12=\"14216\")),VLOOKUP(F12,'[2]AC TLB'!$A$7:$F$1199,6,1)-'[2]AC TLB'!$F$6+I12,0),\"\")","v":""},{"$error":"#VALUE!"},{"$error":"#VALUE!"}]
["55386","C20195162","LANDING LT R.H.S",null,null,null,null,null,null,null,{"$f":"IFERROR(VLOOKUP(F13,'[2]AC TLB'!$A$7:$F$1199,5,1)-'[2]AC TLB'!$E$6+H13/24,\"\")","v":""},{"$f":"IFERROR(IF(OR(COUNT(A13=\"A9197\",A13=\"A8538\",A13=\"43815\",A13=\"43637\",A13=\"43236\",A13=\"43059\",A13=\"14138\",A13=\"17644\",A13=\"14216\")),VLOOKUP(F13,'[2]AC TLB'!$A$7:$F$1199,6,1)-'[2]AC TLB'!$F$6+I13,0),\"\")","v":""},{"$error":"#VALUE!"},{"$error":"#VALUE!"}]
["43239","C20195162","NOSE WHEEL #2",null,null,null,null,null,null,null,{"$f":"IFERROR(VLOOKUP(F14,'[2]AC TLB'!$A$7:$F$1199,5,1)-'[2]AC TLB'!$E$6+H14/24,\"\")","v":""},{"$f":"IFERROR(IF(OR(COUNT(A14=\"A9197\",A14=\"A8538\",A14=\"43815\",A14=\"43637\",A14=\"43236\",A14=\"43059\",A14=\"14138\",A14=\"17644\",A14=\"14216\")),VLOOKUP(F14,'[2]AC TLB'!$A$7:$F$1199,6,1)-'[2]AC TLB'!$F$6+I14,0),\"\")","v":""},{"$f":"K14-H14/24","v":{"$error":"#VALUE!"}},{"$f":"L14-I14","v":{"$error":"#VALUE!"}}]
["43236","C20195162","RECI FAN",null,null,null,null,null,null,null,{"$f":"IFERROR(VLOOKUP(F15,'[2]AC TLB'!$A$7:$F$1199,5,1)-'[2]AC TLB'!$E$6+H15/24,\"\")","v":""},{"$f":"IFERROR(IF(OR(COUNT(A15=\"A9197\",A15=\"A8538\",A15=\"43815\",A15=\"43637\",A15=\"43236\",A15=\"43059\",A15=\"14138\",A15=\"17644\",A15=\"14216\")),VLOOKUP(F15,'[2]AC TLB'!$A$7:$F$1199,6,1)-'[2]AC TLB'!$F$6+I15,0),\"\")","v":""},{"$error":"#VALUE!"},{"$error":"#VALUE!"}]
["43509","C20195162","FLGX HOSE ASSY.",null,null,null,null,null,null,null,{"$f":"IFERROR(VLOOKUP(F16,'[2]AC TLB'!$A$7:$F$1199,5,1)-'[2]AC TLB'!$E$6+H16/24,\"\")","v":""},{"$f":"IFERROR(IF(OR(COUNT(A16=\"A9197\",A16=\"A8538\",A16=\"43815\",A16=\"43637\",A16=\"43236\",A16=\"43059\",A16=\"14138\",A16=\"17644\",A16=\"14216\")),VLOOKUP(F16,'[2]AC TLB'!$A$7:$F$1199,6,1)-'[2]AC TLB'!$F$6+I16,0),\"\")","v":""},{"$error":"#VALUE!"},{"$error":"#VALUE!"}]
["46961","C20195162","FUEL PUMP CENTER TANK #1",null,null,null,null,null,null,null,{"$f":"IFERROR(VLOOKUP(F17,'[2]AC TLB'!$A$7:$F$1199,5,1)-'[2]AC TLB'!$E$6+H17/24,\"\")","v":""},{"$f":"IFERROR(IF(OR(COUNT(A17=\"A9197\",A17=\"A8538\",A17=\"43815\",A17=\"43637\",A17=\"43236\",A17=\"43059\",A17=\"14138\",A17=\"17644\",A17=\"14216\")),VLOOKUP(F17,'[2]AC TLB'!$A$7:$F$1199,6,1)-'[2]AC TLB'!$F$6+I17,0),\"\")","v":""},{"$error":"#VALUE!"},{"$error":"#VALUE!"}]
["48901","C20195162","NOSE WHEEL #2",null,null,null,null,null,null,null,{"$f":"IFERROR(VLOOKUP(F18,'[2]AC TLB'!$A$7:$F$1199,5,1)-'[2]AC TLB'!$E$6+H18/24,\"\")","v":""},{"$f":"IFERROR(IF(OR(COUNT(A18=\"A9197\",A18=\"A8538\",A18=\"43815\",A18=\"43637\",A18=\"43236\",A18=\"43059\",A18=\"14138\",A18=\"17644\",A18=\"14216\")),VLOOKUP(F18,'[2]AC TLB'!$A$7:$F$1199,6,1)-'[2]AC TLB'!$F$6+I18,0),\"\")","v":""},{"$error":"#VALUE!"},{"$error":"#VALUE!"}]
["A9197","3-1531-3","FLSCU #2",null,null,null,null,null,null,null,{"$f":"IFERROR(VLOOKUP(F19,'[2]AC TLB'!$A$7:$F$1199,5,1)-'[2]AC TLB'!$E$6+H19/24,\"\")","v":""},{"$f":"IFERROR(IF(OR(COUNT(A19=\"A9197\",A19=\"A8538\",A19=\"43815\",A19=\"43637\",A19=\"43236\",A19=\"43059\",A19=\"14138\",A19=\"17644\",A19=\"14216\")),VLOOKUP(F19,'[2]AC TLB'!$A$7:$F$1199,6,1)-'[2]AC TLB'!$F$6+I19,0),\"\")","v":""},{"$error":"#VALUE!"},{"$error":"#VALUE!"}]
["A9195","3-1531-3","MAIN WHEEL #1",null,null,null,null,null,null,null,{"$f":"IFERROR(VLOOKUP(F20,'[2]AC TLB'!$A$7:$F$1199,5,1)-'[2]AC TLB'!$E$6+H20/24,\"\")","v":""},{"$f":"IFERROR(IF(OR(COUNT(A20=\"A9197\",A20=\"A8538\",A20=\"43815\",A20=\"43637\",A20=\"43236\",A20=\"43059\",A20=\"14138\",A20=\"17644\",A20=\"14216\")),VLOOKUP(F20,'[2]AC TLB'!$A$7:$F$1199,6,1)-'[2]AC TLB'!$F$6+I20,0),\"\")","v":""},{"$error":"#VALUE!"},{"$error":"#VALUE!"}]
{"$rows_left_out":88}
{"sheet":"Wheels","index":1,"n_rows":103,"n_cols":9,"rows_kept":103,"cut":false,"hidden":false,"merged":[[1,0,1,2],[1,3,1,4],[1,5,1,8]]}
[]
["MAIN WHEELS",null,null,"عدد التكرار",null,"الحصر"]
["No","S/N-Number","P/N-Number","S/N-Number","P/N-Number","S/N-Number","الإجمالي","P/N-Number","الإجمالي"]
[1,"45253","C20195162",{"$f":"COUNTIF(Parts!$G$5:$G$200, Wheels!B4)","v":1},{"$f":"COUNTIF(Parts!$F$5:$F$200, Wheels!C4)","v":15},{"$f":"IFERROR(IF(B4<>\"\",INDEX($B$4:$B$110,MATCH(0,COUNTIF($F3:F$3,$B$4:$B$110),0)),\"\"),\"\")","v":"45253"},{"$f":"IF(F4=\"\",\"\",SUMPRODUCT(--($B$4:$B$110=F4),$D$4:$D$110))","v":1},{"$f":"IFERROR(IF(C4<>\"\",INDEX($C$4:$C$110,MATCH(0,COUNTIF($H3:H$3,$C$4:$C$110),0)),\"\"),\"\")","v":"C20195162"},{"$f":"IF(H4=\"\",\"\",SUMPRODUCT(--($C$4:$C$110=H4),$E$4:$E$110))","v":225}]
[2,"43059","C20195162",{"$f":"COUNTIF(Parts!$G$5:$G$200, Wheels!B5)","v":1},{"$f":"COUNTIF(Parts!$F$5:$F$200, Wheels!C5)","v":15},{"$f":"IFERROR(IF(B5<>\"\",INDEX($B$4:$B$110,MATCH(0,COUNTIF($F$3:F4,$B$4:$B$110),0)),\"\"),\"\")","v":"43059"},{"$f":"IF(F5=\"\",\"\",SUMPRODUCT(--($B$4:$B$110=F5),$D$4:$D$110))","v":1},{"$f":"IFERROR(IF(C5<>\"\",INDEX($C$4:$C$110,MATCH(0,COUNTIF($H$3:H4,$C$4:$C$110),0)),\"\"),\"\")","v":"3-1531-3"},{"$f":"IF(H5=\"\",\"\",SUMPRODUCT(--($C$4:$C$110=H5),$E$4:$E$110))","v":289}]
[3,"43078","C20195162",{"$f":"COUNTIF(Parts!$G$5:$G$200, Wheels!B6)","v":1},{"$f":"COUNTIF(Parts!$F$5:$F$200, Wheels!C6)","v":15},{"$f":"IFERROR(IF(B6<>\"\",INDEX($B$4:$B$110,MATCH(0,COUNTIF($F$3:F5,$B$4:$B$110),0)),\"\"),\"\")","v":"43078"},{"$f":"IF(F6=\"\",\"\",SUMPRODUCT(--($B$4:$B$110=F6),$D$4:$D$110))","v":1},{"$f":"IFERROR(IF(C6<>\"\",INDEX($C$4:$C$110,MATCH(0,COUNTIF($H$3:H5,$C$4:$C$110),0)),\"\"),\"\")","v":"3-1531-4"},{"$f":"IF(H6=\"\",\"\",SUMPRODUCT(--($C$4:$C$110=H6),$E$4:$E$110))","v":1}]
[4,"55385","C20195162",{"$f":"COUNTIF(Parts!$G$5:$G$200, Wheels!B7)","v":1},{"$f":"COUNTIF(Parts!$F$5:$F$200, Wheels!C7)","v":15},{"$f":"IFERROR(IF(B7<>\"\",INDEX($B$4:$B$110,MATCH(0,COUNTIF($F$3:F6,$B$4:$B$110),0)),\"\"),\"\")","v":"55385"},{"$f":"IF(F7=\"\",\"\",SUMPRODUCT(--($B$4:$B$110=F7),$D$4:$D$110))","v":1},{"$f":"IFERROR(IF(C7<>\"\",INDEX($C$4:$C$110,MATCH(0,COUNTIF($H$3:H6,$C$4:$C$110),0)),\"\"),\"\")","v":"3-1531-5"},{"$f":"IF(H7=\"\",\"\",SUMPRODUCT(--($C$4:$C$110=H7),$E$4:$E$110))","v":1}]
[5,"28787","C20195162",{"$f":"COUNTIF(Parts!$G$5:$G$200, Wheels!B8)","v":1},{"$f":"COUNTIF(Parts!$F$5:$F$200, Wheels!C8)","v":15},{"$f":"IFERROR(IF(B8<>\"\",INDEX($B$4:$B$110,MATCH(0,COUNTIF($F$3:F7,$B$4:$B$110),0)),\"\"),\"\")","v":"28787"},{"$f":"IF(F8=\"\",\"\",SUMPRODUCT(--($B$4:$B$110=F8),$D$4:$D$110))","v":1},{"$f":"IFERROR(IF(C8<>\"\",INDEX($C$4:$C$110,MATCH(0,COUNTIF($H$3:H7,$C$4:$C$110),0)),\"\"),\"\")","v":0},{"$f":"IF(H8=\"\",\"\",SUMPRODUCT(--($C$4:$C$110=H8),$E$4:$E$110))","v":0}]
[6,"44998","C20195162",{"$f":"COUNTIF(Parts!$G$5:$G$200, Wheels!B9)","v":1},{"$f":"COUNTIF(Parts!$F$5:$F$200, Wheels!C9)","v":15},{"$f":"IFERROR(IF(B9<>\"\",INDEX($B$4:$B$110,MATCH(0,COUNTIF($F$3:F8,$B$4:$B$110),0)),\"\"),\"\")","v":"44998"},{"$f":"IF(F9=\"\",\"\",SUMPRODUCT(--($B$4:$B$110=F9),$D$4:$D$110))","v":1},{"$f":"IFERROR(IF(C9<>\"\",INDEX($C$4:$C$110,MATCH(0,COUNTIF($H$3:H8,$C$4:$C$110),0)),\"\"),\"\")","v":""},{"$f":"IF(H9=\"\",\"\",SUMPRODUCT(--($C$4:$C$110=H9),$E$4:$E$110))","v":""}]
[7,"32381","C20195162",{"$f":"COUNTIF(Parts!$G$5:$G$200, Wheels!B10)","v":1},{"$f":"COUNTIF(Parts!$F$5:$F$200, Wheels!C10)","v":15},{"$f":"IFERROR(IF(B10<>\"\",INDEX($B$4:$B$110,MATCH(0,COUNTIF($F$3:F9,$B$4:$B$110),0)),\"\"),\"\")","v":"32381"},{"$f":"IF(F10=\"\",\"\",SUMPRODUCT(--($B$4:$B$110=F10),$D$4:$D$110))","v":1},{"$f":"IFERROR(IF(C10<>\"\",INDEX($C$4:$C$110,MATCH(0,COUNTIF($H$3:H9,$C$4:$C$110),0)),\"\"),\"\")","v":""},{"$f":"IF(H10=\"\",\"\",SUMPRODUCT(--($C$4:$C$110=H10),$E$4:$E$110))","v":""}]
[8,"27448","C20195162",{"$f":"COUNTIF(Parts!$G$5:$G$200, Wheels!B11)","v":1},{"$f":"COUNTIF(Parts!$F$5:$F$200, Wheels!C11)","v":15},{"$f":"IFERROR(IF(B11<>\"\",INDEX($B$4:$B$110,MATCH(0,COUNTIF($F$3:F10,$B$4:$B$110),0)),\"\"),\"\")","v":"27448"},{"$f":"IF(F11=\"\",\"\",SUMPRODUCT(--($B$4:$B$110=F11),$D$4:$D$110))","v":1},{"$f":"IFERROR(IF(C11<>\"\",INDEX($C$4:$C$110,MATCH(0,COUNTIF($H$3:H10,$C$4:$C$110),0)),\"\"),\"\")","v":""},{"$f":"IF(H11=\"\",\"\",SUMPRODUCT(--($C$4:$C$110=H11),$E$4:$E$110))","v":""}]
[9,"49303","C20195162",{"$f":"COUNTIF(Parts!$G$5:$G$200, Wheels!B12)","v":1},{"$f":"COUNTIF(Parts!$F$5:$F$200, Wheels!C12)","v":15},{"$f":"IFERROR(IF(B12<>\"\",INDEX($B$4:$B$110,MATCH(0,COUNTIF($F$3:F11,$B$4:$B$110),0)),\"\"),\"\")","v":"49303"},{"$f":"IF(F12=\"\",\"\",SUMPRODUCT(--($B$4:$B$110=F12),$D$4:$D$110))","v":1},{"$f":"IFERROR(IF(C12<>\"\",INDEX($C$4:$C$110,MATCH(0,COUNTIF($H$3:H11,$C$4:$C$110),0)),\"\"),\"\")","v":""},{"$f":"IF(H12=\"\",\"\",SUMPRODUCT(--($C$4:$C$110=H12),$E$4:$E$110))","v":""}]
[10,"55386","C20195162",{"$f":"COUNTIF(Parts!$G$5:$G$200, Wheels!B13)","v":1},{"$f":"COUNTIF(Parts!$F$5:$F$200, Wheels!C13)","v":15},{"$f":"IFERROR(IF(B13<>\"\",INDEX($B$4:$B$110,MATCH(0,COUNTIF($F$3:F12,$B$4:$B$110),0)),\"\"),\"\")","v":"55386"},{"$f":"IF(F13=\"\",\"\",SUMPRODUCT(--($B$4:$B$110=F13),$D$4:$D$110))","v":1},{"$f":"IFERROR(IF(C13<>\"\",INDEX($C$4:$C$110,MATCH(0,COUNTIF($H$3:H12,$C$4:$C$110),0)),\"\"),\"\")","v":""},{"$f":"IF(H13=\"\",\"\",SUMPRODUCT(--($C$4:$C$110=H13),$E$4:$E$110))","v":""}]
[11,"43239","C20195162",{"$f":"COUNTIF(Parts!$G$5:$G$200, Wheels!B14)","v":1},{"$f":"COUNTIF(Parts!$F$5:$F$200, Wheels!C14)","v":15},{"$f":"IFERROR(IF(B14<>\"\",INDEX($B$4:$B$110,MATCH(0,COUNTIF($F$3:F13,$B$4:$B$110),0)),\"\"),\"\")","v":"43239"},{"$f":"IF(F14=\"\",\"\",SUMPRODUCT(--($B$4:$B$110=F14),$D$4:$D$110))","v":1},{"$f":"IFERROR(IF(C14<>\"\",INDEX($C$4:$C$110,MATCH(0,COUNTIF($H$3:H13,$C$4:$C$110),0)),\"\"),\"\")","v":""},{"$f":"IF(H14=\"\",\"\",SUMPRODUCT(--($C$4:$C$110=H14),$E$4:$E$110))","v":""}]
[12,"43236","C20195162",{"$f":"COUNTIF(Parts!$G$5:$G$200, Wheels!B15)","v":1},{"$f":"COUNTIF(Parts!$F$5:$F$200, Wheels!C15)","v":15},{"$f":"IFERROR(IF(B15<>\"\",INDEX($B$4:$B$110,MATCH(0,COUNTIF($F$3:F14,$B$4:$B$110),0)),\"\"),\"\")","v":"43236"},{"$f":"IF(F15=\"\",\"\",SUMPRODUCT(--($B$4:$B$110=F15),$D$4:$D$110))","v":1},{"$f":"IFERROR(IF(C15<>\"\",INDEX($C$4:$C$110,MATCH(0,COUNTIF($H$3:H14,$C$4:$C$110),0)),\"\"),\"\")","v":""},{"$f":"IF(H15=\"\",\"\",SUMPRODUCT(--($C$4:$C$110=H15),$E$4:$E$110))","v":""}]
[13,"43509","C20195162",{"$f":"COUNTIF(Parts!$G$5:$G$200, Wheels!B16)","v":1},{"$f":"COUNTIF(Parts!$F$5:$F$200, Wheels!C16)","v":15},{"$f":"IFERROR(IF(B16<>\"\",INDEX($B$4:$B$110,MATCH(0,COUNTIF($F$3:F15,$B$4:$B$110),0)),\"\"),\"\")","v":"43509"},{"$f":"IF(F16=\"\",\"\",SUMPRODUCT(--($B$4:$B$110=F16),$D$4:$D$110))","v":1},{"$f":"IFERROR(IF(C16<>\"\",INDEX($C$4:$C$110,MATCH(0,COUNTIF($H$3:H15,$C$4:$C$110),0)),\"\"),\"\")","v":""},{"$f":"IF(H16=\"\",\"\",SUMPRODUCT(--($C$4:$C$110=H16),$E$4:$E$110))","v":""}]
[14,"46961","C20195162",{"$f":"COUNTIF(Parts!$G$5:$G$200, Wheels!B17)","v":1},{"$f":"COUNTIF(Parts!$F$5:$F$200, Wheels!C17)","v":15},{"$f":"IFERROR(IF(B17<>\"\",INDEX($B$4:$B$110,MATCH(0,COUNTIF($F$3:F16,$B$4:$B$110),0)),\"\"),\"\")","v":"46961"},{"$f":"IF(F17=\"\",\"\",SUMPRODUCT(--($B$4:$B$110=F17),$D$4:$D$110))","v":1},{"$f":"IFERROR(IF(C17<>\"\",INDEX($C$4:$C$110,MATCH(0,COUNTIF($H$3:H16,$C$4:$C$110),0)),\"\"),\"\")","v":""},{"$f":"IF(H17=\"\",\"\",SUMPRODUCT(--($C$4:$C$110=H17),$E$4:$E$110))","v":""}]
[15,"48901","C20195162",{"$f":"COUNTIF(Parts!$G$5:$G$200, Wheels!B18)","v":1},{"$f":"COUNTIF(Parts!$F$5:$F$200, Wheels!C18)","v":15},{"$f":"IFERROR(IF(B18<>\"\",INDEX($B$4:$B$110,MATCH(0,COUNTIF($F$3:F17,$B$4:$B$110),0)),\"\"),\"\")","v":"48901"},{"$f":"IF(F18=\"\",\"\",SUMPRODUCT(--($B$4:$B$110=F18),$D$4:$D$110))","v":1},{"$f":"IFERROR(IF(C18<>\"\",INDEX($C$4:$C$110,MATCH(0,COUNTIF($H$3:H17,$C$4:$C$110),0)),\"\"),\"\")","v":""},{"$f":"IF(H18=\"\",\"\",SUMPRODUCT(--($C$4:$C$110=H18),$E$4:$E$110))","v":""}]
[16,"A9197","3-1531-3",{"$f":"COUNTIF(Parts!$G$5:$G$200, Wheels!B19)","v":1},{"$f":"COUNTIF(Parts!$F$5:$F$200, Wheels!C19)","v":17},{"$f":"IFERROR(IF(B19<>\"\",INDEX($B$4:$B$110,MATCH(0,COUNTIF($F$3:F18,$B$4:$B$110),0)),\"\"),\"\")","v":"A9197"},{"$f":"IF(F19=\"\",\"\",SUMPRODUCT(--($B$4:$B$110=F19),$D$4:$D$110))","v":1},{"$f":"IFERROR(IF(C19<>\"\",INDEX($C$4:$C$110,MATCH(0,COUNTIF($H$3:H18,$C$4:$C$110),0)),\"\"),\"\")","v":""},{"$f":"IF(H19=\"\",\"\",SUMPRODUCT(--($C$4:$C$110=H19),$E$4:$E$110))","v":""}]
[17,"A9195","3-1531-3",{"$f":"COUNTIF(Parts!$G$5:$G$200, Wheels!B20)","v":1},{"$f":"COUNTIF(Parts!$F$5:$F$200, Wheels!C20)","v":17},{"$f":"IFERROR(IF(B20<>\"\",INDEX($B$4:$B$110,MATCH(0,COUNTIF($F$3:F19,$B$4:$B$110),0)),\"\"),\"\")","v":"A9195"},{"$f":"IF(F20=\"\",\"\",SUMPRODUCT(--($B$4:$B$110=F20),$D$4:$D$110))","v":1},{"$f":"IFERROR(IF(C20<>\"\",INDEX($C$4:$C$110,MATCH(0,COUNTIF($H$3:H19,$C$4:$C$110),0)),\"\"),\"\")","v":""},{"$f":"IF(H20=\"\",\"\",SUMPRODUCT(--($C$4:$C$110=H20),$E$4:$E$110))","v":""}]
{"$rows_left_out":84}
{"sheet":"Parts","index":2,"n_rows":716,"n_cols":10,"rows_kept":716,"cut":false,"hidden":false,"merged":[]}
[]
[null,null,null,null,"Aircraft Replacements Follow up"]
[]
["Item","ATA","Description","P/N Removed","S/N Removed","P/N Installed","S/N Installed","Date","T.L.B ","A/C TH"]
[1,32,"NOSE WHEEL #1","3-1531-3","A9197","C20195162","45253","2022-08-21","000249",{"$f":"IFERROR(VLOOKUP(I5,'[2]AC TLB'!$A$7:$E$1199,5,1),\"\")","v":1276.7701388888918}]
[2,32,"NOSE WHEEL #1","3-1531-3",6686,"C20195162","43059","2022-08-22","000252",{"$f":"IFERROR(VLOOKUP(I6,'[2]AC TLB'!$A$7:$E$1199,5,1),\"\")","v":1277.1833333333363}]
[3,32,"NOSE WHEEL #2","3-1531-3","A8538","C20195162","43078","2022-08-22","000252",{"$f":"IFERROR(VLOOKUP(I7,'[2]AC TLB'!$A$7:$E$1199,5,1),\"\")","v":1277.1833333333363}]
[4,33,"LOGO LT R.H.S","GE4626","N/A","C20195162","55385","2022-08-23","000263",{"$f":"IFERROR(VLOOKUP(I8,'[2]AC TLB'!$A$7:$E$1199,5,1),\"\")","v":1278.207638888892}]
[5,33,"TAKE OFF LT","GE4626","N/A","C20195162","28787","2022-08-24","000264",{"$f":"IFERROR(VLOOKUP(I9,'[2]AC TLB'!$A$7:$E$1199,5,1),\"\")","v":1278.207638888892}]
[6,33,"TURN OFF LAMP L.H.S","GE4626","N/A","C20195162","44998","2022-08-24","000264",{"$f":"IFERROR(VLOOKUP(I10,'[2]AC TLB'!$A$7:$E$1199,5,1),\"\")","v":1278.207638888892}]
[7,31,"DMC #3",1982660116,"198266013271","C20195162","32381","2022-08-24","000270",{"$f":"IFERROR(VLOOKUP(I11,'[2]AC TLB'!$A$7:$E$1199,5,1),\"\")","v":1278.6083333333365}]
[8,32,"MAIN WHEEL #4","C20195162",43050,"C20195162","27448","2022-08-24","000270",{"$f":"IFERROR(VLOOKUP(I12,'[2]AC TLB'!$A$7:$E$1199,5,1),\"\")","v":1278.6083333333365}]
[9,32,"MAIN WHEEL #2","C20195162",43078,"C20195162","49303","2022-09-02","000316",{"$f":"IFERROR(VLOOKUP(I13,'[2]AC TLB'!$A$7:$E$1199,5,1),\"\")","v":1283.1819444444479}]
[10,33,"LANDING LT R.H.S","Q1559X","N/A","C20195162","55386","2022-09-03","000321",{"$f":"IFERROR(VLOOKUP(I14,'[2]AC TLB'!$A$7:$E$1199,5,1),\"\")","v":1283.5736111111146}]
[11,32,"NOSE WHEEL #2","3-1531-3",6905,"C20195162","43239","2022-09-14","000383",{"$f":"IFERROR(VLOOKUP(I15,'[2]AC TLB'!$A$7:$E$1199,5,1),\"\")","v":1288.8152777777816}]
[12,21,"RECI FAN","VD3900-003",32012,"C20195162","43236","2022-09-15","000392",{"$f":"IFERROR(VLOOKUP(I16,'[2]AC TLB'!$A$7:$E$1199,5,1),\"\")","v":1289.4736111111149}]
[13,32,"FLGX HOSE ASSY.","AE718529-2","N/A","C20195162","43509","2022-09-19","000405",{"$f":"IFERROR(VLOOKUP(I17,'[2]AC TLB'!$A$7:$E$1199,5,1),\"\")","v":1290.6770833333374}]
[14,28,"FUEL PUMP CENTER TANK #1","568-1-27202-007",8211,"C20195162","46961","2022-09-21","000413",{"$f":"IFERROR(VLOOKUP(I18,'[2]AC TLB'!$A$7:$E$1199,5,1),\"\")","v":1291.4020833333375}]
[15,32,"NOSE WHEEL #2","3-1531-3",7091,"C20195162","48901","2022-09-21","000416",{"$f":"IFERROR(VLOOKUP(I19,'[2]AC TLB'!$A$7:$E$1199,5,1),\"\")","v":1291.5659722222263}]
[16,28,"FLSCU #2","30042-0601",1294,"3-1531-3","A9197","2022-09-24","000424",{"$f":"IFERROR(VLOOKUP(I20,'[2]AC TLB'!$A$7:$E$1199,5,1),\"\")","v":1292.3597222222261}]
{"$rows_left_out":696}