{"text_format":"1","workbook":"xlsx","n_sheets":3,"sheets":["Nesma","Wheels","Parts"],"not_rendered":{"charts":0,"images":1,"macros":1,"external_links":2,"defined_names":39,"comments":0,"pivot_tables":0},"unopened":[],"bounds":{"document_bytes":16777216,"sheet_cells":100000,"rows_first":2000,"rows_last":500,"rows_between":2000,"halvings":0,"cell_chars":16384,"cell_head_chars":4096},"cells_cut":0,"cells_raw":0,"read":"whole","date_system":"1900"}

{"sheet":"Nesma","index":0,"n_rows":107,"n_cols":14,"rows_kept":107,"cut":false,"hidden":false,"merged":[[1,6,1,8],[1,10,1,12]]}
[]
[null,null,null,null,null,null,"Installation",null,null,null,"Removal"]
["S/N Installed","P/N Installed","Discreption","A/C","Position","TLB","Date","TSN","CSN","Date","TSN","CSN","T.HRS","T.CYC"]
[45253,"C20195162","NOSE WHEEL #1",null,null,null,null,null,null,null,{"$f":"IFERROR(VLOOKUP(F4,'[2]AC TLB'!$A$7:$F$1199,5,1)-'[2]AC TLB'!$E$6+H4/24,\"\")","v":""},{"$f":"IFERROR(IF(OR(COUNT(A4=\"A9197\",A4=\"A8538\",A4=\"43815\",A4=\"43637\",A4=\"43236\",A4=\"43059\",A4=\"14138\",A4=\"17644\",A4=\"14216\")),VLOOKUP(F4,'[2]AC TLB'!$A$7:$F$1199,6,1)-'[2]AC TLB'!$F$6+I4,0),\"\")","v":""},{"$f":"K4-H4/24","v":{"$error":"#VALUE!"}},{"$f":"L4-I4","v":{"$error":"#VALUE!"}}]
[43059,"C20195162","NOSE WHEEL #1",null,null,null,null,null,null,null,{"$f":"IFERROR(VLOOKUP(F5,'[2]AC TLB'!$A$7:$F$1199,5,1)-'[2]AC TLB'!$E$6+H5/24,\"\")","v":""},{"$f":"IFERROR(IF(OR(COUNT(A5=\"A9197\",A5=\"A8538\",A5=\"43815\",A5=\"43637\",A5=\"43236\",A5=\"43059\",A5=\"14138\",A5=\"17644\",A5=\"14216\")),VLOOKUP(F5,'[2]AC TLB'!$A$7:$F$1199,6,1)-'[2]AC TLB'!$F$6+I5,0),\"\")","v":""},{"$error":"#VALUE!"},{"$error":"#VALUE!"}]
[43078,"C20195162","NOSE WHEEL #2",null,null,null,null,null,null,null,{"$f":"IFERROR(VLOOKUP(F6,'[2]AC TLB'!$A$7:$F$1199,5,1)-'[2]AC TLB'!$E$6+H6/24,\"\")","v":""},{"$f":"IFERROR(IF(OR(COUNT(A6=\"A9197\",A6=\"A8538\",A6=\"43815\",A6=\"43637\",A6=\"43236\",A6=\"43059\",A6=\"14138\",A6=\"17644\",A6=\"14216\")),VLOOKUP(F6,'[2]AC TLB'!$A$7:$F$1199,6,1)-'[2]AC TLB'!$F$6+I6,0),\"\")","v":""},{"$error":"#VALUE!"},{"$error":"#VALUE!"}]
[55385,"C20195162","LOGO LT R.H.S",null,null,null,null,null,null,null,{"$f":"IFERROR(VLOOKUP(F7,'[2]AC TLB'!$A$7:$F$1199,5,1)-'[2]AC TLB'!$E$6+H7/24,\"\")","v":""},{"$f":"IFERROR(IF(OR(COUNT(A7=\"A9197\",A7=\"A8538\",A7=\"43815\",A7=\"43637\",A7=\"43236\",A7=\"43059\",A7=\"14138\",A7=\"17644\",A7=\"14216\")),VLOOKUP(F7,'[2]AC TLB'!$A$7:$F$1199,6,1)-'[2]AC TLB'!$F$6+I7,0),\"\")","v":""},{"$error":"#VALUE!"},{"$error":"#VALUE!"}]
["28787","C20195162","TAKE OFF LT",null,null,null,null,null,null,null,{"$f":"IFERROR(VLOOKUP(F8,'[2]AC TLB'!$A$7:$F$1199,5,1)-'[2]AC TLB'!$E$6+H8/24,\"\")","v":""},{"$f":"IFERROR(IF(OR(COUNT(A8=\"A9197\",A8=\"A8538\",A8=\"43815\",A8=\"43637\",A8=\"43236\",A8=\"43059\",A8=\"14138\",A8=\"17644\",A8=\"14216\")),VLOOKUP(F8,'[2]AC TLB'!$A$7:$F$1199,6,1)-'[2]AC TLB'!$F$6+I8,0),\"\")","v":""},{"$error":"#VALUE!"},{"$error":"#VALUE!"}]
["44998","C20195162","TURN OFF LAMP L.H.S",null,null,null,null,null,null,null,{"$f":"IFERROR(VLOOKUP(F9,'[2]AC TLB'!$A$7:$F$1199,5,1)-'[2]AC TLB'!$E$6+H9/24,\"\")","v":""},{"$f":"IFERROR(IF(OR(COUNT(A9=\"A9197\",A9=\"A8538\",A9=\"43815\",A9=\"43637\",A9=\"43236\",A9=\"43059\",A9=\"14138\",A9=\"17644\",A9=\"14216\")),VLOOKUP(F9,'[2]AC TLB'!$A$7:$F$1199,6,1)-'[2]AC TLB'!$F$6+I9,0),\"\")","v":""},{"$error":"#VALUE!"},{"$error":"#VALUE!"}]
["32381","C20195162","DMC #3",null,null,null,null,null,null,null,{"$f":"IFERROR(VLOOKUP(F10,'[2]AC TLB'!$A$7:$F$1199,5,1)-'[2]AC TLB'!$E$6+H10/24,\"\")","v":""},{"$f":"IFERROR(IF(OR(COUNT(A10=\"A9197\",A10=\"A8538\",A10=\"43815\",A10=\"43637\",A10=\"43236\",A10=\"43059\",A10=\"14138\",A10=\"17644\",A10=\"14216\")),VLOOKUP(F10,'[2]AC TLB'!$A$7:$F$1199,6,1)-'[2]AC TLB'!$F$6+I10,0),\"\")","v":""},{"$error":"#VALUE!"},{"$error":"#VALUE!"}]
["27448","C20195162","MAIN WHEEL #4",null,null,null,null,null,null,null,{"$f":"IFERROR(VLOOKUP(F11,'[2]AC TLB'!$A$7:$F$1199,5,1)-'[2]AC TLB'!$E$6+H11/24,\"\")","v":""},{"$f":"IFERROR(IF(OR(COUNT(A11=\"A9197\",A11=\"A8538\",A11=\"43815\",A11=\"43637\",A11=\"43236\",A11=\"43059\",A11=\"14138\",A11=\"17644\",A11=\"14216\")),VLOOKUP(F11,'[2]AC TLB'!$A$7:$F$1199,6,1)-'[2]AC TLB'!$F$6+I11,0),\"\")","v":""},{"$error":"#VALUE!"},{"$error":"#VALUE!"}]
["49303","C20195162","MAIN WHEEL #2",null,null,null,null,null,null,null,{"$f":"IFERROR(VLOOKUP(F12,'[2]AC TLB'!$A$7:$F$1199,5,1)-'[2]AC TLB'!$E$6+H12/24,\"\")","v":""},{"$f":"IFERROR(IF(OR(COUNT(A12=\"A9197\",A12=\"A8538\",A12=\"43815\",A12=\"43637\",A12=\"43236\",A12=\"43059\",A12=\"14138\",A12=\"17644\",A12=\"14216\")),VLOOKUP(F12,'[2]AC TLB'!$A$7:$F$1199,6,1)-'[2]AC TLB'!$F$6+I12,0),\"\")","v":""},{"$error":"#VALUE!"},{"$error":"#VALUE!"}]
["55386","C20195162","LANDING LT R.H.S",null,null,null,null,null,null,null,{"$f":"IFERROR(VLOOKUP(F13,'[2]AC TLB'!$A$7:$F$1199,5,1)-'[2]AC TLB'!$E$6+H13/24,\"\")","v":""},{"$f":"IFERROR(IF(OR(COUNT(A13=\"A9197\",A13=\"A8538\",A13=\"43815\",A13=\"43637\",A13=\"43236\",A13=\"43059\",A13=\"14138\",A13=\"17644\",A13=\"14216\")),VLOOKUP(F13,'[2]AC TLB'!$A$7:$F$1199,6,1)-'[2]AC TLB'!$F$6+I13,0),\"\")","v":""},{"$error":"#VALUE!"},{"$error":"#VALUE!"}]
["43239","C20195162","NOSE WHEEL #2",null,null,null,null,null,null,null,{"$f":"IFERROR(VLOOKUP(F14,'[2]AC TLB'!$A$7:$F$1199,5,1)-'[2]AC TLB'!$E$6+H14/24,\"\")","v":""},{"$f":"IFERROR(IF(OR(COUNT(A14=\"A9197\",A14=\"A8538\",A14=\"43815\",A14=\"43637\",A14=\"43236\",A14=\"43059\",A14=\"14138\",A14=\"17644\",A14=\"14216\")),VLOOKUP(F14,'[2]AC TLB'!$A$7:$F$1199,6,1)-'[2]AC TLB'!$F$6+I14,0),\"\")","v":""},{"$f":"K14-H14/24","v":{"$error":"#VALUE!"}},{"$f":"L14-I14","v":{"$error":"#VALUE!"}}]
["43236","C20195162","RECI FAN",null,null,null,null,null,null,null,{"$f":"IFERROR(VLOOKUP(F15,'[2]AC TLB'!$A$7:$F$1199,5,1)-'[2]AC TLB'!$E$6+H15/24,\"\")","v":""},{"$f":"IFERROR(IF(OR(COUNT(A15=\"A9197\",A15=\"A8538\",A15=\"43815\",A15=\"43637\",A15=\"43236\",A15=\"43059\",A15=\"14138\",A15=\"17644\",A15=\"14216\")),VLOOKUP(F15,'[2]AC TLB'!$A$7:$F$1199,6,1)-'[2]AC TLB'!$F$6+I15,0),\"\")","v":""},{"$error":"#VALUE!"},{"$error":"#VALUE!"}]
["43509","C20195162","FLGX HOSE ASSY.",null,null,null,null,null,null,null,{"$f":"IFERROR(VLOOKUP(F16,'[2]AC TLB'!$A$7:$F$1199,5,1)-'[2]AC TLB'!$E$6+H16/24,\"\")","v":""},{"$f":"IFERROR(IF(OR(COUNT(A16=\"A9197\",A16=\"A8538\",A16=\"43815\",A16=\"43637\",A16=\"43236\",A16=\"43059\",A16=\"14138\",A16=\"17644\",A16=\"14216\")),VLOOKUP(F16,'[2]AC TLB'!$A$7:$F$1199,6,1)-'[2]AC TLB'!$F$6+I16,0),\"\")","v":""},{"$error":"#VALUE!"},{"$error":"#VALUE!"}]
["46961","C20195162","FUEL PUMP CENTER TANK #1",null,null,null,null,null,null,null,{"$f":"IFERROR(VLOOKUP(F17,'[2]AC TLB'!$A$7:$F$1199,5,1)-'[2]AC TLB'!$E$6+H17/24,\"\")","v":""},{"$f":"IFERROR(IF(OR(COUNT(A17=\"A9197\",A17=\"A8538\",A17=\"43815\",A17=\"43637\",A17=\"43236\",A17=\"43059\",A17=\"14138\",A17=\"17644\",A17=\"14216\")),VLOOKUP(F17,'[2]AC TLB'!$A$7:$F$1199,6,1)-'[2]AC TLB'!$F$6+I17,0),\"\")","v":""},{"$error":"#VALUE!"},{"$error":"#VALUE!"}]
["48901","C20195162","NOSE WHEEL #2",null,null,null,null,null,null,null,{"$f":"IFERROR(VLOOKUP(F18,'[2]AC TLB'!$A$7:$F$1199,5,1)-'[2]AC TLB'!$E$6+H18/24,\"\")","v":""},{"$f":"IFERROR(IF(OR(COUNT(A18=\"A9197\",A18=\"A8538\",A18=\"43815\",A18=\"43637\",A18=\"43236\",A18=\"43059\",A18=\"14138\",A18=\"17644\",A18=\"14216\")),VLOOKUP(F18,'[2]AC TLB'!$A$7:$F$1199,6,1)-'[2]AC TLB'!$F$6+I18,0),\"\")","v":""},{"$error":"#VALUE!"},{"$error":"#VALUE!"}]
["A9197","3-1531-3","FLSCU #2",null,null,null,null,null,null,null,{"$f":"IFERROR(VLOOKUP(F19,'[2]AC TLB'!$A$7:$F$1199,5,1)-'[2]AC TLB'!$E$6+H19/24,\"\")","v":""},{"$f":"IFERROR(IF(OR(COUNT(A19=\"A9197\",A19=\"A8538\",A19=\"43815\",A19=\"43637\",A19=\"43236\",A19=\"43059\",A19=\"14138\",A19=\"17644\",A19=\"14216\")),VLOOKUP(F19,'[2]AC TLB'!$A$7:$F$1199,6,1)-'[2]AC TLB'!$F$6+I19,0),\"\")","v":""},{"$error":"#VALUE!"},{"$error":"#VALUE!"}]
["A9195","3-1531-3","MAIN WHEEL #1",null,null,null,null,null,null,null,{"$f":"IFERROR(VLOOKUP(F20,'[2]AC TLB'!$A$7:$F$1199,5,1)-'[2]AC TLB'!$E$6+H20/24,\"\")","v":""},{"$f":"IFERROR(IF(OR(COUNT(A20=\"A9197\",A20=\"A8538\",A20=\"43815\",A20=\"43637\",A20=\"43236\",A20=\"43059\",A20=\"14138\",A20=\"17644\",A20=\"14216\")),VLOOKUP(F20,'[2]AC TLB'!$A$7:$F$1199,6,1)-'[2]AC TLB'!$F$6+I20,0),\"\")","v":""},{"$error":"#VALUE!"},{"$error":"#VALUE!"}]
["6905","3-1531-3","MAIN WHEEL #3",null,null,null,null,null,null,null,{"$f":"IFERROR(VLOOKUP(F21,'[2]AC TLB'!$A$7:$F$1199,5,1)-'[2]AC TLB'!$E$6+H21/24,\"\")","v":""},{"$f":"IFERROR(IF(OR(COUNT(A21=\"A9197\",A21=\"A8538\",A21=\"43815\",A21=\"43637\",A21=\"43236\",A21=\"43059\",A21=\"14138\",A21=\"17644\",A21=\"14216\")),VLOOKUP(F21,'[2]AC TLB'!$A$7:$F$1199,6,1)-'[2]AC TLB'!$F$6+I21,0),\"\")","v":""},{"$error":"#VALUE!"},{"$error":"#VALUE!"}]
[5426,"3-1531-3","MAIN WHEEL #3",null,null,null,null,null,null,null,{"$f":"IFERROR(VLOOKUP(F22,'[2]AC TLB'!$A$7:$F$1199,5,1)-'[2]AC TLB'!$E$6+H22/24,\"\")","v":""},{"$f":"IFERROR(IF(OR(COUNT(A22=\"A9197\",A22=\"A8538\",A22=\"43815\",A22=\"43637\",A22=\"43236\",A22=\"43059\",A22=\"14138\",A22=\"17644\",A22=\"14216\")),VLOOKUP(F22,'[2]AC TLB'!$A$7:$F$1199,6,1)-'[2]AC TLB'!$F$6+I22,0),\"\")","v":""},{"$error":"#VALUE!"},{"$error":"#VALUE!"}]
["A6656","3-1531-3","MAIN WHEEL #1",null,null,null,null,null,null,null,{"$f":"IFERROR(VLOOKUP(F23,'[2]AC TLB'!$A$7:$F$1199,5,1)-'[2]AC TLB'!$E$6+H23/24,\"\")","v":""},{"$f":"IFERROR(IF(OR(COUNT(A23=\"A9197\",A23=\"A8538\",A23=\"43815\",A23=\"43637\",A23=\"43236\",A23=\"43059\",A23=\"14138\",A23=\"17644\",A23=\"14216\")),VLOOKUP(F23,'[2]AC TLB'!$A$7:$F$1199,6,1)-'[2]AC TLB'!$F$6+I23,0),\"\")","v":""},{"$error":"#VALUE!"},{"$error":"#VALUE!"}]
["A7028","3-1531-3","MAIN WHEEL #1",null,null,null,null,null,null,null,{"$f":"IFERROR(VLOOKUP(F24,'[2]AC TLB'!$A$7:$F$1199,5,1)-'[2]AC TLB'!$E$6+H24/24,\"\")","v":""},{"$f":"IFERROR(IF(OR(COUNT(A24=\"A9197\",A24=\"A8538\",A24=\"43815\",A24=\"43637\",A24=\"43236\",A24=\"43059\",A24=\"14138\",A24=\"17644\",A24=\"14216\")),VLOOKUP(F24,'[2]AC TLB'!$A$7:$F$1199,6,1)-'[2]AC TLB'!$F$6+I24,0),\"\")","v":""},{"$error":"#VALUE!"},{"$error":"#VALUE!"}]
["A6241","3-1531-3","MAIN WHEEL #3",null,null,null,null,null,null,null,{"$f":"IFERROR(VLOOKUP(F25,'[2]AC TLB'!$A$7:$F$1199,5,1)-'[2]AC TLB'!$E$6+H25/24,\"\")","v":""},{"$f":"IFERROR(IF(OR(COUNT(A25=\"A9197\",A25=\"A8538\",A25=\"43815\",A25=\"43637\",A25=\"43236\",A25=\"43059\",A25=\"14138\",A25=\"17644\",A25=\"14216\")),VLOOKUP(F25,'[2]AC TLB'!$A$7:$F$1199,6,1)-'[2]AC TLB'!$F$6+I25,0),\"\")","v":""},{"$error":"#VALUE!"},{"$error":"#VALUE!"}]
["A2693","3-1531-3","MAIN WHEEL #4",null,null,null,null,null,null,null,{"$f":"IFERROR(VLOOKUP(F26,'[2]AC TLB'!$A$7:$F$1199,5,1)-'[2]AC TLB'!$E$6+H26/24,\"\")","v":""},{"$f":"IFERROR(IF(OR(COUNT(A26=\"A9197\",A26=\"A8538\",A26=\"43815\",A26=\"43637\",A26=\"43236\",A26=\"43059\",A26=\"14138\",A26=\"17644\",A26=\"14216\")),VLOOKUP(F26,'[2]AC TLB'!$A$7:$F$1199,6,1)-'[2]AC TLB'!$F$6+I26,0),\"\")","v":""},{"$error":"#VALUE!"},{"$error":"#VALUE!"}]
[4459,"3-1531-3","MAIN WHEEL #2",null,null,null,null,null,null,null,{"$f":"IFERROR(VLOOKUP(F27,'[2]AC TLB'!$A$7:$F$1199,5,1)-'[2]AC TLB'!$E$6+H27/24,\"\")","v":""},{"$f":"IFERROR(IF(OR(COUNT(A27=\"A9197\",A27=\"A8538\",A27=\"43815\",A27=\"43637\",A27=\"43236\",A27=\"43059\",A27=\"14138\",A27=\"17644\",A27=\"14216\")),VLOOKUP(F27,'[2]AC TLB'!$A$7:$F$1199,6,1)-'[2]AC TLB'!$F$6+I27,0),\"\")","v":""},{"$error":"#VALUE!"},{"$error":"#VALUE!"}]
["0086","3-1531-3","MAIN WHEEL #3",null,null,null,null,null,null,null,{"$f":"IFERROR(VLOOKUP(F28,'[2]AC TLB'!$A$7:$F$1199,5,1)-'[2]AC TLB'!$E$6+H28/24,\"\")","v":""},{"$f":"IFERROR(IF(OR(COUNT(A28=\"A9197\",A28=\"A8538\",A28=\"43815\",A28=\"43637\",A28=\"43236\",A28=\"43059\",A28=\"14138\",A28=\"17644\",A28=\"14216\")),VLOOKUP(F28,'[2]AC TLB'!$A$7:$F$1199,6,1)-'[2]AC TLB'!$F$6+I28,0),\"\")","v":""},{"$error":"#VALUE!"},{"$error":"#VALUE!"}]
["6901","3-1531-3","MAIN WHEEL #1",null,null,null,null,null,null,null,{"$f":"IFERROR(VLOOKUP(F29,'[2]AC TLB'!$A$7:$F$1199,5,1)-'[2]AC TLB'!$E$6+H29/24,\"\")","v":""},{"$f":"IFERROR(IF(OR(COUNT(A29=\"A9197\",A29=\"A8538\",A29=\"43815\",A29=\"43637\",A29=\"43236\",A29=\"43059\",A29=\"14138\",A29=\"17644\",A29=\"14216\")),VLOOKUP(F29,'[2]AC TLB'!$A$7:$F$1199,6,1)-'[2]AC TLB'!$F$6+I29,0),\"\")","v":""},{"$error":"#VALUE!"},{"$error":"#VALUE!"}]
["0389","3-1531-3","MAIN WHEEL #4",null,null,null,null,null,null,null,{"$f":"IFERROR(VLOOKUP(F30,'[2]AC TLB'!$A$7:$F$1199,5,1)-'[2]AC TLB'!$E$6+H30/24,\"\")","v":""},{"$f":"IFERROR(IF(OR(COUNT(A30=\"A9197\",A30=\"A8538\",A30=\"43815\",A30=\"43637\",A30=\"43236\",A30=\"43059\",A30=\"14138\",A30=\"17644\",A30=\"14216\")),VLOOKUP(F30,'[2]AC TLB'!$A$7:$F$1199,6,1)-'[2]AC TLB'!$F$6+I30,0),\"\")","v":""},{"$error":"#VALUE!"},{"$error":"#VALUE!"}]
["3023","3-1531-3","MAIN WHEEL #2",null,null,null,null,null,null,null,{"$f":"IFERROR(VLOOKUP(F31,'[2]AC TLB'!$A$7:$F$1199,5,1)-'[2]AC TLB'!$E$6+H31/24,\"\")","v":""},{"$f":"IFERROR(IF(OR(COUNT(A31=\"A9197\",A31=\"A8538\",A31=\"43815\",A31=\"43637\",A31=\"43236\",A31=\"43059\",A31=\"14138\",A31=\"17644\",A31=\"14216\")),VLOOKUP(F31,'[2]AC TLB'!$A$7:$F$1199,6,1)-'[2]AC TLB'!$F$6+I31,0),\"\")","v":""},{"$error":"#VALUE!"},{"$error":"#VALUE!"}]
["8538","3-1531-3","MAIN WHEEL #3",null,null,null,null,null,null,null,{"$f":"IFERROR(VLOOKUP(F32,'[2]AC TLB'!$A$7:$F$1199,5,1)-'[2]AC TLB'!$E$6+H32/24,\"\")","v":""},{"$f":"IFERROR(IF(OR(COUNT(A32=\"A9197\",A32=\"A8538\",A32=\"43815\",A32=\"43637\",A32=\"43236\",A32=\"43059\",A32=\"14138\",A32=\"17644\",A32=\"14216\")),VLOOKUP(F32,'[2]AC TLB'!$A$7:$F$1199,6,1)-'[2]AC TLB'!$F$6+I32,0),\"\")","v":""},{"$error":"#VALUE!"},{"$error":"#VALUE!"}]
["A4793","3-1531-3","MAIN WHEEL #1",null,null,null,null,null,null,null,{"$f":"IFERROR(VLOOKUP(F33,'[2]AC TLB'!$A$7:$F$1199,5,1)-'[2]AC TLB'!$E$6+H33/24,\"\")","v":""},{"$f":"IFERROR(IF(OR(COUNT(A33=\"A9197\",A33=\"A8538\",A33=\"43815\",A33=\"43637\",A33=\"43236\",A33=\"43059\",A33=\"14138\",A33=\"17644\",A33=\"14216\")),VLOOKUP(F33,'[2]AC TLB'!$A$7:$F$1199,6,1)-'[2]AC TLB'!$F$6+I33,0),\"\")","v":""},{"$error":"#VALUE!"},{"$error":"#VALUE!"}]
["7091","3-1531-3","MAIN WHEEL #1",null,null,null,null,null,null,null,{"$f":"IFERROR(VLOOKUP(F34,'[2]AC TLB'!$A$7:$F$1199,5,1)-'[2]AC TLB'!$E$6+H34/24,\"\")","v":""},{"$f":"IFERROR(IF(OR(COUNT(A34=\"A9197\",A34=\"A8538\",A34=\"43815\",A34=\"43637\",A34=\"43236\",A34=\"43059\",A34=\"14138\",A34=\"17644\",A34=\"14216\")),VLOOKUP(F34,'[2]AC TLB'!$A$7:$F$1199,6,1)-'[2]AC TLB'!$F$6+I34,0),\"\")","v":""},{"$error":"#VALUE!"},{"$error":"#VALUE!"}]
["9424","3-1531-3","MAIN WHEEL #1",null,null,null,null,null,null,null,{"$f":"IFERROR(VLOOKUP(F35,'[2]AC TLB'!$A$7:$F$1199,5,1)-'[2]AC TLB'!$E$6+H35/24,\"\")","v":""},{"$f":"IFERROR(IF(OR(COUNT(A35=\"A9197\",A35=\"A8538\",A35=\"43815\",A35=\"43637\",A35=\"43236\",A35=\"43059\",A35=\"14138\",A35=\"17644\",A35=\"14216\")),VLOOKUP(F35,'[2]AC TLB'!$A$7:$F$1199,6,1)-'[2]AC TLB'!$F$6+I35,0),\"\")","v":""},{"$error":"#VALUE!"},{"$error":"#VALUE!"}]
[500,"3-1531-4","MAIN WHEEL #4",null,null,null,null,null,null,null,{"$f":"IFERROR(VLOOKUP(F36,'[2]AC TLB'!$A$7:$F$1199,5,1)-'[2]AC TLB'!$E$6+H36/24,\"\")","v":""},{"$f":"IFERROR(IF(OR(COUNT(A36=\"A9197\",A36=\"A8538\",A36=\"43815\",A36=\"43637\",A36=\"43236\",A36=\"43059\",A36=\"14138\",A36=\"17644\",A36=\"14216\")),VLOOKUP(F36,'[2]AC TLB'!$A$7:$F$1199,6,1)-'[2]AC TLB'!$F$6+I36,0),\"\")","v":""},{"$error":"#VALUE!"},{"$error":"#VALUE!"}]
[900,"3-1531-5","MAIN WHEEL #2",null,null,null,null,null,null,null,{"$f":"IFERROR(VLOOKUP(F37,'[2]AC TLB'!$A$7:$F$1199,5,1)-'[2]AC TLB'!$E$6+H37/24,\"\")","v":""},{"$f":"IFERROR(IF(OR(COUNT(A37=\"A9197\",A37=\"A8538\",A37=\"43815\",A37=\"43637\",A37=\"43236\",A37=\"43059\",A37=\"14138\",A37=\"17644\",A37=\"14216\")),VLOOKUP(F37,'[2]AC TLB'!$A$7:$F$1199,6,1)-'[2]AC TLB'!$F$6+I37,0),\"\")","v":""},{"$error":"#VALUE!"},{"$error":"#VALUE!"}]
[5200,null,null,null,null,null,null,null,null,null,{"$f":"IFERROR(VLOOKUP(F38,'[2]AC TLB'!$A$7:$F$1199,5,1)-'[2]AC TLB'!$E$6+H38/24,\"\")","v":""},{"$f":"IFERROR(IF(OR(COUNT(A38=\"A9197\",A38=\"A8538\",A38=\"43815\",A38=\"43637\",A38=\"43236\",A38=\"43059\",A38=\"14138\",A38=\"17644\",A38=\"14216\")),VLOOKUP(F38,'[2]AC TLB'!$A$7:$F$1199,6,1)-'[2]AC TLB'!$F$6+I38,0),\"\")","v":""},{"$error":"#VALUE!"},{"$error":"#VALUE!"}]
[null,null,null,null,null,null,null,null,null,null,{"$f":"IFERROR(VLOOKUP(F39,'[2]AC TLB'!$A$7:$F$1199,5,1)-'[2]AC TLB'!$E$6+H39/24,\"\")","v":""},{"$f":"IFERROR(IF(OR(COUNT(A39=\"A9197\",A39=\"A8538\",A39=\"43815\",A39=\"43637\",A39=\"43236\",A39=\"43059\",A39=\"14138\",A39=\"17644\",A39=\"14216\")),VLOOKUP(F39,'[2]AC TLB'!$A$7:$F$1199,6,1)-'[2]AC TLB'!$F$6+I39,0),\"\")","v":""},{"$error":"#VALUE!"},{"$error":"#VALUE!"}]
[null,null,null,null,null,null,null,null,null,null,{"$f":"IFERROR(VLOOKUP(F40,'[2]AC TLB'!$A$7:$F$1199,5,1)-'[2]AC TLB'!$E$6+H40/24,\"\")","v":""},{"$f":"IFERROR(IF(OR(COUNT(A40=\"A9197\",A40=\"A8538\",A40=\"43815\",A40=\"43637\",A40=\"43236\",A40=\"43059\",A40=\"14138\",A40=\"17644\",A40=\"14216\")),VLOOKUP(F40,'[2]AC TLB'!$A$7:$F$1199,6,1)-'[2]AC TLB'!$F$6+I40,0),\"\")","v":""},{"$error":"#VALUE!"},{"$error":"#VALUE!"}]
[null,null,null,null,null,null,null,null,null,null,{"$f":"IFERROR(VLOOKUP(F41,'[2]AC TLB'!$A$7:$F$1199,5,1)-'[2]AC TLB'!$E$6+H41/24,\"\")","v":""},{"$f":"IFERROR(IF(OR(COUNT(A41=\"A9197\",A41=\"A8538\",A41=\"43815\",A41=\"43637\",A41=\"43236\",A41=\"43059\",A41=\"14138\",A41=\"17644\",A41=\"14216\")),VLOOKUP(F41,'[2]AC TLB'!$A$7:$F$1199,6,1)-'[2]AC TLB'!$F$6+I41,0),\"\")","v":""},{"$error":"#VALUE!"},{"$error":"#VALUE!"}]
[null,null,null,null,null,null,null,null,null,null,{"$f":"IFERROR(VLOOKUP(F42,'[2]AC TLB'!$A$7:$F$1199,5,1)-'[2]AC TLB'!$E$6+H42/24,\"\")","v":""},{"$f":"IFERROR(IF(OR(COUNT(A42=\"A9197\",A42=\"A8538\",A42=\"43815\",A42=\"43637\",A42=\"43236\",A42=\"43059\",A42=\"14138\",A42=\"17644\",A42=\"14216\")),VLOOKUP(F42,'[2]AC TLB'!$A$7:$F$1199,6,1)-'[2]AC TLB'!$F$6+I42,0),\"\")","v":""},{"$error":"#VALUE!"},{"$error":"#VALUE!"}]
[null,null,null,null,null,null,null,null,null,null,{"$f":"IFERROR(VLOOKUP(F43,'[2]AC TLB'!$A$7:$F$1199,5,1)-'[2]AC TLB'!$E$6+H43/24,\"\")","v":""},{"$f":"IFERROR(IF(OR(COUNT(A43=\"A9197\",A43=\"A8538\",A43=\"43815\",A43=\"43637\",A43=\"43236\",A43=\"43059\",A43=\"14138\",A43=\"17644\",A43=\"14216\")),VLOOKUP(F43,'[2]AC TLB'!$A$7:$F$1199,6,1)-'[2]AC TLB'!$F$6+I43,0),\"\")","v":""},{"$error":"#VALUE!"},{"$error":"#VALUE!"}]
[null,null,null,null,null,null,null,null,null,null,{"$f":"IFERROR(VLOOKUP(F44,'[2]AC TLB'!$A$7:$F$1199,5,1)-'[2]AC TLB'!$E$6+H44/24,\"\")","v":""},{"$f":"IFERROR(IF(OR(COUNT(A44=\"A9197\",A44=\"A8538\",A44=\"43815\",A44=\"43637\",A44=\"43236\",A44=\"43059\",A44=\"14138\",A44=\"17644\",A44=\"14216\")),VLOOKUP(F44,'[2]AC TLB'!$A$7:$F$1199,6,1)-'[2]AC TLB'!$F$6+I44,0),\"\")","v":""},{"$error":"#VALUE!"},{"$error":"#VALUE!"}]
[null,null,null,null,null,null,null,null,null,null,{"$f":"IFERROR(VLOOKUP(F45,'[2]AC TLB'!$A$7:$F$1199,5,1)-'[2]AC TLB'!$E$6+H45/24,\"\")","v":""},{"$f":"IFERROR(IF(OR(COUNT(A45=\"A9197\",A45=\"A8538\",A45=\"43815\",A45=\"43637\",A45=\"43236\",A45=\"43059\",A45=\"14138\",A45=\"17644\",A45=\"14216\")),VLOOKUP(F45,'[2]AC TLB'!$A$7:$F$1199,6,1)-'[2]AC TLB'!$F$6+I45,0),\"\")","v":""},{"$error":"#VALUE!"},{"$error":"#VALUE!"}]
[null,null,null,null,null,null,null,null,null,null,{"$f":"IFERROR(VLOOKUP(F46,'[2]AC TLB'!$A$7:$F$1199,5,1)-'[2]AC TLB'!$E$6+H46/24,\"\")","v":""},{"$f":"IFERROR(IF(OR(COUNT(A46=\"A9197\",A46=\"A8538\",A46=\"43815\",A46=\"43637\",A46=\"43236\",A46=\"43059\",A46=\"14138\",A46=\"17644\",A46=\"14216\")),VLOOKUP(F46,'[2]AC TLB'!$A$7:$F$1199,6,1)-'[2]AC TLB'!$F$6+I46,0),\"\")","v":""},{"$error":"#VALUE!"},{"$error":"#VALUE!"}]
[null,null,null,null,null,null,null,null,null,null,{"$f":"IFERROR(VLOOKUP(F47,'[2]AC TLB'!$A$7:$F$1199,5,1)-'[2]AC TLB'!$E$6+H47/24,\"\")","v":""},{"$f":"IFERROR(IF(OR(COUNT(A47=\"A9197\",A47=\"A8538\",A47=\"43815\",A47=\"43637\",A47=\"43236\",A47=\"43059\",A47=\"14138\",A47=\"17644\",A47=\"14216\")),VLOOKUP(F47,'[2]AC TLB'!$A$7:$F$1199,6,1)-'[2]AC TLB'!$F$6+I47,0),\"\")","v":""},{"$error":"#VALUE!"},{"$error":"#VALUE!"}]
[null,null,null,null,null,null,null,null,null,null,{"$f":"IFERROR(VLOOKUP(F48,'[2]AC TLB'!$A$7:$F$1199,5,1)-'[2]AC TLB'!$E$6+H48/24,\"\")","v":""},{"$f":"IFERROR(IF(OR(COUNT(A48=\"A9197\",A48=\"A8538\",A48=\"43815\",A48=\"43637\",A48=\"43236\",A48=\"43059\",A48=\"14138\",A48=\"17644\",A48=\"14216\")),VLOOKUP(F48,'[2]AC TLB'!$A$7:$F$1199,6,1)-'[2]AC TLB'!$F$6+I48,0),\"\")","v":""},{"$error":"#VALUE!"},{"$error":"#VALUE!"}]
[null,null,null,null,null,null,null,null,null,null,{"$f":"IFERROR(VLOOKUP(F49,'[2]AC TLB'!$A$7:$F$1199,5,1)-'[2]AC TLB'!$E$6+H49/24,\"\")","v":""},{"$f":"IFERROR(IF(OR(COUNT(A49=\"A9197\",A49=\"A8538\",A49=\"43815\",A49=\"43637\",A49=\"43236\",A49=\"43059\",A49=\"14138\",A49=\"17644\",A49=\"14216\")),VLOOKUP(F49,'[2]AC TLB'!$A$7:$F$1199,6,1)-'[2]AC TLB'!$F$6+I49,0),\"\")","v":""},{"$error":"#VALUE!"},{"$error":"#VALUE!"}]
[null,null,null,null,null,null,null,null,null,null,{"$f":"IFERROR(VLOOKUP(F50,'[2]AC TLB'!$A$7:$F$1199,5,1)-'[2]AC TLB'!$E$6+H50/24,\"\")","v":""},{"$f":"IFERROR(IF(OR(COUNT(A50=\"A9197\",A50=\"A8538\",A50=\"43815\",A50=\"43637\",A50=\"43236\",A50=\"43059\",A50=\"14138\",A50=\"17644\",A50=\"14216\")),VLOOKUP(F50,'[2]AC TLB'!$A$7:$F$1199,6,1)-'[2]AC TLB'!$F$6+I50,0),\"\")","v":""},{"$error":"#VALUE!"},{"$error":"#VALUE!"}]
[null,null,null,null,null,null,null,null,null,null,{"$f":"IFERROR(VLOOKUP(F51,'[2]AC TLB'!$A$7:$F$1199,5,1)-'[2]AC TLB'!$E$6+H51/24,\"\")","v":""},{"$f":"IFERROR(IF(OR(COUNT(A51=\"A9197\",A51=\"A8538\",A51=\"43815\",A51=\"43637\",A51=\"43236\",A51=\"43059\",A51=\"14138\",A51=\"17644\",A51=\"14216\")),VLOOKUP(F51,'[2]AC TLB'!$A$7:$F$1199,6,1)-'[2]AC TLB'!$F$6+I51,0),\"\")","v":""},{"$error":"#VALUE!"},{"$error":"#VALUE!"}]
[null,null,null,null,null,null,null,null,null,null,{"$f":"IFERROR(VLOOKUP(F52,'[2]AC TLB'!$A$7:$F$1199,5,1)-'[2]AC TLB'!$E$6+H52/24,\"\")","v":""},{"$f":"IFERROR(IF(OR(COUNT(A52=\"A9197\",A52=\"A8538\",A52=\"43815\",A52=\"43637\",A52=\"43236\",A52=\"43059\",A52=\"14138\",A52=\"17644\",A52=\"14216\")),VLOOKUP(F52,'[2]AC TLB'!$A$7:$F$1199,6,1)-'[2]AC TLB'!$F$6+I52,0),\"\")","v":""},{"$error":"#VALUE!"},{"$error":"#VALUE!"}]
[null,null,null,null,null,null,null,null,null,null,{"$f":"IFERROR(VLOOKUP(F53,'[2]AC TLB'!$A$7:$F$1199,5,1)-'[2]AC TLB'!$E$6+H53/24,\"\")","v":""},{"$f":"IFERROR(IF(OR(COUNT(A53=\"A9197\",A53=\"A8538\",A53=\"43815\",A53=\"43637\",A53=\"43236\",A53=\"43059\",A53=\"14138\",A53=\"17644\",A53=\"14216\")),VLOOKUP(F53,'[2]AC TLB'!$A$7:$F$1199,6,1)-'[2]AC TLB'!$F$6+I53,0),\"\")","v":""},{"$error":"#VALUE!"},{"$error":"#VALUE!"}]
[null,null,null,null,null,null,null,null,null,null,{"$f":"IFERROR(VLOOKUP(F54,'[2]AC TLB'!$A$7:$F$1199,5,1)-'[2]AC TLB'!$E$6+H54/24,\"\")","v":""},{"$f":"IFERROR(IF(OR(COUNT(A54=\"A9197\",A54=\"A8538\",A54=\"43815\",A54=\"43637\",A54=\"43236\",A54=\"43059\",A54=\"14138\",A54=\"17644\",A54=\"14216\")),VLOOKUP(F54,'[2]AC TLB'!$A$7:$F$1199,6,1)-'[2]AC TLB'!$F$6+I54,0),\"\")","v":""},{"$error":"#VALUE!"},{"$error":"#VALUE!"}]
[null,null,null,null,null,null,null,null,null,null,{"$f":"IFERROR(VLOOKUP(F55,'[2]AC TLB'!$A$7:$F$1199,5,1)-'[2]AC TLB'!$E$6+H55/24,\"\")","v":""},{"$f":"IFERROR(IF(OR(COUNT(A55=\"A9197\",A55=\"A8538\",A55=\"43815\",A55=\"43637\",A55=\"43236\",A55=\"43059\",A55=\"14138\",A55=\"17644\",A55=\"14216\")),VLOOKUP(F55,'[2]AC TLB'!$A$7:$F$1199,6,1)-'[2]AC TLB'!$F$6+I55,0),\"\")","v":""},{"$error":"#VALUE!"},{"$error":"#VALUE!"}]
[null,null,null,null,null,null,null,null,null,null,{"$f":"IFERROR(VLOOKUP(F56,'[2]AC TLB'!$A$7:$F$1199,5,1)-'[2]AC TLB'!$E$6+H56/24,\"\")","v":""},{"$f":"IFERROR(IF(OR(COUNT(A56=\"A9197\",A56=\"A8538\",A56=\"43815\",A56=\"43637\",A56=\"43236\",A56=\"43059\",A56=\"14138\",A56=\"17644\",A56=\"14216\")),VLOOKUP(F56,'[2]AC TLB'!$A$7:$F$1199,6,1)-'[2]AC TLB'!$F$6+I56,0),\"\")","v":""},{"$error":"#VALUE!"},{"$error":"#VALUE!"}]
[null,null,null,null,null,null,null,null,null,null,{"$f":"IFERROR(VLOOKUP(F57,'[2]AC TLB'!$A$7:$F$1199,5,1)-'[2]AC TLB'!$E$6+H57/24,\"\")","v":""},{"$f":"IFERROR(IF(OR(COUNT(A57=\"A9197\",A57=\"A8538\",A57=\"43815\",A57=\"43637\",A57=\"43236\",A57=\"43059\",A57=\"14138\",A57=\"17644\",A57=\"14216\")),VLOOKUP(F57,'[2]AC TLB'!$A$7:$F$1199,6,1)-'[2]AC TLB'!$F$6+I57,0),\"\")","v":""},{"$error":"#VALUE!"},{"$error":"#VALUE!"}]
[null,null,null,null,null,null,null,null,null,null,{"$f":"IFERROR(VLOOKUP(F58,'[2]AC TLB'!$A$7:$F$1199,5,1)-'[2]AC TLB'!$E$6+H58/24,\"\")","v":""},{"$f":"IFERROR(IF(OR(COUNT(A58=\"A9197\",A58=\"A8538\",A58=\"43815\",A58=\"43637\",A58=\"43236\",A58=\"43059\",A58=\"14138\",A58=\"17644\",A58=\"14216\")),VLOOKUP(F58,'[2]AC TLB'!$A$7:$F$1199,6,1)-'[2]AC TLB'!$F$6+I58,0),\"\")","v":""},{"$error":"#VALUE!"},{"$error":"#VALUE!"}]
[null,null,null,null,null,null,null,null,null,null,{"$f":"IFERROR(VLOOKUP(F59,'[2]AC TLB'!$A$7:$F$1199,5,1)-'[2]AC TLB'!$E$6+H59/24,\"\")","v":""},{"$f":"IFERROR(IF(OR(COUNT(A59=\"A9197\",A59=\"A8538\",A59=\"43815\",A59=\"43637\",A59=\"43236\",A59=\"43059\",A59=\"14138\",A59=\"17644\",A59=\"14216\")),VLOOKUP(F59,'[2]AC TLB'!$A$7:$F$1199,6,1)-'[2]AC TLB'!$F$6+I59,0),\"\")","v":""},{"$error":"#VALUE!"},{"$error":"#VALUE!"}]
[null,null,null,null,null,null,null,null,null,null,{"$f":"IFERROR(VLOOKUP(F60,'[2]AC TLB'!$A$7:$F$1199,5,1)-'[2]AC TLB'!$E$6+H60/24,\"\")","v":""},{"$f":"IFERROR(IF(OR(COUNT(A60=\"A9197\",A60=\"A8538\",A60=\"43815\",A60=\"43637\",A60=\"43236\",A60=\"43059\",A60=\"14138\",A60=\"17644\",A60=\"14216\")),VLOOKUP(F60,'[2]AC TLB'!$A$7:$F$1199,6,1)-'[2]AC TLB'!$F$6+I60,0),\"\")","v":""},{"$error":"#VALUE!"},{"$error":"#VALUE!"}]
[null,null,null,null,null,null,null,null,null,null,{"$f":"IFERROR(VLOOKUP(F61,'[2]AC TLB'!$A$7:$F$1199,5,1)-'[2]AC TLB'!$E$6+H61/24,\"\")","v":""},{"$f":"IFERROR(IF(OR(COUNT(A61=\"A9197\",A61=\"A8538\",A61=\"43815\",A61=\"43637\",A61=\"43236\",A61=\"43059\",A61=\"14138\",A61=\"17644\",A61=\"14216\")),VLOOKUP(F61,'[2]AC TLB'!$A$7:$F$1199,6,1)-'[2]AC TLB'!$F$6+I61,0),\"\")","v":""},{"$error":"#VALUE!"},{"$error":"#VALUE!"}]
[null,null,null,null,null,null,null,null,null,null,{"$f":"IFERROR(VLOOKUP(F62,'[2]AC TLB'!$A$7:$F$1199,5,1)-'[2]AC TLB'!$E$6+H62/24,\"\")","v":""},{"$f":"IFERROR(IF(OR(COUNT(A62=\"A9197\",A62=\"A8538\",A62=\"43815\",A62=\"43637\",A62=\"43236\",A62=\"43059\",A62=\"14138\",A62=\"17644\",A62=\"14216\")),VLOOKUP(F62,'[2]AC TLB'!$A$7:$F$1199,6,1)-'[2]AC TLB'!$F$6+I62,0),\"\")","v":""},{"$error":"#VALUE!"},{"$error":"#VALUE!"}]
[null,null,null,null,null,null,null,null,null,null,{"$f":"IFERROR(VLOOKUP(F63,'[2]AC TLB'!$A$7:$F$1199,5,1)-'[2]AC TLB'!$E$6+H63/24,\"\")","v":""},{"$f":"IFERROR(IF(OR(COUNT(A63=\"A9197\",A63=\"A8538\",A63=\"43815\",A63=\"43637\",A63=\"43236\",A63=\"43059\",A63=\"14138\",A63=\"17644\",A63=\"14216\")),VLOOKUP(F63,'[2]AC TLB'!$A$7:$F$1199,6,1)-'[2]AC TLB'!$F$6+I63,0),\"\")","v":""},{"$error":"#VALUE!"},{"$error":"#VALUE!"}]
[null,null,null,null,null,null,null,null,null,null,{"$f":"IFERROR(VLOOKUP(F64,'[2]AC TLB'!$A$7:$F$1199,5,1)-'[2]AC TLB'!$E$6+H64/24,\"\")","v":""},{"$f":"IFERROR(IF(OR(COUNT(A64=\"A9197\",A64=\"A8538\",A64=\"43815\",A64=\"43637\",A64=\"43236\",A64=\"43059\",A64=\"14138\",A64=\"17644\",A64=\"14216\")),VLOOKUP(F64,'[2]AC TLB'!$A$7:$F$1199,6,1)-'[2]AC TLB'!$F$6+I64,0),\"\")","v":""},{"$error":"#VALUE!"},{"$error":"#VALUE!"}]
[null,null,null,null,null,null,null,null,null,null,{"$f":"IFERROR(VLOOKUP(F65,'[2]AC TLB'!$A$7:$F$1199,5,1)-'[2]AC TLB'!$E$6+H65/24,\"\")","v":""},{"$f":"IFERROR(IF(OR(COUNT(A65=\"A9197\",A65=\"A8538\",A65=\"43815\",A65=\"43637\",A65=\"43236\",A65=\"43059\",A65=\"14138\",A65=\"17644\",A65=\"14216\")),VLOOKUP(F65,'[2]AC TLB'!$A$7:$F$1199,6,1)-'[2]AC TLB'!$F$6+I65,0),\"\")","v":""},{"$error":"#VALUE!"},{"$error":"#VALUE!"}]
[null,null,null,null,null,null,null,null,null,null,{"$f":"IFERROR(VLOOKUP(F66,'[2]AC TLB'!$A$7:$F$1199,5,1)-'[2]AC TLB'!$E$6+H66/24,\"\")","v":""},{"$f":"IFERROR(IF(OR(COUNT(A66=\"A9197\",A66=\"A8538\",A66=\"43815\",A66=\"43637\",A66=\"43236\",A66=\"43059\",A66=\"14138\",A66=\"17644\",A66=\"14216\")),VLOOKUP(F66,'[2]AC TLB'!$A$7:$F$1199,6,1)-'[2]AC TLB'!$F$6+I66,0),\"\")","v":""},{"$error":"#VALUE!"},{"$error":"#VALUE!"}]
[null,null,null,null,null,null,null,null,null,null,{"$f":"IFERROR(VLOOKUP(F67,'[2]AC TLB'!$A$7:$F$1199,5,1)-'[2]AC TLB'!$E$6+H67/24,\"\")","v":""},{"$f":"IFERROR(IF(OR(COUNT(A67=\"A9197\",A67=\"A8538\",A67=\"43815\",A67=\"43637\",A67=\"43236\",A67=\"43059\",A67=\"14138\",A67=\"17644\",A67=\"14216\")),VLOOKUP(F67,'[2]AC TLB'!$A$7:$F$1199,6,1)-'[2]AC TLB'!$F$6+I67,0),\"\")","v":""},{"$error":"#VALUE!"},{"$error":"#VALUE!"}]
[null,null,null,null,null,null,null,null,null,null,{"$f":"IFERROR(VLOOKUP(F68,'[2]AC TLB'!$A$7:$F$1199,5,1)-'[2]AC TLB'!$E$6+H68/24,\"\")","v":""},{"$f":"IFERROR(IF(OR(COUNT(A68=\"A9197\",A68=\"A8538\",A68=\"43815\",A68=\"43637\",A68=\"43236\",A68=\"43059\",A68=\"14138\",A68=\"17644\",A68=\"14216\")),VLOOKUP(F68,'[2]AC TLB'!$A$7:$F$1199,6,1)-'[2]AC TLB'!$F$6+I68,0),\"\")","v":""},{"$error":"#VALUE!"},{"$error":"#VALUE!"}]
[null,null,null,null,null,null,null,null,null,null,{"$f":"IFERROR(VLOOKUP(F69,'[2]AC TLB'!$A$7:$F$1199,5,1)-'[2]AC TLB'!$E$6+H69/24,\"\")","v":""},{"$f":"IFERROR(IF(OR(COUNT(A69=\"A9197\",A69=\"A8538\",A69=\"43815\",A69=\"43637\",A69=\"43236\",A69=\"43059\",A69=\"14138\",A69=\"17644\",A69=\"14216\")),VLOOKUP(F69,'[2]AC TLB'!$A$7:$F$1199,6,1)-'[2]AC TLB'!$F$6+I69,0),\"\")","v":""},{"$error":"#VALUE!"},{"$error":"#VALUE!"}]
[null,null,null,null,null,null,null,null,null,null,{"$f":"IFERROR(VLOOKUP(F70,'[2]AC TLB'!$A$7:$F$1199,5,1)-'[2]AC TLB'!$E$6+H70/24,\"\")","v":""},{"$f":"IFERROR(IF(OR(COUNT(A70=\"A9197\",A70=\"A8538\",A70=\"43815\",A70=\"43637\",A70=\"43236\",A70=\"43059\",A70=\"14138\",A70=\"17644\",A70=\"14216\")),VLOOKUP(F70,'[2]AC TLB'!$A$7:$F$1199,6,1)-'[2]AC TLB'!$F$6+I70,0),\"\")","v":""},{"$error":"#VALUE!"},{"$error":"#VALUE!"}]
[null,null,null,null,null,null,null,null,null,null,{"$f":"IFERROR(VLOOKUP(F71,'[2]AC TLB'!$A$7:$F$1199,5,1)-'[2]AC TLB'!$E$6+H71/24,\"\")","v":""},{"$f":"IFERROR(IF(OR(COUNT(A71=\"A9197\",A71=\"A8538\",A71=\"43815\",A71=\"43637\",A71=\"43236\",A71=\"43059\",A71=\"14138\",A71=\"17644\",A71=\"14216\")),VLOOKUP(F71,'[2]AC TLB'!$A$7:$F$1199,6,1)-'[2]AC TLB'!$F$6+I71,0),\"\")","v":""},{"$error":"#VALUE!"},{"$error":"#VALUE!"}]
[null,null,null,null,null,null,null,null,null,null,{"$f":"IFERROR(VLOOKUP(F72,'[2]AC TLB'!$A$7:$F$1199,5,1)-'[2]AC TLB'!$E$6+H72/24,\"\")","v":""},{"$f":"IFERROR(IF(OR(COUNT(A72=\"A9197\",A72=\"A8538\",A72=\"43815\",A72=\"43637\",A72=\"43236\",A72=\"43059\",A72=\"14138\",A72=\"17644\",A72=\"14216\")),VLOOKUP(F72,'[2]AC TLB'!$A$7:$F$1199,6,1)-'[2]AC TLB'!$F$6+I72,0),\"\")","v":""},{"$error":"#VALUE!"},{"$error":"#VALUE!"}]
[null,null,null,null,null,null,null,null,null,null,{"$f":"IFERROR(VLOOKUP(F73,'[2]AC TLB'!$A$7:$F$1199,5,1)-'[2]AC TLB'!$E$6+H73/24,\"\")","v":""},{"$f":"IFERROR(IF(OR(COUNT(A73=\"A9197\",A73=\"A8538\",A73=\"43815\",A73=\"43637\",A73=\"43236\",A73=\"43059\",A73=\"14138\",A73=\"17644\",A73=\"14216\")),VLOOKUP(F73,'[2]AC TLB'!$A$7:$F$1199,6,1)-'[2]AC TLB'!$F$6+I73,0),\"\")","v":""},{"$error":"#VALUE!"},{"$error":"#VALUE!"}]
[null,null,null,null,null,null,null,null,null,null,{"$f":"IFERROR(VLOOKUP(F74,'[2]AC TLB'!$A$7:$F$1199,5,1)-'[2]AC TLB'!$E$6+H74/24,\"\")","v":""},{"$f":"IFERROR(IF(OR(COUNT(A74=\"A9197\",A74=\"A8538\",A74=\"43815\",A74=\"43637\",A74=\"43236\",A74=\"43059\",A74=\"14138\",A74=\"17644\",A74=\"14216\")),VLOOKUP(F74,'[2]AC TLB'!$A$7:$F$1199,6,1)-'[2]AC TLB'!$F$6+I74,0),\"\")","v":""},{"$error":"#VALUE!"},{"$error":"#VALUE!"}]
[null,null,null,null,null,null,null,null,null,null,{"$f":"IFERROR(VLOOKUP(F75,'[2]AC TLB'!$A$7:$F$1199,5,1)-'[2]AC TLB'!$E$6+H75/24,\"\")","v":""},{"$f":"IFERROR(IF(OR(COUNT(A75=\"A9197\",A75=\"A8538\",A75=\"43815\",A75=\"43637\",A75=\"43236\",A75=\"43059\",A75=\"14138\",A75=\"17644\",A75=\"14216\")),VLOOKUP(F75,'[2]AC TLB'!$A$7:$F$1199,6,1)-'[2]AC TLB'!$F$6+I75,0),\"\")","v":""},{"$error":"#VALUE!"},{"$error":"#VALUE!"}]
[null,null,null,null,null,null,null,null,null,null,{"$f":"IFERROR(VLOOKUP(F76,'[2]AC TLB'!$A$7:$F$1199,5,1)-'[2]AC TLB'!$E$6+H76/24,\"\")","v":""},{"$f":"IFERROR(IF(OR(COUNT(A76=\"A9197\",A76=\"A8538\",A76=\"43815\",A76=\"43637\",A76=\"43236\",A76=\"43059\",A76=\"14138\",A76=\"17644\",A76=\"14216\")),VLOOKUP(F76,'[2]AC TLB'!$A$7:$F$1199,6,1)-'[2]AC TLB'!$F$6+I76,0),\"\")","v":""},{"$error":"#VALUE!"},{"$error":"#VALUE!"}]
[null,null,null,null,null,null,null,null,null,null,{"$f":"IFERROR(VLOOKUP(F77,'[2]AC TLB'!$A$7:$F$1199,5,1)-'[2]AC TLB'!$E$6+H77/24,\"\")","v":""},{"$f":"IFERROR(IF(OR(COUNT(A77=\"A9197\",A77=\"A8538\",A77=\"43815\",A77=\"43637\",A77=\"43236\",A77=\"43059\",A77=\"14138\",A77=\"17644\",A77=\"14216\")),VLOOKUP(F77,'[2]AC TLB'!$A$7:$F$1199,6,1)-'[2]AC TLB'!$F$6+I77,0),\"\")","v":""},{"$error":"#VALUE!"},{"$error":"#VALUE!"}]
[null,null,null,null,null,null,null,null,null,null,{"$f":"IFERROR(VLOOKUP(F78,'[2]AC TLB'!$A$7:$F$1199,5,1)-'[2]AC TLB'!$E$6+H78/24,\"\")","v":""},{"$f":"IFERROR(IF(OR(COUNT(A78=\"A9197\",A78=\"A8538\",A78=\"43815\",A78=\"43637\",A78=\"43236\",A78=\"43059\",A78=\"14138\",A78=\"17644\",A78=\"14216\")),VLOOKUP(F78,'[2]AC TLB'!$A$7:$F$1199,6,1)-'[2]AC TLB'!$F$6+I78,0),\"\")","v":""},{"$f":"K78-H78/24","v":{"$error":"#VALUE!"}},{"$f":"L78-I78","v":{"$error":"#VALUE!"}}]
[null,null,null,null,null,null,null,null,null,null,{"$f":"IFERROR(VLOOKUP(F79,'[2]AC TLB'!$A$7:$F$1199,5,1)-'[2]AC TLB'!$E$6+H79/24,\"\")","v":""},{"$f":"IFERROR(IF(OR(COUNT(A79=\"A9197\",A79=\"A8538\",A79=\"43815\",A79=\"43637\",A79=\"43236\",A79=\"43059\",A79=\"14138\",A79=\"17644\",A79=\"14216\")),VLOOKUP(F79,'[2]AC TLB'!$A$7:$F$1199,6,1)-'[2]AC TLB'!$F$6+I79,0),\"\")","v":""},{"$error":"#VALUE!"},{"$error":"#VALUE!"}]
[null,null,null,null,null,null,null,null,null,null,{"$f":"IFERROR(VLOOKUP(F80,'[2]AC TLB'!$A$7:$F$1199,5,1)-'[2]AC TLB'!$E$6+H80/24,\"\")","v":""},{"$f":"IFERROR(IF(OR(COUNT(A80=\"A9197\",A80=\"A8538\",A80=\"43815\",A80=\"43637\",A80=\"43236\",A80=\"43059\",A80=\"14138\",A80=\"17644\",A80=\"14216\")),VLOOKUP(F80,'[2]AC TLB'!$A$7:$F$1199,6,1)-'[2]AC TLB'!$F$6+I80,0),\"\")","v":""},{"$error":"#VALUE!"},{"$error":"#VALUE!"}]
[null,null,null,null,null,null,null,null,null,null,{"$f":"IFERROR(VLOOKUP(F81,'[2]AC TLB'!$A$7:$F$1199,5,1)-'[2]AC TLB'!$E$6+H81/24,\"\")","v":""},{"$f":"IFERROR(IF(OR(COUNT(A81=\"A9197\",A81=\"A8538\",A81=\"43815\",A81=\"43637\",A81=\"43236\",A81=\"43059\",A81=\"14138\",A81=\"17644\",A81=\"14216\")),VLOOKUP(F81,'[2]AC TLB'!$A$7:$F$1199,6,1)-'[2]AC TLB'!$F$6+I81,0),\"\")","v":""},{"$error":"#VALUE!"},{"$error":"#VALUE!"}]
[null,null,null,null,null,null,null,null,null,null,{"$f":"IFERROR(VLOOKUP(F82,'[2]AC TLB'!$A$7:$F$1199,5,1)-'[2]AC TLB'!$E$6+H82/24,\"\")","v":""},{"$f":"IFERROR(IF(OR(COUNT(A82=\"A9197\",A82=\"A8538\",A82=\"43815\",A82=\"43637\",A82=\"43236\",A82=\"43059\",A82=\"14138\",A82=\"17644\",A82=\"14216\")),VLOOKUP(F82,'[2]AC TLB'!$A$7:$F$1199,6,1)-'[2]AC TLB'!$F$6+I82,0),\"\")","v":""},{"$error":"#VALUE!"},{"$error":"#VALUE!"}]
[null,null,null,null,null,null,null,null,null,null,{"$f":"IFERROR(VLOOKUP(F83,'[2]AC TLB'!$A$7:$F$1199,5,1)-'[2]AC TLB'!$E$6+H83/24,\"\")","v":""},{"$f":"IFERROR(IF(OR(COUNT(A83=\"A9197\",A83=\"A8538\",A83=\"43815\",A83=\"43637\",A83=\"43236\",A83=\"43059\",A83=\"14138\",A83=\"17644\",A83=\"14216\")),VLOOKUP(F83,'[2]AC TLB'!$A$7:$F$1199,6,1)-'[2]AC TLB'!$F$6+I83,0),\"\")","v":""},{"$error":"#VALUE!"},{"$error":"#VALUE!"}]
[null,null,null,null,null,null,null,null,null,null,{"$f":"IFERROR(VLOOKUP(F84,'[2]AC TLB'!$A$7:$F$1199,5,1)-'[2]AC TLB'!$E$6+H84/24,\"\")","v":""},{"$f":"IFERROR(IF(OR(COUNT(A84=\"A9197\",A84=\"A8538\",A84=\"43815\",A84=\"43637\",A84=\"43236\",A84=\"43059\",A84=\"14138\",A84=\"17644\",A84=\"14216\")),VLOOKUP(F84,'[2]AC TLB'!$A$7:$F$1199,6,1)-'[2]AC TLB'!$F$6+I84,0),\"\")","v":""},{"$error":"#VALUE!"},{"$error":"#VALUE!"}]
[null,null,null,null,null,null,null,null,null,null,{"$f":"IFERROR(VLOOKUP(F85,'[2]AC TLB'!$A$7:$F$1199,5,1)-'[2]AC TLB'!$E$6+H85/24,\"\")","v":""},{"$f":"IFERROR(IF(OR(COUNT(A85=\"A9197\",A85=\"A8538\",A85=\"43815\",A85=\"43637\",A85=\"43236\",A85=\"43059\",A85=\"14138\",A85=\"17644\",A85=\"14216\")),VLOOKUP(F85,'[2]AC TLB'!$A$7:$F$1199,6,1)-'[2]AC TLB'!$F$6+I85,0),\"\")","v":""},{"$error":"#VALUE!"},{"$error":"#VALUE!"}]
[null,null,null,null,null,null,null,null,null,null,{"$f":"IFERROR(VLOOKUP(F86,'[2]AC TLB'!$A$7:$F$1199,5,1)-'[2]AC TLB'!$E$6+H86/24,\"\")","v":""},{"$f":"IFERROR(IF(OR(COUNT(A86=\"A9197\",A86=\"A8538\",A86=\"43815\",A86=\"43637\",A86=\"43236\",A86=\"43059\",A86=\"14138\",A86=\"17644\",A86=\"14216\")),VLOOKUP(F86,'[2]AC TLB'!$A$7:$F$1199,6,1)-'[2]AC TLB'!$F$6+I86,0),\"\")","v":""},{"$error":"#VALUE!"},{"$error":"#VALUE!"}]
[null,null,null,null,null,null,null,null,null,null,{"$f":"IFERROR(VLOOKUP(F87,'[2]AC TLB'!$A$7:$F$1199,5,1)-'[2]AC TLB'!$E$6+H87/24,\"\")","v":""},{"$f":"IFERROR(IF(OR(COUNT(A87=\"A9197\",A87=\"A8538\",A87=\"43815\",A87=\"43637\",A87=\"43236\",A87=\"43059\",A87=\"14138\",A87=\"17644\",A87=\"14216\")),VLOOKUP(F87,'[2]AC TLB'!$A$7:$F$1199,6,1)-'[2]AC TLB'!$F$6+I87,0),\"\")","v":""},{"$error":"#VALUE!"},{"$error":"#VALUE!"}]
[null,null,null,null,null,null,null,null,null,null,{"$f":"IFERROR(VLOOKUP(F88,'[2]AC TLB'!$A$7:$F$1199,5,1)-'[2]AC TLB'!$E$6+H88/24,\"\")","v":""},{"$f":"IFERROR(IF(OR(COUNT(A88=\"A9197\",A88=\"A8538\",A88=\"43815\",A88=\"43637\",A88=\"43236\",A88=\"43059\",A88=\"14138\",A88=\"17644\",A88=\"14216\")),VLOOKUP(F88,'[2]AC TLB'!$A$7:$F$1199,6,1)-'[2]AC TLB'!$F$6+I88,0),\"\")","v":""},{"$error":"#VALUE!"},{"$error":"#VALUE!"}]
[null,null,null,null,null,null,null,null,null,null,{"$f":"IFERROR(VLOOKUP(F89,'[2]AC TLB'!$A$7:$F$1199,5,1)-'[2]AC TLB'!$E$6+H89/24,\"\")","v":""},{"$f":"IFERROR(IF(OR(COUNT(A89=\"A9197\",A89=\"A8538\",A89=\"43815\",A89=\"43637\",A89=\"43236\",A89=\"43059\",A89=\"14138\",A89=\"17644\",A89=\"14216\")),VLOOKUP(F89,'[2]AC TLB'!$A$7:$F$1199,6,1)-'[2]AC TLB'!$F$6+I89,0),\"\")","v":""},{"$error":"#VALUE!"},{"$error":"#VALUE!"}]
[null,null,null,null,null,null,null,null,null,null,{"$f":"IFERROR(VLOOKUP(F90,'[2]AC TLB'!$A$7:$F$1199,5,1)-'[2]AC TLB'!$E$6+H90/24,\"\")","v":""},{"$f":"IFERROR(IF(OR(COUNT(A90=\"A9197\",A90=\"A8538\",A90=\"43815\",A90=\"43637\",A90=\"43236\",A90=\"43059\",A90=\"14138\",A90=\"17644\",A90=\"14216\")),VLOOKUP(F90,'[2]AC TLB'!$A$7:$F$1199,6,1)-'[2]AC TLB'!$F$6+I90,0),\"\")","v":""},{"$error":"#VALUE!"},{"$error":"#VALUE!"}]
[null,null,null,null,null,null,null,null,null,null,{"$f":"IFERROR(VLOOKUP(F91,'[2]AC TLB'!$A$7:$F$1199,5,1)-'[2]AC TLB'!$E$6+H91/24,\"\")","v":""},{"$f":"IFERROR(IF(OR(COUNT(A91=\"A9197\",A91=\"A8538\",A91=\"43815\",A91=\"43637\",A91=\"43236\",A91=\"43059\",A91=\"14138\",A91=\"17644\",A91=\"14216\")),VLOOKUP(F91,'[2]AC TLB'!$A$7:$F$1199,6,1)-'[2]AC TLB'!$F$6+I91,0),\"\")","v":""},{"$error":"#VALUE!"},{"$error":"#VALUE!"}]
[null,null,null,null,null,null,null,null,null,null,{"$f":"IFERROR(VLOOKUP(F92,'[2]AC TLB'!$A$7:$F$1199,5,1)-'[2]AC TLB'!$E$6+H92/24,\"\")","v":""},{"$f":"IFERROR(IF(OR(COUNT(A92=\"A9197\",A92=\"A8538\",A92=\"43815\",A92=\"43637\",A92=\"43236\",A92=\"43059\",A92=\"14138\",A92=\"17644\",A92=\"14216\")),VLOOKUP(F92,'[2]AC TLB'!$A$7:$F$1199,6,1)-'[2]AC TLB'!$F$6+I92,0),\"\")","v":""},{"$error":"#VALUE!"},{"$error":"#VALUE!"}]
[null,null,null,null,null,null,null,null,null,null,{"$f":"IFERROR(VLOOKUP(F93,'[2]AC TLB'!$A$7:$F$1199,5,1)-'[2]AC TLB'!$E$6+H93/24,\"\")","v":""},{"$f":"IFERROR(IF(OR(COUNT(A93=\"A9197\",A93=\"A8538\",A93=\"43815\",A93=\"43637\",A93=\"43236\",A93=\"43059\",A93=\"14138\",A93=\"17644\",A93=\"14216\")),VLOOKUP(F93,'[2]AC TLB'!$A$7:$F$1199,6,1)-'[2]AC TLB'!$F$6+I93,0),\"\")","v":""},{"$error":"#VALUE!"},{"$error":"#VALUE!"}]
[null,null,null,null,null,null,null,null,null,null,{"$f":"IFERROR(VLOOKUP(F94,'[2]AC TLB'!$A$7:$F$1199,5,1)-'[2]AC TLB'!$E$6+H94/24,\"\")","v":""},{"$f":"IFERROR(IF(OR(COUNT(A94=\"A9197\",A94=\"A8538\",A94=\"43815\",A94=\"43637\",A94=\"43236\",A94=\"43059\",A94=\"14138\",A94=\"17644\",A94=\"14216\")),VLOOKUP(F94,'[2]AC TLB'!$A$7:$F$1199,6,1)-'[2]AC TLB'!$F$6+I94,0),\"\")","v":""},{"$error":"#VALUE!"},{"$error":"#VALUE!"}]
[null,null,null,null,null,null,null,null,null,null,{"$f":"IFERROR(VLOOKUP(F95,'[2]AC TLB'!$A$7:$F$1199,5,1)-'[2]AC TLB'!$E$6+H95/24,\"\")","v":""},{"$f":"IFERROR(IF(OR(COUNT(A95=\"A9197\",A95=\"A8538\",A95=\"43815\",A95=\"43637\",A95=\"43236\",A95=\"43059\",A95=\"14138\",A95=\"17644\",A95=\"14216\")),VLOOKUP(F95,'[2]AC TLB'!$A$7:$F$1199,6,1)-'[2]AC TLB'!$F$6+I95,0),\"\")","v":""},{"$error":"#VALUE!"},{"$error":"#VALUE!"}]
[null,null,null,null,null,null,null,null,null,null,{"$f":"IFERROR(VLOOKUP(F96,'[2]AC TLB'!$A$7:$F$1199,5,1)-'[2]AC TLB'!$E$6+H96/24,\"\")","v":""},{"$f":"IFERROR(IF(OR(COUNT(A96=\"A9197\",A96=\"A8538\",A96=\"43815\",A96=\"43637\",A96=\"43236\",A96=\"43059\",A96=\"14138\",A96=\"17644\",A96=\"14216\")),VLOOKUP(F96,'[2]AC TLB'!$A$7:$F$1199,6,1)-'[2]AC TLB'!$F$6+I96,0),\"\")","v":""},{"$error":"#VALUE!"},{"$error":"#VALUE!"}]
[null,null,null,null,null,null,null,null,null,null,{"$f":"IFERROR(VLOOKUP(F97,'[2]AC TLB'!$A$7:$F$1199,5,1)-'[2]AC TLB'!$E$6+H97/24,\"\")","v":""},{"$f":"IFERROR(IF(OR(COUNT(A97=\"A9197\",A97=\"A8538\",A97=\"43815\",A97=\"43637\",A97=\"43236\",A97=\"43059\",A97=\"14138\",A97=\"17644\",A97=\"14216\")),VLOOKUP(F97,'[2]AC TLB'!$A$7:$F$1199,6,1)-'[2]AC TLB'!$F$6+I97,0),\"\")","v":""},{"$error":"#VALUE!"},{"$error":"#VALUE!"}]
[null,null,null,null,null,null,null,null,null,null,{"$f":"IFERROR(VLOOKUP(F98,'[2]AC TLB'!$A$7:$F$1199,5,1)-'[2]AC TLB'!$E$6+H98/24,\"\")","v":""},{"$f":"IFERROR(IF(OR(COUNT(A98=\"A9197\",A98=\"A8538\",A98=\"43815\",A98=\"43637\",A98=\"43236\",A98=\"43059\",A98=\"14138\",A98=\"17644\",A98=\"14216\")),VLOOKUP(F98,'[2]AC TLB'!$A$7:$F$1199,6,1)-'[2]AC TLB'!$F$6+I98,0),\"\")","v":""},{"$error":"#VALUE!"},{"$error":"#VALUE!"}]
[null,null,null,null,null,null,null,null,null,null,{"$f":"IFERROR(VLOOKUP(F99,'[2]AC TLB'!$A$7:$F$1199,5,1)-'[2]AC TLB'!$E$6+H99/24,\"\")","v":""},{"$f":"IFERROR(IF(OR(COUNT(A99=\"A9197\",A99=\"A8538\",A99=\"43815\",A99=\"43637\",A99=\"43236\",A99=\"43059\",A99=\"14138\",A99=\"17644\",A99=\"14216\")),VLOOKUP(F99,'[2]AC TLB'!$A$7:$F$1199,6,1)-'[2]AC TLB'!$F$6+I99,0),\"\")","v":""},{"$error":"#VALUE!"},{"$error":"#VALUE!"}]
[null,null,null,null,null,null,null,null,null,null,{"$f":"IFERROR(VLOOKUP(F100,'[2]AC TLB'!$A$7:$F$1199,5,1)-'[2]AC TLB'!$E$6+H100/24,\"\")","v":""},{"$f":"IFERROR(IF(OR(COUNT(A100=\"A9197\",A100=\"A8538\",A100=\"43815\",A100=\"43637\",A100=\"43236\",A100=\"43059\",A100=\"14138\",A100=\"17644\",A100=\"14216\")),VLOOKUP(F100,'[2]AC TLB'!$A$7:$F$1199,6,1)-'[2]AC TLB'!$F$6+I100,0),\"\")","v":""},{"$error":"#VALUE!"},{"$error":"#VALUE!"}]
[null,null,null,null,null,null,null,null,null,null,{"$f":"IFERROR(VLOOKUP(F101,'[2]AC TLB'!$A$7:$F$1199,5,1)-'[2]AC TLB'!$E$6+H101/24,\"\")","v":""},{"$f":"IFERROR(IF(OR(COUNT(A101=\"A9197\",A101=\"A8538\",A101=\"43815\",A101=\"43637\",A101=\"43236\",A101=\"43059\",A101=\"14138\",A101=\"17644\",A101=\"14216\")),VLOOKUP(F101,'[2]AC TLB'!$A$7:$F$1199,6,1)-'[2]AC TLB'!$F$6+I101,0),\"\")","v":""},{"$error":"#VALUE!"},{"$error":"#VALUE!"}]
[null,null,null,null,null,null,null,null,null,null,{"$f":"IFERROR(VLOOKUP(F102,'[2]AC TLB'!$A$7:$F$1199,5,1)-'[2]AC TLB'!$E$6+H102/24,\"\")","v":""},{"$f":"IFERROR(IF(OR(COUNT(A102=\"A9197\",A102=\"A8538\",A102=\"43815\",A102=\"43637\",A102=\"43236\",A102=\"43059\",A102=\"14138\",A102=\"17644\",A102=\"14216\")),VLOOKUP(F102,'[2]AC TLB'!$A$7:$F$1199,6,1)-'[2]AC TLB'!$F$6+I102,0),\"\")","v":""},{"$error":"#VALUE!"},{"$error":"#VALUE!"}]
[null,null,null,null,null,null,null,null,null,null,{"$f":"IFERROR(VLOOKUP(F103,'[2]AC TLB'!$A$7:$F$1199,5,1)-'[2]AC TLB'!$E$6+H103/24,\"\")","v":""},{"$f":"IFERROR(IF(OR(COUNT(A103=\"A9197\",A103=\"A8538\",A103=\"43815\",A103=\"43637\",A103=\"43236\",A103=\"43059\",A103=\"14138\",A103=\"17644\",A103=\"14216\")),VLOOKUP(F103,'[2]AC TLB'!$A$7:$F$1199,6,1)-'[2]AC TLB'!$F$6+I103,0),\"\")","v":""},{"$error":"#VALUE!"},{"$error":"#VALUE!"}]
[null,null,null,null,null,null,null,null,null,null,{"$f":"IFERROR(VLOOKUP(F104,'[2]AC TLB'!$A$7:$F$1199,5,1)-'[2]AC TLB'!$E$6+H104/24,\"\")","v":""},{"$f":"IFERROR(IF(OR(COUNT(A104=\"A9197\",A104=\"A8538\",A104=\"43815\",A104=\"43637\",A104=\"43236\",A104=\"43059\",A104=\"14138\",A104=\"17644\",A104=\"14216\")),VLOOKUP(F104,'[2]AC TLB'!$A$7:$F$1199,6,1)-'[2]AC TLB'!$F$6+I104,0),\"\")","v":""},{"$error":"#VALUE!"},{"$error":"#VALUE!"}]
[null,null,null,null,null,null,null,null,null,null,{"$f":"IFERROR(VLOOKUP(F105,'[2]AC TLB'!$A$7:$F$1199,5,1)-'[2]AC TLB'!$E$6+H105/24,\"\")","v":""},{"$f":"IFERROR(IF(OR(COUNT(A105=\"A9197\",A105=\"A8538\",A105=\"43815\",A105=\"43637\",A105=\"43236\",A105=\"43059\",A105=\"14138\",A105=\"17644\",A105=\"14216\")),VLOOKUP(F105,'[2]AC TLB'!$A$7:$F$1199,6,1)-'[2]AC TLB'!$F$6+I105,0),\"\")","v":""},{"$error":"#VALUE!"},{"$error":"#VALUE!"}]
[null,null,null,null,null,null,null,null,null,null,{"$f":"IFERROR(VLOOKUP(F106,'[2]AC TLB'!$A$7:$F$1199,5,1)-'[2]AC TLB'!$E$6+H106/24,\"\")","v":""},{"$f":"IFERROR(IF(OR(COUNT(A106=\"A9197\",A106=\"A8538\",A106=\"43815\",A106=\"43637\",A106=\"43236\",A106=\"43059\",A106=\"14138\",A106=\"17644\",A106=\"14216\")),VLOOKUP(F106,'[2]AC TLB'!$A$7:$F$1199,6,1)-'[2]AC TLB'!$F$6+I106,0),\"\")","v":""},{"$error":"#VALUE!"},{"$error":"#VALUE!"}]
[null,null,null,null,null,null,null,null,null,null,{"$f":"IFERROR(VLOOKUP(F107,'[2]AC TLB'!$A$7:$F$1199,5,1)-'[2]AC TLB'!$E$6+H107/24,\"\")","v":""},{"$f":"IFERROR(IF(OR(COUNT(A107=\"A9197\",A107=\"A8538\",A107=\"43815\",A107=\"43637\",A107=\"43236\",A107=\"43059\",A107=\"14138\",A107=\"17644\",A107=\"14216\")),VLOOKUP(F107,'[2]AC TLB'!$A$7:$F$1199,6,1)-'[2]AC TLB'!$F$6+I107,0),\"\")","v":""},{"$error":"#VALUE!"},{"$error":"#VALUE!"}]

{"sheet":"Wheels","index":1,"n_rows":103,"n_cols":9,"rows_kept":103,"cut":false,"hidden":false,"merged":[[1,0,1,2],[1,3,1,4],[1,5,1,8]]}
[]
["MAIN WHEELS",null,null,"عدد التكرار",null,"الحصر"]
["No","S/N-Number","P/N-Number","S/N-Number","P/N-Number","S/N-Number","الإجمالي","P/N-Number","الإجمالي"]
[1,"45253","C20195162",{"$f":"COUNTIF(Parts!$G$5:$G$200, Wheels!B4)","v":1},{"$f":"COUNTIF(Parts!$F$5:$F$200, Wheels!C4)","v":15},{"$f":"IFERROR(IF(B4<>\"\",INDEX($B$4:$B$110,MATCH(0,COUNTIF($F3:F$3,$B$4:$B$110),0)),\"\"),\"\")","v":"45253"},{"$f":"IF(F4=\"\",\"\",SUMPRODUCT(--($B$4:$B$110=F4),$D$4:$D$110))","v":1},{"$f":"IFERROR(IF(C4<>\"\",INDEX($C$4:$C$110,MATCH(0,COUNTIF($H3:H$3,$C$4:$C$110),0)),\"\"),\"\")","v":"C20195162"},{"$f":"IF(H4=\"\",\"\",SUMPRODUCT(--($C$4:$C$110=H4),$E$4:$E$110))","v":225}]
[2,"43059","C20195162",{"$f":"COUNTIF(Parts!$G$5:$G$200, Wheels!B5)","v":1},{"$f":"COUNTIF(Parts!$F$5:$F$200, Wheels!C5)","v":15},{"$f":"IFERROR(IF(B5<>\"\",INDEX($B$4:$B$110,MATCH(0,COUNTIF($F$3:F4,$B$4:$B$110),0)),\"\"),\"\")","v":"43059"},{"$f":"IF(F5=\"\",\"\",SUMPRODUCT(--($B$4:$B$110=F5),$D$4:$D$110))","v":1},{"$f":"IFERROR(IF(C5<>\"\",INDEX($C$4:$C$110,MATCH(0,COUNTIF($H$3:H4,$C$4:$C$110),0)),\"\"),\"\")","v":"3-1531-3"},{"$f":"IF(H5=\"\",\"\",SUMPRODUCT(--($C$4:$C$110=H5),$E$4:$E$110))","v":289}]
[3,"43078","C20195162",{"$f":"COUNTIF(Parts!$G$5:$G$200, Wheels!B6)","v":1},{"$f":"COUNTIF(Parts!$F$5:$F$200, Wheels!C6)","v":15},{"$f":"IFERROR(IF(B6<>\"\",INDEX($B$4:$B$110,MATCH(0,COUNTIF($F$3:F5,$B$4:$B$110),0)),\"\"),\"\")","v":"43078"},{"$f":"IF(F6=\"\",\"\",SUMPRODUCT(--($B$4:$B$110=F6),$D$4:$D$110))","v":1},{"$f":"IFERROR(IF(C6<>\"\",INDEX($C$4:$C$110,MATCH(0,COUNTIF($H$3:H5,$C$4:$C$110),0)),\"\"),\"\")","v":"3-1531-4"},{"$f":"IF(H6=\"\",\"\",SUMPRODUCT(--($C$4:$C$110=H6),$E$4:$E$110))","v":1}]
[4,"55385","C20195162",{"$f":"COUNTIF(Parts!$G$5:$G$200, Wheels!B7)","v":1},{"$f":"COUNTIF(Parts!$F$5:$F$200, Wheels!C7)","v":15},{"$f":"IFERROR(IF(B7<>\"\",INDEX($B$4:$B$110,MATCH(0,COUNTIF($F$3:F6,$B$4:$B$110),0)),\"\"),\"\")","v":"55385"},{"$f":"IF(F7=\"\",\"\",SUMPRODUCT(--($B$4:$B$110=F7),$D$4:$D$110))","v":1},{"$f":"IFERROR(IF(C7<>\"\",INDEX($C$4:$C$110,MATCH(0,COUNTIF($H$3:H6,$C$4:$C$110),0)),\"\"),\"\")","v":"3-1531-5"},{"$f":"IF(H7=\"\",\"\",SUMPRODUCT(--($C$4:$C$110=H7),$E$4:$E$110))","v":1}]
[5,"28787","C20195162",{"$f":"COUNTIF(Parts!$G$5:$G$200, Wheels!B8)","v":1},{"$f":"COUNTIF(Parts!$F$5:$F$200, Wheels!C8)","v":15},{"$f":"IFERROR(IF(B8<>\"\",INDEX($B$4:$B$110,MATCH(0,COUNTIF($F$3:F7,$B$4:$B$110),0)),\"\"),\"\")","v":"28787"},{"$f":"IF(F8=\"\",\"\",SUMPRODUCT(--($B$4:$B$110=F8),$D$4:$D$110))","v":1},{"$f":"IFERROR(IF(C8<>\"\",INDEX($C$4:$C$110,MATCH(0,COUNTIF($H$3:H7,$C$4:$C$110),0)),\"\"),\"\")","v":0},{"$f":"IF(H8=\"\",\"\",SUMPRODUCT(--($C$4:$C$110=H8),$E$4:$E$110))","v":0}]
[6,"44998","C20195162",{"$f":"COUNTIF(Parts!$G$5:$G$200, Wheels!B9)","v":1},{"$f":"COUNTIF(Parts!$F$5:$F$200, Wheels!C9)","v":15},{"$f":"IFERROR(IF(B9<>\"\",INDEX($B$4:$B$110,MATCH(0,COUNTIF($F$3:F8,$B$4:$B$110),0)),\"\"),\"\")","v":"44998"},{"$f":"IF(F9=\"\",\"\",SUMPRODUCT(--($B$4:$B$110=F9),$D$4:$D$110))","v":1},{"$f":"IFERROR(IF(C9<>\"\",INDEX($C$4:$C$110,MATCH(0,COUNTIF($H$3:H8,$C$4:$C$110),0)),\"\"),\"\")","v":""},{"$f":"IF(H9=\"\",\"\",SUMPRODUCT(--($C$4:$C$110=H9),$E$4:$E$110))","v":""}]
[7,"32381","C20195162",{"$f":"COUNTIF(Parts!$G$5:$G$200, Wheels!B10)","v":1},{"$f":"COUNTIF(Parts!$F$5:$F$200, Wheels!C10)","v":15},{"$f":"IFERROR(IF(B10<>\"\",INDEX($B$4:$B$110,MATCH(0,COUNTIF($F$3:F9,$B$4:$B$110),0)),\"\"),\"\")","v":"32381"},{"$f":"IF(F10=\"\",\"\",SUMPRODUCT(--($B$4:$B$110=F10),$D$4:$D$110))","v":1},{"$f":"IFERROR(IF(C10<>\"\",INDEX($C$4:$C$110,MATCH(0,COUNTIF($H$3:H9,$C$4:$C$110),0)),\"\"),\"\")","v":""},{"$f":"IF(H10=\"\",\"\",SUMPRODUCT(--($C$4:$C$110=H10),$E$4:$E$110))","v":""}]
[8,"27448","C20195162",{"$f":"COUNTIF(Parts!$G$5:$G$200, Wheels!B11)","v":1},{"$f":"COUNTIF(Parts!$F$5:$F$200, Wheels!C11)","v":15},{"$f":"IFERROR(IF(B11<>\"\",INDEX($B$4:$B$110,MATCH(0,COUNTIF($F$3:F10,$B$4:$B$110),0)),\"\"),\"\")","v":"27448"},{"$f":"IF(F11=\"\",\"\",SUMPRODUCT(--($B$4:$B$110=F11),$D$4:$D$110))","v":1},{"$f":"IFERROR(IF(C11<>\"\",INDEX($C$4:$C$110,MATCH(0,COUNTIF($H$3:H10,$C$4:$C$110),0)),\"\"),\"\")","v":""},{"$f":"IF(H11=\"\",\"\",SUMPRODUCT(--($C$4:$C$110=H11),$E$4:$E$110))","v":""}]
[9,"49303","C20195162",{"$f":"COUNTIF(Parts!$G$5:$G$200, Wheels!B12)","v":1},{"$f":"COUNTIF(Parts!$F$5:$F$200, Wheels!C12)","v":15},{"$f":"IFERROR(IF(B12<>\"\",INDEX($B$4:$B$110,MATCH(0,COUNTIF($F$3:F11,$B$4:$B$110),0)),\"\"),\"\")","v":"49303"},{"$f":"IF(F12=\"\",\"\",SUMPRODUCT(--($B$4:$B$110=F12),$D$4:$D$110))","v":1},{"$f":"IFERROR(IF(C12<>\"\",INDEX($C$4:$C$110,MATCH(0,COUNTIF($H$3:H11,$C$4:$C$110),0)),\"\"),\"\")","v":""},{"$f":"IF(H12=\"\",\"\",SUMPRODUCT(--($C$4:$C$110=H12),$E$4:$E$110))","v":""}]
[10,"55386","C20195162",{"$f":"COUNTIF(Parts!$G$5:$G$200, Wheels!B13)","v":1},{"$f":"COUNTIF(Parts!$F$5:$F$200, Wheels!C13)","v":15},{"$f":"IFERROR(IF(B13<>\"\",INDEX($B$4:$B$110,MATCH(0,COUNTIF($F$3:F12,$B$4:$B$110),0)),\"\"),\"\")","v":"55386"},{"$f":"IF(F13=\"\",\"\",SUMPRODUCT(--($B$4:$B$110=F13),$D$4:$D$110))","v":1},{"$f":"IFERROR(IF(C13<>\"\",INDEX($C$4:$C$110,MATCH(0,COUNTIF($H$3:H12,$C$4:$C$110),0)),\"\"),\"\")","v":""},{"$f":"IF(H13=\"\",\"\",SUMPRODUCT(--($C$4:$C$110=H13),$E$4:$E$110))","v":""}]
[11,"43239","C20195162",{"$f":"COUNTIF(Parts!$G$5:$G$200, Wheels!B14)","v":1},{"$f":"COUNTIF(Parts!$F$5:$F$200, Wheels!C14)","v":15},{"$f":"IFERROR(IF(B14<>\"\",INDEX($B$4:$B$110,MATCH(0,COUNTIF($F$3:F13,$B$4:$B$110),0)),\"\"),\"\")","v":"43239"},{"$f":"IF(F14=\"\",\"\",SUMPRODUCT(--($B$4:$B$110=F14),$D$4:$D$110))","v":1},{"$f":"IFERROR(IF(C14<>\"\",INDEX($C$4:$C$110,MATCH(0,COUNTIF($H$3:H13,$C$4:$C$110),0)),\"\"),\"\")","v":""},{"$f":"IF(H14=\"\",\"\",SUMPRODUCT(--($C$4:$C$110=H14),$E$4:$E$110))","v":""}]
[12,"43236","C20195162",{"$f":"COUNTIF(Parts!$G$5:$G$200, Wheels!B15)","v":1},{"$f":"COUNTIF(Parts!$F$5:$F$200, Wheels!C15)","v":15},{"$f":"IFERROR(IF(B15<>\"\",INDEX($B$4:$B$110,MATCH(0,COUNTIF($F$3:F14,$B$4:$B$110),0)),\"\"),\"\")","v":"43236"},{"$f":"IF(F15=\"\",\"\",SUMPRODUCT(--($B$4:$B$110=F15),$D$4:$D$110))","v":1},{"$f":"IFERROR(IF(C15<>\"\",INDEX($C$4:$C$110,MATCH(0,COUNTIF($H$3:H14,$C$4:$C$110),0)),\"\"),\"\")","v":""},{"$f":"IF(H15=\"\",\"\",SUMPRODUCT(--($C$4:$C$110=H15),$E$4:$E$110))","v":""}]
[13,"43509","C20195162",{"$f":"COUNTIF(Parts!$G$5:$G$200, Wheels!B16)","v":1},{"$f":"COUNTIF(Parts!$F$5:$F$200, Wheels!C16)","v":15},{"$f":"IFERROR(IF(B16<>\"\",INDEX($B$4:$B$110,MATCH(0,COUNTIF($F$3:F15,$B$4:$B$110),0)),\"\"),\"\")","v":"43509"},{"$f":"IF(F16=\"\",\"\",SUMPRODUCT(--($B$4:$B$110=F16),$D$4:$D$110))","v":1},{"$f":"IFERROR(IF(C16<>\"\",INDEX($C$4:$C$110,MATCH(0,COUNTIF($H$3:H15,$C$4:$C$110),0)),\"\"),\"\")","v":""},{"$f":"IF(H16=\"\",\"\",SUMPRODUCT(--($C$4:$C$110=H16),$E$4:$E$110))","v":""}]
[14,"46961","C20195162",{"$f":"COUNTIF(Parts!$G$5:$G$200, Wheels!B17)","v":1},{"$f":"COUNTIF(Parts!$F$5:$F$200, Wheels!C17)","v":15},{"$f":"IFERROR(IF(B17<>\"\",INDEX($B$4:$B$110,MATCH(0,COUNTIF($F$3:F16,$B$4:$B$110),0)),\"\"),\"\")","v":"46961"},{"$f":"IF(F17=\"\",\"\",SUMPRODUCT(--($B$4:$B$110=F17),$D$4:$D$110))","v":1},{"$f":"IFERROR(IF(C17<>\"\",INDEX($C$4:$C$110,MATCH(0,COUNTIF($H$3:H16,$C$4:$C$110),0)),\"\"),\"\")","v":""},{"$f":"IF(H17=\"\",\"\",SUMPRODUCT(--($C$4:$C$110=H17),$E$4:$E$110))","v":""}]
[15,"48901","C20195162",{"$f":"COUNTIF(Parts!$G$5:$G$200, Wheels!B18)","v":1},{"$f":"COUNTIF(Parts!$F$5:$F$200, Wheels!C18)","v":15},{"$f":"IFERROR(IF(B18<>\"\",INDEX($B$4:$B$110,MATCH(0,COUNTIF($F$3:F17,$B$4:$B$110),0)),\"\"),\"\")","v":"48901"},{"$f":"IF(F18=\"\",\"\",SUMPRODUCT(--($B$4:$B$110=F18),$D$4:$D$110))","v":1},{"$f":"IFERROR(IF(C18<>\"\",INDEX($C$4:$C$110,MATCH(0,COUNTIF($H$3:H17,$C$4:$C$110),0)),\"\"),\"\")","v":""},{"$f":"IF(H18=\"\",\"\",SUMPRODUCT(--($C$4:$C$110=H18),$E$4:$E$110))","v":""}]
[16,"A9197","3-1531-3",{"$f":"COUNTIF(Parts!$G$5:$G$200, Wheels!B19)","v":1},{"$f":"COUNTIF(Parts!$F$5:$F$200, Wheels!C19)","v":17},{"$f":"IFERROR(IF(B19<>\"\",INDEX($B$4:$B$110,MATCH(0,COUNTIF($F$3:F18,$B$4:$B$110),0)),\"\"),\"\")","v":"A9197"},{"$f":"IF(F19=\"\",\"\",SUMPRODUCT(--($B$4:$B$110=F19),$D$4:$D$110))","v":1},{"$f":"IFERROR(IF(C19<>\"\",INDEX($C$4:$C$110,MATCH(0,COUNTIF($H$3:H18,$C$4:$C$110),0)),\"\"),\"\")","v":""},{"$f":"IF(H19=\"\",\"\",SUMPRODUCT(--($C$4:$C$110=H19),$E$4:$E$110))","v":""}]
[17,"A9195","3-1531-3",{"$f":"COUNTIF(Parts!$G$5:$G$200, Wheels!B20)","v":1},{"$f":"COUNTIF(Parts!$F$5:$F$200, Wheels!C20)","v":17},{"$f":"IFERROR(IF(B20<>\"\",INDEX($B$4:$B$110,MATCH(0,COUNTIF($F$3:F19,$B$4:$B$110),0)),\"\"),\"\")","v":"A9195"},{"$f":"IF(F20=\"\",\"\",SUMPRODUCT(--($B$4:$B$110=F20),$D$4:$D$110))","v":1},{"$f":"IFERROR(IF(C20<>\"\",INDEX($C$4:$C$110,MATCH(0,COUNTIF($H$3:H19,$C$4:$C$110),0)),\"\"),\"\")","v":""},{"$f":"IF(H20=\"\",\"\",SUMPRODUCT(--($C$4:$C$110=H20),$E$4:$E$110))","v":""}]
[18,"6905","3-1531-3",{"$f":"COUNTIF(Parts!$G$5:$G$200, Wheels!B21)","v":1},{"$f":"COUNTIF(Parts!$F$5:$F$200, Wheels!C21)","v":17},{"$f":"IFERROR(IF(B21<>\"\",INDEX($B$4:$B$110,MATCH(0,COUNTIF($F$3:F20,$B$4:$B$110),0)),\"\"),\"\")","v":"6905"},{"$f":"IF(F21=\"\",\"\",SUMPRODUCT(--($B$4:$B$110=F21),$D$4:$D$110))","v":1},{"$f":"IFERROR(IF(C21<>\"\",INDEX($C$4:$C$110,MATCH(0,COUNTIF($H$3:H20,$C$4:$C$110),0)),\"\"),\"\")","v":""},{"$f":"IF(H21=\"\",\"\",SUMPRODUCT(--($C$4:$C$110=H21),$E$4:$E$110))","v":""}]
[19,5426,"3-1531-3",{"$f":"COUNTIF(Parts!$G$5:$G$200, Wheels!B22)","v":1},{"$f":"COUNTIF(Parts!$F$5:$F$200, Wheels!C22)","v":17},{"$f":"IFERROR(IF(B22<>\"\",INDEX($B$4:$B$110,MATCH(0,COUNTIF($F$3:F21,$B$4:$B$110),0)),\"\"),\"\")","v":5426},{"$f":"IF(F22=\"\",\"\",SUMPRODUCT(--($B$4:$B$110=F22),$D$4:$D$110))","v":1},{"$f":"IFERROR(IF(C22<>\"\",INDEX($C$4:$C$110,MATCH(0,COUNTIF($H$3:H21,$C$4:$C$110),0)),\"\"),\"\")","v":""},{"$f":"IF(H22=\"\",\"\",SUMPRODUCT(--($C$4:$C$110=H22),$E$4:$E$110))","v":""}]
[20,"A6656","3-1531-3",{"$f":"COUNTIF(Parts!$G$5:$G$200, Wheels!B23)","v":1},{"$f":"COUNTIF(Parts!$F$5:$F$200, Wheels!C23)","v":17},{"$f":"IFERROR(IF(B23<>\"\",INDEX($B$4:$B$110,MATCH(0,COUNTIF($F$3:F22,$B$4:$B$110),0)),\"\"),\"\")","v":"A6656"},{"$f":"IF(F23=\"\",\"\",SUMPRODUCT(--($B$4:$B$110=F23),$D$4:$D$110))","v":1},{"$f":"IFERROR(IF(C23<>\"\",INDEX($C$4:$C$110,MATCH(0,COUNTIF($H$3:H22,$C$4:$C$110),0)),\"\"),\"\")","v":""},{"$f":"IF(H23=\"\",\"\",SUMPRODUCT(--($C$4:$C$110=H23),$E$4:$E$110))","v":""}]
[21,"A7028","3-1531-3",{"$f":"COUNTIF(Parts!$G$5:$G$200, Wheels!B24)","v":1},{"$f":"COUNTIF(Parts!$F$5:$F$200, Wheels!C24)","v":17},{"$f":"IFERROR(IF(B24<>\"\",INDEX($B$4:$B$110,MATCH(0,COUNTIF($F$3:F23,$B$4:$B$110),0)),\"\"),\"\")","v":"A7028"},{"$f":"IF(F24=\"\",\"\",SUMPRODUCT(--($B$4:$B$110=F24),$D$4:$D$110))","v":1},{"$f":"IFERROR(IF(C24<>\"\",INDEX($C$4:$C$110,MATCH(0,COUNTIF($H$3:H23,$C$4:$C$110),0)),\"\"),\"\")","v":""},{"$f":"IF(H24=\"\",\"\",SUMPRODUCT(--($C$4:$C$110=H24),$E$4:$E$110))","v":""}]
[22,"A6241","3-1531-3",{"$f":"COUNTIF(Parts!$G$5:$G$200, Wheels!B25)","v":1},{"$f":"COUNTIF(Parts!$F$5:$F$200, Wheels!C25)","v":17},{"$f":"IFERROR(IF(B25<>\"\",INDEX($B$4:$B$110,MATCH(0,COUNTIF($F$3:F24,$B$4:$B$110),0)),\"\"),\"\")","v":"A6241"},{"$f":"IF(F25=\"\",\"\",SUMPRODUCT(--($B$4:$B$110=F25),$D$4:$D$110))","v":1},{"$f":"IFERROR(IF(C25<>\"\",INDEX($C$4:$C$110,MATCH(0,COUNTIF($H$3:H24,$C$4:$C$110),0)),\"\"),\"\")","v":""},{"$f":"IF(H25=\"\",\"\",SUMPRODUCT(--($C$4:$C$110=H25),$E$4:$E$110))","v":""}]
[23,"A2693","3-1531-3",{"$f":"COUNTIF(Parts!$G$5:$G$200, Wheels!B26)","v":1},{"$f":"COUNTIF(Parts!$F$5:$F$200, Wheels!C26)","v":17},{"$f":"IFERROR(IF(B26<>\"\",INDEX($B$4:$B$110,MATCH(0,COUNTIF($F$3:F25,$B$4:$B$110),0)),\"\"),\"\")","v":"A2693"},{"$f":"IF(F26=\"\",\"\",SUMPRODUCT(--($B$4:$B$110=F26),$D$4:$D$110))","v":1},{"$f":"IFERROR(IF(C26<>\"\",INDEX($C$4:$C$110,MATCH(0,COUNTIF($H$3:H25,$C$4:$C$110),0)),\"\"),\"\")","v":""},{"$f":"IF(H26=\"\",\"\",SUMPRODUCT(--($C$4:$C$110=H26),$E$4:$E$110))","v":""}]
[24,4459,"3-1531-3",{"$f":"COUNTIF(Parts!$G$5:$G$200, Wheels!B27)","v":1},{"$f":"COUNTIF(Parts!$F$5:$F$200, Wheels!C27)","v":17},{"$f":"IFERROR(IF(B27<>\"\",INDEX($B$4:$B$110,MATCH(0,COUNTIF($F$3:F26,$B$4:$B$110),0)),\"\"),\"\")","v":4459},{"$f":"IF(F27=\"\",\"\",SUMPRODUCT(--($B$4:$B$110=F27),$D$4:$D$110))","v":1},{"$f":"IFERROR(IF(C27<>\"\",INDEX($C$4:$C$110,MATCH(0,COUNTIF($H$3:H26,$C$4:$C$110),0)),\"\"),\"\")","v":""},{"$f":"IF(H27=\"\",\"\",SUMPRODUCT(--($C$4:$C$110=H27),$E$4:$E$110))","v":""}]
[25,"0086","3-1531-3",{"$f":"COUNTIF(Parts!$G$5:$G$200, Wheels!B28)","v":1},{"$f":"COUNTIF(Parts!$F$5:$F$200, Wheels!C28)","v":17},{"$f":"IFERROR(IF(B28<>\"\",INDEX($B$4:$B$110,MATCH(0,COUNTIF($F$3:F27,$B$4:$B$110),0)),\"\"),\"\")","v":"0086"},{"$f":"IF(F28=\"\",\"\",SUMPRODUCT(--($B$4:$B$110=F28),$D$4:$D$110))","v":1},{"$f":"IFERROR(IF(C28<>\"\",INDEX($C$4:$C$110,MATCH(0,COUNTIF($H$3:H27,$C$4:$C$110),0)),\"\"),\"\")","v":""},{"$f":"IF(H28=\"\",\"\",SUMPRODUCT(--($C$4:$C$110=H28),$E$4:$E$110))","v":""}]
[26,"6901","3-1531-3",{"$f":"COUNTIF(Parts!$G$5:$G$200, Wheels!B29)","v":1},{"$f":"COUNTIF(Parts!$F$5:$F$200, Wheels!C29)","v":17},{"$f":"IFERROR(IF(B29<>\"\",INDEX($B$4:$B$110,MATCH(0,COUNTIF($F$3:F28,$B$4:$B$110),0)),\"\"),\"\")","v":"6901"},{"$f":"IF(F29=\"\",\"\",SUMPRODUCT(--($B$4:$B$110=F29),$D$4:$D$110))","v":1},{"$f":"IFERROR(IF(C29<>\"\",INDEX($C$4:$C$110,MATCH(0,COUNTIF($H$3:H28,$C$4:$C$110),0)),\"\"),\"\")","v":""},{"$f":"IF(H29=\"\",\"\",SUMPRODUCT(--($C$4:$C$110=H29),$E$4:$E$110))","v":""}]
[27,"0389","3-1531-3",{"$f":"COUNTIF(Parts!$G$5:$G$200, Wheels!B30)","v":1},{"$f":"COUNTIF(Parts!$F$5:$F$200, Wheels!C30)","v":17},{"$f":"IFERROR(IF(B30<>\"\",INDEX($B$4:$B$110,MATCH(0,COUNTIF($F$3:F29,$B$4:$B$110),0)),\"\"),\"\")","v":"0389"},{"$f":"IF(F30=\"\",\"\",SUMPRODUCT(--($B$4:$B$110=F30),$D$4:$D$110))","v":1},{"$f":"IFERROR(IF(C30<>\"\",INDEX($C$4:$C$110,MATCH(0,COUNTIF($H$3:H29,$C$4:$C$110),0)),\"\"),\"\")","v":""},{"$f":"IF(H30=\"\",\"\",SUMPRODUCT(--($C$4:$C$110=H30),$E$4:$E$110))","v":""}]
[28,"3023","3-1531-3",{"$f":"COUNTIF(Parts!$G$5:$G$200, Wheels!B31)","v":1},{"$f":"COUNTIF(Parts!$F$5:$F$200, Wheels!C31)","v":17},{"$f":"IFERROR(IF(B31<>\"\",INDEX($B$4:$B$110,MATCH(0,COUNTIF($F$3:F30,$B$4:$B$110),0)),\"\"),\"\")","v":"3023"},{"$f":"IF(F31=\"\",\"\",SUMPRODUCT(--($B$4:$B$110=F31),$D$4:$D$110))","v":1},{"$f":"IFERROR(IF(C31<>\"\",INDEX($C$4:$C$110,MATCH(0,COUNTIF($H$3:H30,$C$4:$C$110),0)),\"\"),\"\")","v":""},{"$f":"IF(H31=\"\",\"\",SUMPRODUCT(--($C$4:$C$110=H31),$E$4:$E$110))","v":""}]
[29,"8538","3-1531-3",{"$f":"COUNTIF(Parts!$G$5:$G$200, Wheels!B32)","v":1},{"$f":"COUNTIF(Parts!$F$5:$F$200, Wheels!C32)","v":17},{"$f":"IFERROR(IF(B32<>\"\",INDEX($B$4:$B$110,MATCH(0,COUNTIF($F$3:F31,$B$4:$B$110),0)),\"\"),\"\")","v":"8538"},{"$f":"IF(F32=\"\",\"\",SUMPRODUCT(--($B$4:$B$110=F32),$D$4:$D$110))","v":1},{"$f":"IFERROR(IF(C32<>\"\",INDEX($C$4:$C$110,MATCH(0,COUNTIF($H$3:H31,$C$4:$C$110),0)),\"\"),\"\")","v":""},{"$f":"IF(H32=\"\",\"\",SUMPRODUCT(--($C$4:$C$110=H32),$E$4:$E$110))","v":""}]
[30,"A4793","3-1531-3",{"$f":"COUNTIF(Parts!$G$5:$G$200, Wheels!B33)","v":1},{"$f":"COUNTIF(Parts!$F$5:$F$200, Wheels!C33)","v":17},{"$f":"IFERROR(IF(B33<>\"\",INDEX($B$4:$B$110,MATCH(0,COUNTIF($F$3:F32,$B$4:$B$110),0)),\"\"),\"\")","v":"A4793"},{"$f":"IF(F33=\"\",\"\",SUMPRODUCT(--($B$4:$B$110=F33),$D$4:$D$110))","v":1},{"$f":"IFERROR(IF(C33<>\"\",INDEX($C$4:$C$110,MATCH(0,COUNTIF($H$3:H32,$C$4:$C$110),0)),\"\"),\"\")","v":""},{"$f":"IF(H33=\"\",\"\",SUMPRODUCT(--($C$4:$C$110=H33),$E$4:$E$110))","v":""}]
[31,"7091","3-1531-3",{"$f":"COUNTIF(Parts!$G$5:$G$200, Wheels!B34)","v":1},{"$f":"COUNTIF(Parts!$F$5:$F$200, Wheels!C34)","v":17},{"$f":"IFERROR(IF(B34<>\"\",INDEX($B$4:$B$110,MATCH(0,COUNTIF($F$3:F33,$B$4:$B$110),0)),\"\"),\"\")","v":"7091"},{"$f":"IF(F34=\"\",\"\",SUMPRODUCT(--($B$4:$B$110=F34),$D$4:$D$110))","v":1},{"$f":"IFERROR(IF(C34<>\"\",INDEX($C$4:$C$110,MATCH(0,COUNTIF($H$3:H33,$C$4:$C$110),0)),\"\"),\"\")","v":""},{"$f":"IF(H34=\"\",\"\",SUMPRODUCT(--($C$4:$C$110=H34),$E$4:$E$110))","v":""}]
[32,"9424","3-1531-3",{"$f":"COUNTIF(Parts!$G$5:$G$200, Wheels!B35)","v":1},{"$f":"COUNTIF(Parts!$F$5:$F$200, Wheels!C35)","v":17},{"$f":"IFERROR(IF(B35<>\"\",INDEX($B$4:$B$110,MATCH(0,COUNTIF($F$3:F34,$B$4:$B$110),0)),\"\"),\"\")","v":"9424"},{"$f":"IF(F35=\"\",\"\",SUMPRODUCT(--($B$4:$B$110=F35),$D$4:$D$110))","v":1},{"$f":"IFERROR(IF(C35<>\"\",INDEX($C$4:$C$110,MATCH(0,COUNTIF($H$3:H34,$C$4:$C$110),0)),\"\"),\"\")","v":""},{"$f":"IF(H35=\"\",\"\",SUMPRODUCT(--($C$4:$C$110=H35),$E$4:$E$110))","v":""}]
[33,500,"3-1531-4",{"$f":"COUNTIF(Parts!$G$5:$G$200, Wheels!B36)","v":1},{"$f":"COUNTIF(Parts!$F$5:$F$200, Wheels!C36)","v":1},{"$f":"IFERROR(IF(B36<>\"\",INDEX($B$4:$B$110,MATCH(0,COUNTIF($F$3:F35,$B$4:$B$110),0)),\"\"),\"\")","v":500},{"$f":"IF(F36=\"\",\"\",SUMPRODUCT(--($B$4:$B$110=F36),$D$4:$D$110))","v":1},{"$f":"IFERROR(IF(C36<>\"\",INDEX($C$4:$C$110,MATCH(0,COUNTIF($H$3:H35,$C$4:$C$110),0)),\"\"),\"\")","v":""},{"$f":"IF(H36=\"\",\"\",SUMPRODUCT(--($C$4:$C$110=H36),$E$4:$E$110))","v":""}]
[34,900,"3-1531-5",{"$f":"COUNTIF(Parts!$G$5:$G$200, Wheels!B37)","v":1},{"$f":"COUNTIF(Parts!$F$5:$F$200, Wheels!C37)","v":1},{"$f":"IFERROR(IF(B37<>\"\",INDEX($B$4:$B$110,MATCH(0,COUNTIF($F$3:F36,$B$4:$B$110),0)),\"\"),\"\")","v":900},{"$f":"IF(F37=\"\",\"\",SUMPRODUCT(--($B$4:$B$110=F37),$D$4:$D$110))","v":1},{"$f":"IFERROR(IF(C37<>\"\",INDEX($C$4:$C$110,MATCH(0,COUNTIF($H$3:H36,$C$4:$C$110),0)),\"\"),\"\")","v":""},{"$f":"IF(H37=\"\",\"\",SUMPRODUCT(--($C$4:$C$110=H37),$E$4:$E$110))","v":""}]
[35,5200,null,{"$f":"COUNTIF(Parts!$G$5:$G$200, Wheels!B38)","v":1},{"$f":"COUNTIF(Parts!$F$5:$F$200, Wheels!C38)","v":0},{"$f":"IFERROR(IF(B38<>\"\",INDEX($B$4:$B$110,MATCH(0,COUNTIF($F$3:F37,$B$4:$B$110),0)),\"\"),\"\")","v":5200},{"$f":"IF(F38=\"\",\"\",SUMPRODUCT(--($B$4:$B$110=F38),$D$4:$D$110))","v":1},{"$f":"IFERROR(IF(C38<>\"\",INDEX($C$4:$C$110,MATCH(0,COUNTIF($H$3:H37,$C$4:$C$110),0)),\"\"),\"\")","v":""},{"$f":"IF(H38=\"\",\"\",SUMPRODUCT(--($C$4:$C$110=H38),$E$4:$E$110))","v":""}]
[36,null,null,{"$f":"COUNTIF(Parts!$G$5:$G$200, Wheels!B39)","v":0},{"$f":"COUNTIF(Parts!$F$5:$F$200, Wheels!C39)","v":0},{"$f":"IFERROR(IF(B39<>\"\",INDEX($B$4:$B$110,MATCH(0,COUNTIF($F$3:F38,$B$4:$B$110),0)),\"\"),\"\")","v":""},{"$f":"IF(F39=\"\",\"\",SUMPRODUCT(--($B$4:$B$110=F39),$D$4:$D$110))","v":""},{"$f":"IFERROR(IF(C39<>\"\",INDEX($C$4:$C$110,MATCH(0,COUNTIF($H$3:H38,$C$4:$C$110),0)),\"\"),\"\")","v":""},{"$f":"IF(H39=\"\",\"\",SUMPRODUCT(--($C$4:$C$110=H39),$E$4:$E$110))","v":""}]
[37,null,null,{"$f":"COUNTIF(Parts!$G$5:$G$200, Wheels!B40)","v":0},{"$f":"COUNTIF(Parts!$F$5:$F$200, Wheels!C40)","v":0},{"$f":"IFERROR(IF(B40<>\"\",INDEX($B$4:$B$110,MATCH(0,COUNTIF($F$3:F39,$B$4:$B$110),0)),\"\"),\"\")","v":""},{"$f":"IF(F40=\"\",\"\",SUMPRODUCT(--($B$4:$B$110=F40),$D$4:$D$110))","v":""},{"$f":"IFERROR(IF(C40<>\"\",INDEX($C$4:$C$110,MATCH(0,COUNTIF($H$3:H39,$C$4:$C$110),0)),\"\"),\"\")","v":""},{"$f":"IF(H40=\"\",\"\",SUMPRODUCT(--($C$4:$C$110=H40),$E$4:$E$110))","v":""}]
[38,null,null,{"$f":"COUNTIF(Parts!$G$5:$G$200, Wheels!B41)","v":0},{"$f":"COUNTIF(Parts!$F$5:$F$200, Wheels!C41)","v":0},{"$f":"IFERROR(IF(B41<>\"\",INDEX($B$4:$B$110,MATCH(0,COUNTIF($F$3:F40,$B$4:$B$110),0)),\"\"),\"\")","v":""},{"$f":"IF(F41=\"\",\"\",SUMPRODUCT(--($B$4:$B$110=F41),$D$4:$D$110))","v":""},{"$f":"IFERROR(IF(C41<>\"\",INDEX($C$4:$C$110,MATCH(0,COUNTIF($H$3:H40,$C$4:$C$110),0)),\"\"),\"\")","v":""},{"$f":"IF(H41=\"\",\"\",SUMPRODUCT(--($C$4:$C$110=H41),$E$4:$E$110))","v":""}]
[39,null,null,{"$f":"COUNTIF(Parts!$G$5:$G$200, Wheels!B42)","v":0},{"$f":"COUNTIF(Parts!$F$5:$F$200, Wheels!C42)","v":0},{"$f":"IFERROR(IF(B42<>\"\",INDEX($B$4:$B$110,MATCH(0,COUNTIF($F$3:F41,$B$4:$B$110),0)),\"\"),\"\")","v":""},{"$f":"IF(F42=\"\",\"\",SUMPRODUCT(--($B$4:$B$110=F42),$D$4:$D$110))","v":""},{"$f":"IFERROR(IF(C42<>\"\",INDEX($C$4:$C$110,MATCH(0,COUNTIF($H$3:H41,$C$4:$C$110),0)),\"\"),\"\")","v":""},{"$f":"IF(H42=\"\",\"\",SUMPRODUCT(--($C$4:$C$110=H42),$E$4:$E$110))","v":""}]
[40,null,null,{"$f":"COUNTIF(Parts!$G$5:$G$200, Wheels!B43)","v":0},{"$f":"COUNTIF(Parts!$F$5:$F$200, Wheels!C43)","v":0},{"$f":"IFERROR(IF(B43<>\"\",INDEX($B$4:$B$110,MATCH(0,COUNTIF($F$3:F42,$B$4:$B$110),0)),\"\"),\"\")","v":""},{"$f":"IF(F43=\"\",\"\",SUMPRODUCT(--($B$4:$B$110=F43),$D$4:$D$110))","v":""},{"$f":"IFERROR(IF(C43<>\"\",INDEX($C$4:$C$110,MATCH(0,COUNTIF($H$3:H42,$C$4:$C$110),0)),\"\"),\"\")","v":""},{"$f":"IF(H43=\"\",\"\",SUMPRODUCT(--($C$4:$C$110=H43),$E$4:$E$110))","v":""}]
[41,null,null,{"$f":"COUNTIF(Parts!$G$5:$G$200, Wheels!B44)","v":0},{"$f":"COUNTIF(Parts!$F$5:$F$200, Wheels!C44)","v":0},{"$f":"IFERROR(IF(B44<>\"\",INDEX($B$4:$B$110,MATCH(0,COUNTIF($F$3:F43,$B$4:$B$110),0)),\"\"),\"\")","v":""},{"$f":"IF(F44=\"\",\"\",SUMPRODUCT(--($B$4:$B$110=F44),$D$4:$D$110))","v":""},{"$f":"IFERROR(IF(C44<>\"\",INDEX($C$4:$C$110,MATCH(0,COUNTIF($H$3:H43,$C$4:$C$110),0)),\"\"),\"\")","v":""},{"$f":"IF(H44=\"\",\"\",SUMPRODUCT(--($C$4:$C$110=H44),$E$4:$E$110))","v":""}]
[42,null,null,{"$f":"COUNTIF(Parts!$G$5:$G$200, Wheels!B45)","v":0},{"$f":"COUNTIF(Parts!$F$5:$F$200, Wheels!C45)","v":0},{"$f":"IFERROR(IF(B45<>\"\",INDEX($B$4:$B$110,MATCH(0,COUNTIF($F$3:F44,$B$4:$B$110),0)),\"\"),\"\")","v":""},{"$f":"IF(F45=\"\",\"\",SUMPRODUCT(--($B$4:$B$110=F45),$D$4:$D$110))","v":""},{"$f":"IFERROR(IF(C45<>\"\",INDEX($C$4:$C$110,MATCH(0,COUNTIF($H$3:H44,$C$4:$C$110),0)),\"\"),\"\")","v":""},{"$f":"IF(H45=\"\",\"\",SUMPRODUCT(--($C$4:$C$110=H45),$E$4:$E$110))","v":""}]
[43,null,null,{"$f":"COUNTIF(Parts!$G$5:$G$200, Wheels!B46)","v":0},{"$f":"COUNTIF(Parts!$F$5:$F$200, Wheels!C46)","v":0},{"$f":"IFERROR(IF(B46<>\"\",INDEX($B$4:$B$110,MATCH(0,COUNTIF($F$3:F45,$B$4:$B$110),0)),\"\"),\"\")","v":""},{"$f":"IF(F46=\"\",\"\",SUMPRODUCT(--($B$4:$B$110=F46),$D$4:$D$110))","v":""},{"$f":"IFERROR(IF(C46<>\"\",INDEX($C$4:$C$110,MATCH(0,COUNTIF($H$3:H45,$C$4:$C$110),0)),\"\"),\"\")","v":""},{"$f":"IF(H46=\"\",\"\",SUMPRODUCT(--($C$4:$C$110=H46),$E$4:$E$110))","v":""}]
[44,null,null,{"$f":"COUNTIF(Parts!$G$5:$G$200, Wheels!B47)","v":0},{"$f":"COUNTIF(Parts!$F$5:$F$200, Wheels!C47)","v":0},{"$f":"IFERROR(IF(B47<>\"\",INDEX($B$4:$B$110,MATCH(0,COUNTIF($F$3:F46,$B$4:$B$110),0)),\"\"),\"\")","v":""},{"$f":"IF(F47=\"\",\"\",SUMPRODUCT(--($B$4:$B$110=F47),$D$4:$D$110))","v":""},{"$f":"IFERROR(IF(C47<>\"\",INDEX($C$4:$C$110,MATCH(0,COUNTIF($H$3:H46,$C$4:$C$110),0)),\"\"),\"\")","v":""},{"$f":"IF(H47=\"\",\"\",SUMPRODUCT(--($C$4:$C$110=H47),$E$4:$E$110))","v":""}]
[45,null,null,{"$f":"COUNTIF(Parts!$G$5:$G$200, Wheels!B48)","v":0},{"$f":"COUNTIF(Parts!$F$5:$F$200, Wheels!C48)","v":0},{"$f":"IFERROR(IF(B48<>\"\",INDEX($B$4:$B$110,MATCH(0,COUNTIF($F$3:F47,$B$4:$B$110),0)),\"\"),\"\")","v":""},{"$f":"IF(F48=\"\",\"\",SUMPRODUCT(--($B$4:$B$110=F48),$D$4:$D$110))","v":""},{"$f":"IFERROR(IF(C48<>\"\",INDEX($C$4:$C$110,MATCH(0,COUNTIF($H$3:H47,$C$4:$C$110),0)),\"\"),\"\")","v":""},{"$f":"IF(H48=\"\",\"\",SUMPRODUCT(--($C$4:$C$110=H48),$E$4:$E$110))","v":""}]
[46,null,null,{"$f":"COUNTIF(Parts!$G$5:$G$200, Wheels!B49)","v":0},{"$f":"COUNTIF(Parts!$F$5:$F$200, Wheels!C49)","v":0},{"$f":"IFERROR(IF(B49<>\"\",INDEX($B$4:$B$110,MATCH(0,COUNTIF($F$3:F48,$B$4:$B$110),0)),\"\"),\"\")","v":""},{"$f":"IF(F49=\"\",\"\",SUMPRODUCT(--($B$4:$B$110=F49),$D$4:$D$110))","v":""},{"$f":"IFERROR(IF(C49<>\"\",INDEX($C$4:$C$110,MATCH(0,COUNTIF($H$3:H48,$C$4:$C$110),0)),\"\"),\"\")","v":""},{"$f":"IF(H49=\"\",\"\",SUMPRODUCT(--($C$4:$C$110=H49),$E$4:$E$110))","v":""}]
[47,null,null,{"$f":"COUNTIF(Parts!$G$5:$G$200, Wheels!B50)","v":0},{"$f":"COUNTIF(Parts!$F$5:$F$200, Wheels!C50)","v":0},{"$f":"IFERROR(IF(B50<>\"\",INDEX($B$4:$B$110,MATCH(0,COUNTIF($F$3:F49,$B$4:$B$110),0)),\"\"),\"\")","v":""},{"$f":"IF(F50=\"\",\"\",SUMPRODUCT(--($B$4:$B$110=F50),$D$4:$D$110))","v":""},{"$f":"IFERROR(IF(C50<>\"\",INDEX($C$4:$C$110,MATCH(0,COUNTIF($H$3:H49,$C$4:$C$110),0)),\"\"),\"\")","v":""},{"$f":"IF(H50=\"\",\"\",SUMPRODUCT(--($C$4:$C$110=H50),$E$4:$E$110))","v":""}]
[48,null,null,{"$f":"COUNTIF(Parts!$G$5:$G$200, Wheels!B51)","v":0},{"$f":"COUNTIF(Parts!$F$5:$F$200, Wheels!C51)","v":0},{"$f":"IFERROR(IF(B51<>\"\",INDEX($B$4:$B$110,MATCH(0,COUNTIF($F$3:F50,$B$4:$B$110),0)),\"\"),\"\")","v":""},{"$f":"IF(F51=\"\",\"\",SUMPRODUCT(--($B$4:$B$110=F51),$D$4:$D$110))","v":""},{"$f":"IFERROR(IF(C51<>\"\",INDEX($C$4:$C$110,MATCH(0,COUNTIF($H$3:H50,$C$4:$C$110),0)),\"\"),\"\")","v":""},{"$f":"IF(H51=\"\",\"\",SUMPRODUCT(--($C$4:$C$110=H51),$E$4:$E$110))","v":""}]
[49,null,null,{"$f":"COUNTIF(Parts!$G$5:$G$200, Wheels!B52)","v":0},{"$f":"COUNTIF(Parts!$F$5:$F$200, Wheels!C52)","v":0},{"$f":"IFERROR(IF(B52<>\"\",INDEX($B$4:$B$110,MATCH(0,COUNTIF($F$3:F51,$B$4:$B$110),0)),\"\"),\"\")","v":""},{"$f":"IF(F52=\"\",\"\",SUMPRODUCT(--($B$4:$B$110=F52),$D$4:$D$110))","v":""},{"$f":"IFERROR(IF(C52<>\"\",INDEX($C$4:$C$110,MATCH(0,COUNTIF($H$3:H51,$C$4:$C$110),0)),\"\"),\"\")","v":""},{"$f":"IF(H52=\"\",\"\",SUMPRODUCT(--($C$4:$C$110=H52),$E$4:$E$110))","v":""}]
[50,null,null,{"$f":"COUNTIF(Parts!$G$5:$G$200, Wheels!B53)","v":0},{"$f":"COUNTIF(Parts!$F$5:$F$200, Wheels!C53)","v":0},{"$f":"IFERROR(IF(B53<>\"\",INDEX($B$4:$B$110,MATCH(0,COUNTIF($F$3:F52,$B$4:$B$110),0)),\"\"),\"\")","v":""},{"$f":"IF(F53=\"\",\"\",SUMPRODUCT(--($B$4:$B$110=F53),$D$4:$D$110))","v":""},{"$f":"IFERROR(IF(C53<>\"\",INDEX($C$4:$C$110,MATCH(0,COUNTIF($H$3:H52,$C$4:$C$110),0)),\"\"),\"\")","v":""},{"$f":"IF(H53=\"\",\"\",SUMPRODUCT(--($C$4:$C$110=H53),$E$4:$E$110))","v":""}]
[51,null,null,{"$f":"COUNTIF(Parts!$G$5:$G$200, Wheels!B54)","v":0},{"$f":"COUNTIF(Parts!$F$5:$F$200, Wheels!C54)","v":0},{"$f":"IFERROR(IF(B54<>\"\",INDEX($B$4:$B$110,MATCH(0,COUNTIF($F$3:F53,$B$4:$B$110),0)),\"\"),\"\")","v":""},{"$f":"IF(F54=\"\",\"\",SUMPRODUCT(--($B$4:$B$110=F54),$D$4:$D$110))","v":""},{"$f":"IFERROR(IF(C54<>\"\",INDEX($C$4:$C$110,MATCH(0,COUNTIF($H$3:H53,$C$4:$C$110),0)),\"\"),\"\")","v":""},{"$f":"IF(H54=\"\",\"\",SUMPRODUCT(--($C$4:$C$110=H54),$E$4:$E$110))","v":""}]
[52,null,null,{"$f":"COUNTIF(Parts!$G$5:$G$200, Wheels!B55)","v":0},{"$f":"COUNTIF(Parts!$F$5:$F$200, Wheels!C55)","v":0},{"$f":"IFERROR(IF(B55<>\"\",INDEX($B$4:$B$110,MATCH(0,COUNTIF($F$3:F54,$B$4:$B$110),0)),\"\"),\"\")","v":""},{"$f":"IF(F55=\"\",\"\",SUMPRODUCT(--($B$4:$B$110=F55),$D$4:$D$110))","v":""},{"$f":"IFERROR(IF(C55<>\"\",INDEX($C$4:$C$110,MATCH(0,COUNTIF($H$3:H54,$C$4:$C$110),0)),\"\"),\"\")","v":""},{"$f":"IF(H55=\"\",\"\",SUMPRODUCT(--($C$4:$C$110=H55),$E$4:$E$110))","v":""}]
[53,null,null,{"$f":"COUNTIF(Parts!$G$5:$G$200, Wheels!B56)","v":0},{"$f":"COUNTIF(Parts!$F$5:$F$200, Wheels!C56)","v":0},{"$f":"IFERROR(IF(B56<>\"\",INDEX($B$4:$B$110,MATCH(0,COUNTIF($F$3:F55,$B$4:$B$110),0)),\"\"),\"\")","v":""},{"$f":"IF(F56=\"\",\"\",SUMPRODUCT(--($B$4:$B$110=F56),$D$4:$D$110))","v":""},{"$f":"IFERROR(IF(C56<>\"\",INDEX($C$4:$C$110,MATCH(0,COUNTIF($H$3:H55,$C$4:$C$110),0)),\"\"),\"\")","v":""},{"$f":"IF(H56=\"\",\"\",SUMPRODUCT(--($C$4:$C$110=H56),$E$4:$E$110))","v":""}]
[54,null,null,{"$f":"COUNTIF(Parts!$G$5:$G$200, Wheels!B57)","v":0},{"$f":"COUNTIF(Parts!$F$5:$F$200, Wheels!C57)","v":0},{"$f":"IFERROR(IF(B57<>\"\",INDEX($B$4:$B$110,MATCH(0,COUNTIF($F$3:F56,$B$4:$B$110),0)),\"\"),\"\")","v":""},{"$f":"IF(F57=\"\",\"\",SUMPRODUCT(--($B$4:$B$110=F57),$D$4:$D$110))","v":""},{"$f":"IFERROR(IF(C57<>\"\",INDEX($C$4:$C$110,MATCH(0,COUNTIF($H$3:H56,$C$4:$C$110),0)),\"\"),\"\")","v":""},{"$f":"IF(H57=\"\",\"\",SUMPRODUCT(--($C$4:$C$110=H57),$E$4:$E$110))","v":""}]
[55,null,null,{"$f":"COUNTIF(Parts!$G$5:$G$200, Wheels!B58)","v":0},{"$f":"COUNTIF(Parts!$F$5:$F$200, Wheels!C58)","v":0},{"$f":"IFERROR(IF(B58<>\"\",INDEX($B$4:$B$110,MATCH(0,COUNTIF($F$3:F57,$B$4:$B$110),0)),\"\"),\"\")","v":""},{"$f":"IF(F58=\"\",\"\",SUMPRODUCT(--($B$4:$B$110=F58),$D$4:$D$110))","v":""},{"$f":"IFERROR(IF(C58<>\"\",INDEX($C$4:$C$110,MATCH(0,COUNTIF($H$3:H57,$C$4:$C$110),0)),\"\"),\"\")","v":""},{"$f":"IF(H58=\"\",\"\",SUMPRODUCT(--($C$4:$C$110=H58),$E$4:$E$110))","v":""}]
[56,null,null,{"$f":"COUNTIF(Parts!$G$5:$G$200, Wheels!B59)","v":0},{"$f":"COUNTIF(Parts!$F$5:$F$200, Wheels!C59)","v":0},{"$f":"IFERROR(IF(B59<>\"\",INDEX($B$4:$B$110,MATCH(0,COUNTIF($F$3:F58,$B$4:$B$110),0)),\"\"),\"\")","v":""},{"$f":"IF(F59=\"\",\"\",SUMPRODUCT(--($B$4:$B$110=F59),$D$4:$D$110))","v":""},{"$f":"IFERROR(IF(C59<>\"\",INDEX($C$4:$C$110,MATCH(0,COUNTIF($H$3:H58,$C$4:$C$110),0)),\"\"),\"\")","v":""},{"$f":"IF(H59=\"\",\"\",SUMPRODUCT(--($C$4:$C$110=H59),$E$4:$E$110))","v":""}]
[57,null,null,{"$f":"COUNTIF(Parts!$G$5:$G$200, Wheels!B60)","v":0},{"$f":"COUNTIF(Parts!$F$5:$F$200, Wheels!C60)","v":0},{"$f":"IFERROR(IF(B60<>\"\",INDEX($B$4:$B$110,MATCH(0,COUNTIF($F$3:F59,$B$4:$B$110),0)),\"\"),\"\")","v":""},{"$f":"IF(F60=\"\",\"\",SUMPRODUCT(--($B$4:$B$110=F60),$D$4:$D$110))","v":""},{"$f":"IFERROR(IF(C60<>\"\",INDEX($C$4:$C$110,MATCH(0,COUNTIF($H$3:H59,$C$4:$C$110),0)),\"\"),\"\")","v":""},{"$f":"IF(H60=\"\",\"\",SUMPRODUCT(--($C$4:$C$110=H60),$E$4:$E$110))","v":""}]
[58,null,null,{"$f":"COUNTIF(Parts!$G$5:$G$200, Wheels!B61)","v":0},{"$f":"COUNTIF(Parts!$F$5:$F$200, Wheels!C61)","v":0},{"$f":"IFERROR(IF(B61<>\"\",INDEX($B$4:$B$110,MATCH(0,COUNTIF($F$3:F60,$B$4:$B$110),0)),\"\"),\"\")","v":""},{"$f":"IF(F61=\"\",\"\",SUMPRODUCT(--($B$4:$B$110=F61),$D$4:$D$110))","v":""},{"$f":"IFERROR(IF(C61<>\"\",INDEX($C$4:$C$110,MATCH(0,COUNTIF($H$3:H60,$C$4:$C$110),0)),\"\"),\"\")","v":""},{"$f":"IF(H61=\"\",\"\",SUMPRODUCT(--($C$4:$C$110=H61),$E$4:$E$110))","v":""}]
[59,null,null,{"$f":"COUNTIF(Parts!$G$5:$G$200, Wheels!B62)","v":0},{"$f":"COUNTIF(Parts!$F$5:$F$200, Wheels!C62)","v":0},{"$f":"IFERROR(IF(B62<>\"\",INDEX($B$4:$B$110,MATCH(0,COUNTIF($F$3:F61,$B$4:$B$110),0)),\"\"),\"\")","v":""},{"$f":"IF(F62=\"\",\"\",SUMPRODUCT(--($B$4:$B$110=F62),$D$4:$D$110))","v":""},{"$f":"IFERROR(IF(C62<>\"\",INDEX($C$4:$C$110,MATCH(0,COUNTIF($H$3:H61,$C$4:$C$110),0)),\"\"),\"\")","v":""},{"$f":"IF(H62=\"\",\"\",SUMPRODUCT(--($C$4:$C$110=H62),$E$4:$E$110))","v":""}]
[60,null,null,{"$f":"COUNTIF(Parts!$G$5:$G$200, Wheels!B63)","v":0},{"$f":"COUNTIF(Parts!$F$5:$F$200, Wheels!C63)","v":0},{"$f":"IFERROR(IF(B63<>\"\",INDEX($B$4:$B$110,MATCH(0,COUNTIF($F$3:F62,$B$4:$B$110),0)),\"\"),\"\")","v":""},{"$f":"IF(F63=\"\",\"\",SUMPRODUCT(--($B$4:$B$110=F63),$D$4:$D$110))","v":""},{"$f":"IFERROR(IF(C63<>\"\",INDEX($C$4:$C$110,MATCH(0,COUNTIF($H$3:H62,$C$4:$C$110),0)),\"\"),\"\")","v":""},{"$f":"IF(H63=\"\",\"\",SUMPRODUCT(--($C$4:$C$110=H63),$E$4:$E$110))","v":""}]
[61,null,null,{"$f":"COUNTIF(Parts!$G$5:$G$200, Wheels!B64)","v":0},{"$f":"COUNTIF(Parts!$F$5:$F$200, Wheels!C64)","v":0},{"$f":"IFERROR(IF(B64<>\"\",INDEX($B$4:$B$110,MATCH(0,COUNTIF($F$3:F63,$B$4:$B$110),0)),\"\"),\"\")","v":""},{"$f":"IF(F64=\"\",\"\",SUMPRODUCT(--($B$4:$B$110=F64),$D$4:$D$110))","v":""},{"$f":"IFERROR(IF(C64<>\"\",INDEX($C$4:$C$110,MATCH(0,COUNTIF($H$3:H63,$C$4:$C$110),0)),\"\"),\"\")","v":""},{"$f":"IF(H64=\"\",\"\",SUMPRODUCT(--($C$4:$C$110=H64),$E$4:$E$110))","v":""}]
[62,null,null,{"$f":"COUNTIF(Parts!$G$5:$G$200, Wheels!B65)","v":0},{"$f":"COUNTIF(Parts!$F$5:$F$200, Wheels!C65)","v":0},{"$f":"IFERROR(IF(B65<>\"\",INDEX($B$4:$B$110,MATCH(0,COUNTIF($F$3:F64,$B$4:$B$110),0)),\"\"),\"\")","v":""},{"$f":"IF(F65=\"\",\"\",SUMPRODUCT(--($B$4:$B$110=F65),$D$4:$D$110))","v":""},{"$f":"IFERROR(IF(C65<>\"\",INDEX($C$4:$C$110,MATCH(0,COUNTIF($H$3:H64,$C$4:$C$110),0)),\"\"),\"\")","v":""},{"$f":"IF(H65=\"\",\"\",SUMPRODUCT(--($C$4:$C$110=H65),$E$4:$E$110))","v":""}]
[63,null,null,{"$f":"COUNTIF(Parts!$G$5:$G$200, Wheels!B66)","v":0},{"$f":"COUNTIF(Parts!$F$5:$F$200, Wheels!C66)","v":0},{"$f":"IFERROR(IF(B66<>\"\",INDEX($B$4:$B$110,MATCH(0,COUNTIF($F$3:F65,$B$4:$B$110),0)),\"\"),\"\")","v":""},{"$f":"IF(F66=\"\",\"\",SUMPRODUCT(--($B$4:$B$110=F66),$D$4:$D$110))","v":""},{"$f":"IFERROR(IF(C66<>\"\",INDEX($C$4:$C$110,MATCH(0,COUNTIF($H$3:H65,$C$4:$C$110),0)),\"\"),\"\")","v":""},{"$f":"IF(H66=\"\",\"\",SUMPRODUCT(--($C$4:$C$110=H66),$E$4:$E$110))","v":""}]
[64,null,null,{"$f":"COUNTIF(Parts!$G$5:$G$200, Wheels!B67)","v":0},{"$f":"COUNTIF(Parts!$F$5:$F$200, Wheels!C67)","v":0},{"$f":"IFERROR(IF(B67<>\"\",INDEX($B$4:$B$110,MATCH(0,COUNTIF($F$3:F66,$B$4:$B$110),0)),\"\"),\"\")","v":""},{"$f":"IF(F67=\"\",\"\",SUMPRODUCT(--($B$4:$B$110=F67),$D$4:$D$110))","v":""},{"$f":"IFERROR(IF(C67<>\"\",INDEX($C$4:$C$110,MATCH(0,COUNTIF($H$3:H66,$C$4:$C$110),0)),\"\"),\"\")","v":""},{"$f":"IF(H67=\"\",\"\",SUMPRODUCT(--($C$4:$C$110=H67),$E$4:$E$110))","v":""}]
[65,null,null,{"$f":"COUNTIF(Parts!$G$5:$G$200, Wheels!B68)","v":0},{"$f":"COUNTIF(Parts!$F$5:$F$200, Wheels!C68)","v":0},{"$f":"IFERROR(IF(B68<>\"\",INDEX($B$4:$B$110,MATCH(0,COUNTIF($F$3:F67,$B$4:$B$110),0)),\"\"),\"\")","v":""},{"$f":"IF(F68=\"\",\"\",SUMPRODUCT(--($B$4:$B$110=F68),$D$4:$D$110))","v":""},{"$f":"IFERROR(IF(C68<>\"\",INDEX($C$4:$C$110,MATCH(0,COUNTIF($H$3:H67,$C$4:$C$110),0)),\"\"),\"\")","v":""},{"$f":"IF(H68=\"\",\"\",SUMPRODUCT(--($C$4:$C$110=H68),$E$4:$E$110))","v":""}]
[66,null,null,{"$f":"COUNTIF(Parts!$G$5:$G$200, Wheels!B69)","v":0},{"$f":"COUNTIF(Parts!$F$5:$F$200, Wheels!C69)","v":0},{"$f":"IFERROR(IF(B69<>\"\",INDEX($B$4:$B$110,MATCH(0,COUNTIF($F$3:F68,$B$4:$B$110),0)),\"\"),\"\")","v":""},{"$f":"IF(F69=\"\",\"\",SUMPRODUCT(--($B$4:$B$110=F69),$D$4:$D$110))","v":""},{"$f":"IFERROR(IF(C69<>\"\",INDEX($C$4:$C$110,MATCH(0,COUNTIF($H$3:H68,$C$4:$C$110),0)),\"\"),\"\")","v":""},{"$f":"IF(H69=\"\",\"\",SUMPRODUCT(--($C$4:$C$110=H69),$E$4:$E$110))","v":""}]
[67,null,null,{"$f":"COUNTIF(Parts!$G$5:$G$200, Wheels!B70)","v":0},{"$f":"COUNTIF(Parts!$F$5:$F$200, Wheels!C70)","v":0},{"$f":"IFERROR(IF(B70<>\"\",INDEX($B$4:$B$110,MATCH(0,COUNTIF($F$3:F69,$B$4:$B$110),0)),\"\"),\"\")","v":""},{"$f":"IF(F70=\"\",\"\",SUMPRODUCT(--($B$4:$B$110=F70),$D$4:$D$110))","v":""},{"$f":"IFERROR(IF(C70<>\"\",INDEX($C$4:$C$110,MATCH(0,COUNTIF($H$3:H69,$C$4:$C$110),0)),\"\"),\"\")","v":""},{"$f":"IF(H70=\"\",\"\",SUMPRODUCT(--($C$4:$C$110=H70),$E$4:$E$110))","v":""}]
[68,null,null,{"$f":"COUNTIF(Parts!$G$5:$G$200, Wheels!B71)","v":0},{"$f":"COUNTIF(Parts!$F$5:$F$200, Wheels!C71)","v":0},{"$f":"IFERROR(IF(B71<>\"\",INDEX($B$4:$B$110,MATCH(0,COUNTIF($F$3:F70,$B$4:$B$110),0)),\"\"),\"\")","v":""},{"$f":"IF(F71=\"\",\"\",SUMPRODUCT(--($B$4:$B$110=F71),$D$4:$D$110))","v":""},{"$f":"IFERROR(IF(C71<>\"\",INDEX($C$4:$C$110,MATCH(0,COUNTIF($H$3:H70,$C$4:$C$110),0)),\"\"),\"\")","v":""},{"$f":"IF(H71=\"\",\"\",SUMPRODUCT(--($C$4:$C$110=H71),$E$4:$E$110))","v":""}]
[69,null,null,{"$f":"COUNTIF(Parts!$G$5:$G$200, Wheels!B72)","v":0},{"$f":"COUNTIF(Parts!$F$5:$F$200, Wheels!C72)","v":0},{"$f":"IFERROR(IF(B72<>\"\",INDEX($B$4:$B$110,MATCH(0,COUNTIF($F$3:F71,$B$4:$B$110),0)),\"\"),\"\")","v":""},{"$f":"IF(F72=\"\",\"\",SUMPRODUCT(--($B$4:$B$110=F72),$D$4:$D$110))","v":""},{"$f":"IFERROR(IF(C72<>\"\",INDEX($C$4:$C$110,MATCH(0,COUNTIF($H$3:H71,$C$4:$C$110),0)),\"\"),\"\")","v":""},{"$f":"IF(H72=\"\",\"\",SUMPRODUCT(--($C$4:$C$110=H72),$E$4:$E$110))","v":""}]
[70,null,null,{"$f":"COUNTIF(Parts!$G$5:$G$200, Wheels!B73)","v":0},{"$f":"COUNTIF(Parts!$F$5:$F$200, Wheels!C73)","v":0},{"$f":"IFERROR(IF(B73<>\"\",INDEX($B$4:$B$110,MATCH(0,COUNTIF($F$3:F72,$B$4:$B$110),0)),\"\"),\"\")","v":""},{"$f":"IF(F73=\"\",\"\",SUMPRODUCT(--($B$4:$B$110=F73),$D$4:$D$110))","v":""},{"$f":"IFERROR(IF(C73<>\"\",INDEX($C$4:$C$110,MATCH(0,COUNTIF($H$3:H72,$C$4:$C$110),0)),\"\"),\"\")","v":""},{"$f":"IF(H73=\"\",\"\",SUMPRODUCT(--($C$4:$C$110=H73),$E$4:$E$110))","v":""}]
[71,null,null,{"$f":"COUNTIF(Parts!$G$5:$G$200, Wheels!B74)","v":0},{"$f":"COUNTIF(Parts!$F$5:$F$200, Wheels!C74)","v":0},{"$f":"IFERROR(IF(B74<>\"\",INDEX($B$4:$B$110,MATCH(0,COUNTIF($F$3:F73,$B$4:$B$110),0)),\"\"),\"\")","v":""},{"$f":"IF(F74=\"\",\"\",SUMPRODUCT(--($B$4:$B$110=F74),$D$4:$D$110))","v":""},{"$f":"IFERROR(IF(C74<>\"\",INDEX($C$4:$C$110,MATCH(0,COUNTIF($H$3:H73,$C$4:$C$110),0)),\"\"),\"\")","v":""},{"$f":"IF(H74=\"\",\"\",SUMPRODUCT(--($C$4:$C$110=H74),$E$4:$E$110))","v":""}]
[72,null,null,{"$f":"COUNTIF(Parts!$G$5:$G$200, Wheels!B75)","v":0},{"$f":"COUNTIF(Parts!$F$5:$F$200, Wheels!C75)","v":0},{"$f":"IFERROR(IF(B75<>\"\",INDEX($B$4:$B$110,MATCH(0,COUNTIF($F$3:F74,$B$4:$B$110),0)),\"\"),\"\")","v":""},{"$f":"IF(F75=\"\",\"\",SUMPRODUCT(--($B$4:$B$110=F75),$D$4:$D$110))","v":""},{"$f":"IFERROR(IF(C75<>\"\",INDEX($C$4:$C$110,MATCH(0,COUNTIF($H$3:H74,$C$4:$C$110),0)),\"\"),\"\")","v":""},{"$f":"IF(H75=\"\",\"\",SUMPRODUCT(--($C$4:$C$110=H75),$E$4:$E$110))","v":""}]
[73,null,null,{"$f":"COUNTIF(Parts!$G$5:$G$200, Wheels!B76)","v":0},{"$f":"COUNTIF(Parts!$F$5:$F$200, Wheels!C76)","v":0},{"$f":"IFERROR(IF(B76<>\"\",INDEX($B$4:$B$110,MATCH(0,COUNTIF($F$3:F75,$B$4:$B$110),0)),\"\"),\"\")","v":""},{"$f":"IF(F76=\"\",\"\",SUMPRODUCT(--($B$4:$B$110=F76),$D$4:$D$110))","v":""},{"$f":"IFERROR(IF(C76<>\"\",INDEX($C$4:$C$110,MATCH(0,COUNTIF($H$3:H75,$C$4:$C$110),0)),\"\"),\"\")","v":""},{"$f":"IF(H76=\"\",\"\",SUMPRODUCT(--($C$4:$C$110=H76),$E$4:$E$110))","v":""}]
[74,null,null,{"$f":"COUNTIF(Parts!$G$5:$G$200, Wheels!B77)","v":0},{"$f":"COUNTIF(Parts!$F$5:$F$200, Wheels!C77)","v":0},{"$f":"IFERROR(IF(B77<>\"\",INDEX($B$4:$B$110,MATCH(0,COUNTIF($F$3:F76,$B$4:$B$110),0)),\"\"),\"\")","v":""},{"$f":"IF(F77=\"\",\"\",SUMPRODUCT(--($B$4:$B$110=F77),$D$4:$D$110))","v":""},{"$f":"IFERROR(IF(C77<>\"\",INDEX($C$4:$C$110,MATCH(0,COUNTIF($H$3:H76,$C$4:$C$110),0)),\"\"),\"\")","v":""},{"$f":"IF(H77=\"\",\"\",SUMPRODUCT(--($C$4:$C$110=H77),$E$4:$E$110))","v":""}]
[75,null,null,{"$f":"COUNTIF(Parts!$G$5:$G$200, Wheels!B78)","v":0},{"$f":"COUNTIF(Parts!$F$5:$F$200, Wheels!C78)","v":0},{"$f":"IFERROR(IF(B78<>\"\",INDEX($B$4:$B$110,MATCH(0,COUNTIF($F$3:F77,$B$4:$B$110),0)),\"\"),\"\")","v":""},{"$f":"IF(F78=\"\",\"\",SUMPRODUCT(--($B$4:$B$110=F78),$D$4:$D$110))","v":""},{"$f":"IFERROR(IF(C78<>\"\",INDEX($C$4:$C$110,MATCH(0,COUNTIF($H$3:H77,$C$4:$C$110),0)),\"\"),\"\")","v":""},{"$f":"IF(H78=\"\",\"\",SUMPRODUCT(--($C$4:$C$110=H78),$E$4:$E$110))","v":""}]
[76,null,null,{"$f":"COUNTIF(Parts!$G$5:$G$200, Wheels!B79)","v":0},{"$f":"COUNTIF(Parts!$F$5:$F$200, Wheels!C79)","v":0},{"$f":"IFERROR(IF(B79<>\"\",INDEX($B$4:$B$110,MATCH(0,COUNTIF($F$3:F78,$B$4:$B$110),0)),\"\"),\"\")","v":""},{"$f":"IF(F79=\"\",\"\",SUMPRODUCT(--($B$4:$B$110=F79),$D$4:$D$110))","v":""},{"$f":"IFERROR(IF(C79<>\"\",INDEX($C$4:$C$110,MATCH(0,COUNTIF($H$3:H78,$C$4:$C$110),0)),\"\"),\"\")","v":""},{"$f":"IF(H79=\"\",\"\",SUMPRODUCT(--($C$4:$C$110=H79),$E$4:$E$110))","v":""}]
[77,null,null,{"$f":"COUNTIF(Parts!$G$5:$G$200, Wheels!B80)","v":0},{"$f":"COUNTIF(Parts!$F$5:$F$200, Wheels!C80)","v":0},{"$f":"IFERROR(IF(B80<>\"\",INDEX($B$4:$B$110,MATCH(0,COUNTIF($F$3:F79,$B$4:$B$110),0)),\"\"),\"\")","v":""},{"$f":"IF(F80=\"\",\"\",SUMPRODUCT(--($B$4:$B$110=F80),$D$4:$D$110))","v":""},{"$f":"IFERROR(IF(C80<>\"\",INDEX($C$4:$C$110,MATCH(0,COUNTIF($H$3:H79,$C$4:$C$110),0)),\"\"),\"\")","v":""},{"$f":"IF(H80=\"\",\"\",SUMPRODUCT(--($C$4:$C$110=H80),$E$4:$E$110))","v":""}]
[78,null,null,{"$f":"COUNTIF(Parts!$G$5:$G$200, Wheels!B81)","v":0},{"$f":"COUNTIF(Parts!$F$5:$F$200, Wheels!C81)","v":0},{"$f":"IFERROR(IF(B81<>\"\",INDEX($B$4:$B$110,MATCH(0,COUNTIF($F$3:F80,$B$4:$B$110),0)),\"\"),\"\")","v":""},{"$f":"IF(F81=\"\",\"\",SUMPRODUCT(--($B$4:$B$110=F81),$D$4:$D$110))","v":""},{"$f":"IFERROR(IF(C81<>\"\",INDEX($C$4:$C$110,MATCH(0,COUNTIF($H$3:H80,$C$4:$C$110),0)),\"\"),\"\")","v":""},{"$f":"IF(H81=\"\",\"\",SUMPRODUCT(--($C$4:$C$110=H81),$E$4:$E$110))","v":""}]
[79,null,null,{"$f":"COUNTIF(Parts!$G$5:$G$200, Wheels!B82)","v":0},{"$f":"COUNTIF(Parts!$F$5:$F$200, Wheels!C82)","v":0},{"$f":"IFERROR(IF(B82<>\"\",INDEX($B$4:$B$110,MATCH(0,COUNTIF($F$3:F81,$B$4:$B$110),0)),\"\"),\"\")","v":""},{"$f":"IF(F82=\"\",\"\",SUMPRODUCT(--($B$4:$B$110=F82),$D$4:$D$110))","v":""},{"$f":"IFERROR(IF(C82<>\"\",INDEX($C$4:$C$110,MATCH(0,COUNTIF($H$3:H81,$C$4:$C$110),0)),\"\"),\"\")","v":""},{"$f":"IF(H82=\"\",\"\",SUMPRODUCT(--($C$4:$C$110=H82),$E$4:$E$110))","v":""}]
[80,null,null,{"$f":"COUNTIF(Parts!$G$5:$G$200, Wheels!B83)","v":0},{"$f":"COUNTIF(Parts!$F$5:$F$200, Wheels!C83)","v":0},{"$f":"IFERROR(IF(B83<>\"\",INDEX($B$4:$B$110,MATCH(0,COUNTIF($F$3:F82,$B$4:$B$110),0)),\"\"),\"\")","v":""},{"$f":"IF(F83=\"\",\"\",SUMPRODUCT(--($B$4:$B$110=F83),$D$4:$D$110))","v":""},{"$f":"IFERROR(IF(C83<>\"\",INDEX($C$4:$C$110,MATCH(0,COUNTIF($H$3:H82,$C$4:$C$110),0)),\"\"),\"\")","v":""},{"$f":"IF(H83=\"\",\"\",SUMPRODUCT(--($C$4:$C$110=H83),$E$4:$E$110))","v":""}]
[81,null,null,{"$f":"COUNTIF(Parts!$G$5:$G$200, Wheels!B84)","v":0},{"$f":"COUNTIF(Parts!$F$5:$F$200, Wheels!C84)","v":0},{"$f":"IFERROR(IF(B84<>\"\",INDEX($B$4:$B$110,MATCH(0,COUNTIF($F$3:F83,$B$4:$B$110),0)),\"\"),\"\")","v":""},{"$f":"IF(F84=\"\",\"\",SUMPRODUCT(--($B$4:$B$110=F84),$D$4:$D$110))","v":""},{"$f":"IFERROR(IF(C84<>\"\",INDEX($C$4:$C$110,MATCH(0,COUNTIF($H$3:H83,$C$4:$C$110),0)),\"\"),\"\")","v":""},{"$f":"IF(H84=\"\",\"\",SUMPRODUCT(--($C$4:$C$110=H84),$E$4:$E$110))","v":""}]
[82,null,null,{"$f":"COUNTIF(Parts!$G$5:$G$200, Wheels!B85)","v":0},{"$f":"COUNTIF(Parts!$F$5:$F$200, Wheels!C85)","v":0},{"$f":"IFERROR(IF(B85<>\"\",INDEX($B$4:$B$110,MATCH(0,COUNTIF($F$3:F84,$B$4:$B$110),0)),\"\"),\"\")","v":""},{"$f":"IF(F85=\"\",\"\",SUMPRODUCT(--($B$4:$B$110=F85),$D$4:$D$110))","v":""},{"$f":"IFERROR(IF(C85<>\"\",INDEX($C$4:$C$110,MATCH(0,COUNTIF($H$3:H84,$C$4:$C$110),0)),\"\"),\"\")","v":""},{"$f":"IF(H85=\"\",\"\",SUMPRODUCT(--($C$4:$C$110=H85),$E$4:$E$110))","v":""}]
[83,null,null,{"$f":"COUNTIF(Parts!$G$5:$G$200, Wheels!B86)","v":0},{"$f":"COUNTIF(Parts!$F$5:$F$200, Wheels!C86)","v":0},{"$f":"IFERROR(IF(B86<>\"\",INDEX($B$4:$B$110,MATCH(0,COUNTIF($F$3:F85,$B$4:$B$110),0)),\"\"),\"\")","v":""},{"$f":"IF(F86=\"\",\"\",SUMPRODUCT(--($B$4:$B$110=F86),$D$4:$D$110))","v":""},{"$f":"IFERROR(IF(C86<>\"\",INDEX($C$4:$C$110,MATCH(0,COUNTIF($H$3:H85,$C$4:$C$110),0)),\"\"),\"\")","v":""},{"$f":"IF(H86=\"\",\"\",SUMPRODUCT(--($C$4:$C$110=H86),$E$4:$E$110))","v":""}]
[84,null,null,{"$f":"COUNTIF(Parts!$G$5:$G$200, Wheels!B87)","v":0},{"$f":"COUNTIF(Parts!$F$5:$F$200, Wheels!C87)","v":0},{"$f":"IFERROR(IF(B87<>\"\",INDEX($B$4:$B$110,MATCH(0,COUNTIF($F$3:F86,$B$4:$B$110),0)),\"\"),\"\")","v":""},{"$f":"IF(F87=\"\",\"\",SUMPRODUCT(--($B$4:$B$110=F87),$D$4:$D$110))","v":""},{"$f":"IFERROR(IF(C87<>\"\",INDEX($C$4:$C$110,MATCH(0,COUNTIF($H$3:H86,$C$4:$C$110),0)),\"\"),\"\")","v":""},{"$f":"IF(H87=\"\",\"\",SUMPRODUCT(--($C$4:$C$110=H87),$E$4:$E$110))","v":""}]
[85,null,null,{"$f":"COUNTIF(Parts!$G$5:$G$200, Wheels!B88)","v":0},{"$f":"COUNTIF(Parts!$F$5:$F$200, Wheels!C88)","v":0},{"$f":"IFERROR(IF(B88<>\"\",INDEX($B$4:$B$110,MATCH(0,COUNTIF($F$3:F87,$B$4:$B$110),0)),\"\"),\"\")","v":""},{"$f":"IF(F88=\"\",\"\",SUMPRODUCT(--($B$4:$B$110=F88),$D$4:$D$110))","v":""},{"$f":"IFERROR(IF(C88<>\"\",INDEX($C$4:$C$110,MATCH(0,COUNTIF($H$3:H87,$C$4:$C$110),0)),\"\"),\"\")","v":""},{"$f":"IF(H88=\"\",\"\",SUMPRODUCT(--($C$4:$C$110=H88),$E$4:$E$110))","v":""}]
[86,null,null,{"$f":"COUNTIF(Parts!$G$5:$G$200, Wheels!B89)","v":0},{"$f":"COUNTIF(Parts!$F$5:$F$200, Wheels!C89)","v":0},{"$f":"IFERROR(IF(B89<>\"\",INDEX($B$4:$B$110,MATCH(0,COUNTIF($F$3:F88,$B$4:$B$110),0)),\"\"),\"\")","v":""},{"$f":"IF(F89=\"\",\"\",SUMPRODUCT(--($B$4:$B$110=F89),$D$4:$D$110))","v":""},{"$f":"IFERROR(IF(C89<>\"\",INDEX($C$4:$C$110,MATCH(0,COUNTIF($H$3:H88,$C$4:$C$110),0)),\"\"),\"\")","v":""},{"$f":"IF(H89=\"\",\"\",SUMPRODUCT(--($C$4:$C$110=H89),$E$4:$E$110))","v":""}]
[87,null,null,{"$f":"COUNTIF(Parts!$G$5:$G$200, Wheels!B90)","v":0},{"$f":"COUNTIF(Parts!$F$5:$F$200, Wheels!C90)","v":0},{"$f":"IFERROR(IF(B90<>\"\",INDEX($B$4:$B$110,MATCH(0,COUNTIF($F$3:F89,$B$4:$B$110),0)),\"\"),\"\")","v":""},{"$f":"IF(F90=\"\",\"\",SUMPRODUCT(--($B$4:$B$110=F90),$D$4:$D$110))","v":""},{"$f":"IFERROR(IF(C90<>\"\",INDEX($C$4:$C$110,MATCH(0,COUNTIF($H$3:H89,$C$4:$C$110),0)),\"\"),\"\")","v":""},{"$f":"IF(H90=\"\",\"\",SUMPRODUCT(--($C$4:$C$110=H90),$E$4:$E$110))","v":""}]
[88,null,null,{"$f":"COUNTIF(Parts!$G$5:$G$200, Wheels!B91)","v":0},{"$f":"COUNTIF(Parts!$F$5:$F$200, Wheels!C91)","v":0},{"$f":"IFERROR(IF(B91<>\"\",INDEX($B$4:$B$110,MATCH(0,COUNTIF($F$3:F90,$B$4:$B$110),0)),\"\"),\"\")","v":""},{"$f":"IF(F91=\"\",\"\",SUMPRODUCT(--($B$4:$B$110=F91),$D$4:$D$110))","v":""},{"$f":"IFERROR(IF(C91<>\"\",INDEX($C$4:$C$110,MATCH(0,COUNTIF($H$3:H90,$C$4:$C$110),0)),\"\"),\"\")","v":""},{"$f":"IF(H91=\"\",\"\",SUMPRODUCT(--($C$4:$C$110=H91),$E$4:$E$110))","v":""}]
[89,null,null,{"$f":"COUNTIF(Parts!$G$5:$G$200, Wheels!B92)","v":0},{"$f":"COUNTIF(Parts!$F$5:$F$200, Wheels!C92)","v":0},{"$f":"IFERROR(IF(B92<>\"\",INDEX($B$4:$B$110,MATCH(0,COUNTIF($F$3:F91,$B$4:$B$110),0)),\"\"),\"\")","v":""},{"$f":"IF(F92=\"\",\"\",SUMPRODUCT(--($B$4:$B$110=F92),$D$4:$D$110))","v":""},{"$f":"IFERROR(IF(C92<>\"\",INDEX($C$4:$C$110,MATCH(0,COUNTIF($H$3:H91,$C$4:$C$110),0)),\"\"),\"\")","v":""},{"$f":"IF(H92=\"\",\"\",SUMPRODUCT(--($C$4:$C$110=H92),$E$4:$E$110))","v":""}]
[90,null,null,{"$f":"COUNTIF(Parts!$G$5:$G$200, Wheels!B93)","v":0},{"$f":"COUNTIF(Parts!$F$5:$F$200, Wheels!C93)","v":0},{"$f":"IFERROR(IF(B93<>\"\",INDEX($B$4:$B$110,MATCH(0,COUNTIF($F$3:F92,$B$4:$B$110),0)),\"\"),\"\")","v":""},{"$f":"IF(F93=\"\",\"\",SUMPRODUCT(--($B$4:$B$110=F93),$D$4:$D$110))","v":""},{"$f":"IFERROR(IF(C93<>\"\",INDEX($C$4:$C$110,MATCH(0,COUNTIF($H$3:H92,$C$4:$C$110),0)),\"\"),\"\")","v":""},{"$f":"IF(H93=\"\",\"\",SUMPRODUCT(--($C$4:$C$110=H93),$E$4:$E$110))","v":""}]
[91,null,null,{"$f":"COUNTIF(Parts!$G$5:$G$200, Wheels!B94)","v":0},{"$f":"COUNTIF(Parts!$F$5:$F$200, Wheels!C94)","v":0},{"$f":"IFERROR(IF(B94<>\"\",INDEX($B$4:$B$110,MATCH(0,COUNTIF($F$3:F93,$B$4:$B$110),0)),\"\"),\"\")","v":""},{"$f":"IF(F94=\"\",\"\",SUMPRODUCT(--($B$4:$B$110=F94),$D$4:$D$110))","v":""},{"$f":"IFERROR(IF(C94<>\"\",INDEX($C$4:$C$110,MATCH(0,COUNTIF($H$3:H93,$C$4:$C$110),0)),\"\"),\"\")","v":""},{"$f":"IF(H94=\"\",\"\",SUMPRODUCT(--($C$4:$C$110=H94),$E$4:$E$110))","v":""}]
[92,null,null,{"$f":"COUNTIF(Parts!$G$5:$G$200, Wheels!B95)","v":0},{"$f":"COUNTIF(Parts!$F$5:$F$200, Wheels!C95)","v":0},{"$f":"IFERROR(IF(B95<>\"\",INDEX($B$4:$B$110,MATCH(0,COUNTIF($F$3:F94,$B$4:$B$110),0)),\"\"),\"\")","v":""},{"$f":"IF(F95=\"\",\"\",SUMPRODUCT(--($B$4:$B$110=F95),$D$4:$D$110))","v":""},{"$f":"IFERROR(IF(C95<>\"\",INDEX($C$4:$C$110,MATCH(0,COUNTIF($H$3:H94,$C$4:$C$110),0)),\"\"),\"\")","v":""},{"$f":"IF(H95=\"\",\"\",SUMPRODUCT(--($C$4:$C$110=H95),$E$4:$E$110))","v":""}]
[93,null,null,{"$f":"COUNTIF(Parts!$G$5:$G$200, Wheels!B96)","v":0},{"$f":"COUNTIF(Parts!$F$5:$F$200, Wheels!C96)","v":0},{"$f":"IFERROR(IF(B96<>\"\",INDEX($B$4:$B$110,MATCH(0,COUNTIF($F$3:F95,$B$4:$B$110),0)),\"\"),\"\")","v":""},{"$f":"IF(F96=\"\",\"\",SUMPRODUCT(--($B$4:$B$110=F96),$D$4:$D$110))","v":""},{"$f":"IFERROR(IF(C96<>\"\",INDEX($C$4:$C$110,MATCH(0,COUNTIF($H$3:H95,$C$4:$C$110),0)),\"\"),\"\")","v":""},{"$f":"IF(H96=\"\",\"\",SUMPRODUCT(--($C$4:$C$110=H96),$E$4:$E$110))","v":""}]
[94,null,null,{"$f":"COUNTIF(Parts!$G$5:$G$200, Wheels!B97)","v":0},{"$f":"COUNTIF(Parts!$F$5:$F$200, Wheels!C97)","v":0},{"$f":"IFERROR(IF(B97<>\"\",INDEX($B$4:$B$110,MATCH(0,COUNTIF($F$3:F96,$B$4:$B$110),0)),\"\"),\"\")","v":""},{"$f":"IF(F97=\"\",\"\",SUMPRODUCT(--($B$4:$B$110=F97),$D$4:$D$110))","v":""},{"$f":"IFERROR(IF(C97<>\"\",INDEX($C$4:$C$110,MATCH(0,COUNTIF($H$3:H96,$C$4:$C$110),0)),\"\"),\"\")","v":""},{"$f":"IF(H97=\"\",\"\",SUMPRODUCT(--($C$4:$C$110=H97),$E$4:$E$110))","v":""}]
[95,null,null,{"$f":"COUNTIF(Parts!$G$5:$G$200, Wheels!B98)","v":0},{"$f":"COUNTIF(Parts!$F$5:$F$200, Wheels!C98)","v":0},{"$f":"IFERROR(IF(B98<>\"\",INDEX($B$4:$B$110,MATCH(0,COUNTIF($F$3:F97,$B$4:$B$110),0)),\"\"),\"\")","v":""},{"$f":"IF(F98=\"\",\"\",SUMPRODUCT(--($B$4:$B$110=F98),$D$4:$D$110))","v":""},{"$f":"IFERROR(IF(C98<>\"\",INDEX($C$4:$C$110,MATCH(0,COUNTIF($H$3:H97,$C$4:$C$110),0)),\"\"),\"\")","v":""},{"$f":"IF(H98=\"\",\"\",SUMPRODUCT(--($C$4:$C$110=H98),$E$4:$E$110))","v":""}]
[96,null,null,{"$f":"COUNTIF(Parts!$G$5:$G$200, Wheels!B99)","v":0},{"$f":"COUNTIF(Parts!$F$5:$F$200, Wheels!C99)","v":0},{"$f":"IFERROR(IF(B99<>\"\",INDEX($B$4:$B$110,MATCH(0,COUNTIF($F$3:F98,$B$4:$B$110),0)),\"\"),\"\")","v":""},{"$f":"IF(F99=\"\",\"\",SUMPRODUCT(--($B$4:$B$110=F99),$D$4:$D$110))","v":""},{"$f":"IFERROR(IF(C99<>\"\",INDEX($C$4:$C$110,MATCH(0,COUNTIF($H$3:H98,$C$4:$C$110),0)),\"\"),\"\")","v":""},{"$f":"IF(H99=\"\",\"\",SUMPRODUCT(--($C$4:$C$110=H99),$E$4:$E$110))","v":""}]
[97,null,null,{"$f":"COUNTIF(Parts!$G$5:$G$200, Wheels!B100)","v":0},{"$f":"COUNTIF(Parts!$F$5:$F$200, Wheels!C100)","v":0},{"$f":"IFERROR(IF(B100<>\"\",INDEX($B$4:$B$110,MATCH(0,COUNTIF($F$3:F99,$B$4:$B$110),0)),\"\"),\"\")","v":""},{"$f":"IF(F100=\"\",\"\",SUMPRODUCT(--($B$4:$B$110=F100),$D$4:$D$110))","v":""},{"$f":"IFERROR(IF(C100<>\"\",INDEX($C$4:$C$110,MATCH(0,COUNTIF($H$3:H99,$C$4:$C$110),0)),\"\"),\"\")","v":""},{"$f":"IF(H100=\"\",\"\",SUMPRODUCT(--($C$4:$C$110=H100),$E$4:$E$110))","v":""}]
[98,null,null,{"$f":"COUNTIF(Parts!$G$5:$G$200, Wheels!B101)","v":0},{"$f":"COUNTIF(Parts!$F$5:$F$200, Wheels!C101)","v":0},{"$f":"IFERROR(IF(B101<>\"\",INDEX($B$4:$B$110,MATCH(0,COUNTIF($F$3:F100,$B$4:$B$110),0)),\"\"),\"\")","v":""},{"$f":"IF(F101=\"\",\"\",SUMPRODUCT(--($B$4:$B$110=F101),$D$4:$D$110))","v":""},{"$f":"IFERROR(IF(C101<>\"\",INDEX($C$4:$C$110,MATCH(0,COUNTIF($H$3:H100,$C$4:$C$110),0)),\"\"),\"\")","v":""},{"$f":"IF(H101=\"\",\"\",SUMPRODUCT(--($C$4:$C$110=H101),$E$4:$E$110))","v":""}]
[99,null,null,{"$f":"COUNTIF(Parts!$G$5:$G$200, Wheels!B102)","v":0},{"$f":"COUNTIF(Parts!$F$5:$F$200, Wheels!C102)","v":0},{"$f":"IFERROR(IF(B102<>\"\",INDEX($B$4:$B$110,MATCH(0,COUNTIF($F$3:F101,$B$4:$B$110),0)),\"\"),\"\")","v":""},{"$f":"IF(F102=\"\",\"\",SUMPRODUCT(--($B$4:$B$110=F102),$D$4:$D$110))","v":""},{"$f":"IFERROR(IF(C102<>\"\",INDEX($C$4:$C$110,MATCH(0,COUNTIF($H$3:H101,$C$4:$C$110),0)),\"\"),\"\")","v":""},{"$f":"IF(H102=\"\",\"\",SUMPRODUCT(--($C$4:$C$110=H102),$E$4:$E$110))","v":""}]
[100,null,null,{"$f":"COUNTIF(Parts!$G$5:$G$200, Wheels!B103)","v":0},{"$f":"COUNTIF(Parts!$F$5:$F$200, Wheels!C103)","v":0},{"$f":"IFERROR(IF(B103<>\"\",INDEX($B$4:$B$110,MATCH(0,COUNTIF($F$3:F102,$B$4:$B$110),0)),\"\"),\"\")","v":""},{"$f":"IF(F103=\"\",\"\",SUMPRODUCT(--($B$4:$B$110=F103),$D$4:$D$110))","v":""},{"$f":"IFERROR(IF(C103<>\"\",INDEX($C$4:$C$110,MATCH(0,COUNTIF($H$3:H102,$C$4:$C$110),0)),\"\"),\"\")","v":""},{"$f":"IF(H103=\"\",\"\",SUMPRODUCT(--($C$4:$C$110=H103),$E$4:$E$110))","v":""}]

{"sheet":"Parts","index":2,"n_rows":716,"n_cols":10,"rows_kept":716,"cut":false,"hidden":false,"merged":[]}
[]
[null,null,null,null,"Aircraft Replacements Follow up"]
[]
["Item","ATA","Description","P/N Removed","S/N Removed","P/N Installed","S/N Installed","Date","T.L.B ","A/C TH"]
[1,32,"NOSE WHEEL #1","3-1531-3","A9197","C20195162","45253","2022-08-21","000249",{"$f":"IFERROR(VLOOKUP(I5,'[2]AC TLB'!$A$7:$E$1199,5,1),\"\")","v":1276.7701388888918}]
[2,32,"NOSE WHEEL #1","3-1531-3",6686,"C20195162","43059","2022-08-22","000252",{"$f":"IFERROR(VLOOKUP(I6,'[2]AC TLB'!$A$7:$E$1199,5,1),\"\")","v":1277.1833333333363}]
[3,32,"NOSE WHEEL #2","3-1531-3","A8538","C20195162","43078","2022-08-22","000252",{"$f":"IFERROR(VLOOKUP(I7,'[2]AC TLB'!$A$7:$E$1199,5,1),\"\")","v":1277.1833333333363}]
[4,33,"LOGO LT R.H.S","GE4626","N/A","C20195162","55385","2022-08-23","000263",{"$f":"IFERROR(VLOOKUP(I8,'[2]AC TLB'!$A$7:$E$1199,5,1),\"\")","v":1278.207638888892}]
[5,33,"TAKE OFF LT","GE4626","N/A","C20195162","28787","2022-08-24","000264",{"$f":"IFERROR(VLOOKUP(I9,'[2]AC TLB'!$A$7:$E$1199,5,1),\"\")","v":1278.207638888892}]
[6,33,"TURN OFF LAMP L.H.S","GE4626","N/A","C20195162","44998","2022-08-24","000264",{"$f":"IFERROR(VLOOKUP(I10,'[2]AC TLB'!$A$7:$E$1199,5,1),\"\")","v":1278.207638888892}]
[7,31,"DMC #3",1982660116,"198266013271","C20195162","32381","2022-08-24","000270",{"$f":"IFERROR(VLOOKUP(I11,'[2]AC TLB'!$A$7:$E$1199,5,1),\"\")","v":1278.6083333333365}]
[8,32,"MAIN WHEEL #4","C20195162",43050,"C20195162","27448","2022-08-24","000270",{"$f":"IFERROR(VLOOKUP(I12,'[2]AC TLB'!$A$7:$E$1199,5,1),\"\")","v":1278.6083333333365}]
[9,32,"MAIN WHEEL #2","C20195162",43078,"C20195162","49303","2022-09-02","000316",{"$f":"IFERROR(VLOOKUP(I13,'[2]AC TLB'!$A$7:$E$1199,5,1),\"\")","v":1283.1819444444479}]
[10,33,"LANDING LT R.H.S","Q1559X","N/A","C20195162","55386","2022-09-03","000321",{"$f":"IFERROR(VLOOKUP(I14,'[2]AC TLB'!$A$7:$E$1199,5,1),\"\")","v":1283.5736111111146}]
[11,32,"NOSE WHEEL #2","3-1531-3",6905,"C20195162","43239","2022-09-14","000383",{"$f":"IFERROR(VLOOKUP(I15,'[2]AC TLB'!$A$7:$E$1199,5,1),\"\")","v":1288.8152777777816}]
[12,21,"RECI FAN","VD3900-003",32012,"C20195162","43236","2022-09-15","000392",{"$f":"IFERROR(VLOOKUP(I16,'[2]AC TLB'!$A$7:$E$1199,5,1),\"\")","v":1289.4736111111149}]
[13,32,"FLGX HOSE ASSY.","AE718529-2","N/A","C20195162","43509","2022-09-19","000405",{"$f":"IFERROR(VLOOKUP(I17,'[2]AC TLB'!$A$7:$E$1199,5,1),\"\")","v":1290.6770833333374}]
[14,28,"FUEL PUMP CENTER TANK #1","568-1-27202-007",8211,"C20195162","46961","2022-09-21","000413",{"$f":"IFERROR(VLOOKUP(I18,'[2]AC TLB'!$A$7:$E$1199,5,1),\"\")","v":1291.4020833333375}]
[15,32,"NOSE WHEEL #2","3-1531-3",7091,"C20195162","48901","2022-09-21","000416",{"$f":"IFERROR(VLOOKUP(I19,'[2]AC TLB'!$A$7:$E$1199,5,1),\"\")","v":1291.5659722222263}]
[16,28,"FLSCU #2","30042-0601",1294,"3-1531-3","A9197","2022-09-24","000424",{"$f":"IFERROR(VLOOKUP(I20,'[2]AC TLB'!$A$7:$E$1199,5,1),\"\")","v":1292.3597222222261}]
[17,32,"MAIN WHEEL #1","C20195162",432239,"3-1531-3","A9195","2022-09-25","000429",{"$f":"IFERROR(VLOOKUP(I21,'[2]AC TLB'!$A$7:$E$1199,5,1),\"\")","v":1293.1388888888928}]
[18,32,"MAIN WHEEL #3","C20195162",43236,"3-1531-3","6905","2022-09-25","000429",{"$f":"IFERROR(VLOOKUP(I22,'[2]AC TLB'!$A$7:$E$1199,5,1),\"\")","v":1293.1388888888928}]
[19,null,"MAIN WHEEL #3","C20195162",43236,"3-1531-3",5426,"2022-09-25","000430",{"$f":"IFERROR(VLOOKUP(I23,'[2]AC TLB'!$A$7:$E$1199,5,1),\"\")","v":1293.2166666666706}]
[20,null,"MAIN WHEEL #1","3-1531-3",432239,"3-1531-3","A6656",null,null,{"$f":"IFERROR(VLOOKUP(I24,'[2]AC TLB'!$A$7:$E$1199,5,1),\"\")","v":""}]
[21,null,"MAIN WHEEL #1","C20195162",432239,"3-1531-3","A7028",null,null,{"$f":"IFERROR(VLOOKUP(I25,'[2]AC TLB'!$A$7:$E$1199,5,1),\"\")","v":""}]
[22,null,"MAIN WHEEL #3","C20195162",43236,"3-1531-3","A6241",null,null,{"$f":"IFERROR(VLOOKUP(I26,'[2]AC TLB'!$A$7:$E$1199,5,1),\"\")","v":""}]
[23,null,"MAIN WHEEL #4","C20195162",43050,"3-1531-3","A2693",null,null,{"$f":"IFERROR(VLOOKUP(I27,'[2]AC TLB'!$A$7:$E$1199,5,1),\"\")","v":""}]
[24,null,"MAIN WHEEL #2","C20195162",43078,"3-1531-3",4459,null,null,{"$f":"IFERROR(VLOOKUP(I28,'[2]AC TLB'!$A$7:$E$1199,5,1),\"\")","v":""}]
[25,null,"MAIN WHEEL #3","C20195162",43236,"3-1531-3","0086",null,null,{"$f":"IFERROR(VLOOKUP(I29,'[2]AC TLB'!$A$7:$E$1199,5,1),\"\")","v":""}]
[26,null,"MAIN WHEEL #1","3-1531-3",432239,"3-1531-3","6901",null,null,{"$f":"IFERROR(VLOOKUP(I30,'[2]AC TLB'!$A$7:$E$1199,5,1),\"\")","v":""}]
[27,null,"MAIN WHEEL #4","C20195162",43050,"3-1531-3","0389",null,null,{"$f":"IFERROR(VLOOKUP(I31,'[2]AC TLB'!$A$7:$E$1199,5,1),\"\")","v":""}]
[28,null,"MAIN WHEEL #2","C20195162",43078,"3-1531-3","3023",null,null,{"$f":"IFERROR(VLOOKUP(I32,'[2]AC TLB'!$A$7:$E$1199,5,1),\"\")","v":""}]
[29,null,"MAIN WHEEL #3","C20195162",43236,"3-1531-3","8538",null,null,{"$f":"IFERROR(VLOOKUP(I33,'[2]AC TLB'!$A$7:$E$1199,5,1),\"\")","v":""}]
[30,null,"MAIN WHEEL #1","3-1531-3",432239,"3-1531-3","A4793",null,null,{"$f":"IFERROR(VLOOKUP(I34,'[2]AC TLB'!$A$7:$E$1199,5,1),\"\")","v":""}]
[31,null,"MAIN WHEEL #1","3-1531-3",432239,"3-1531-3","7091",null,null,{"$f":"IFERROR(VLOOKUP(I35,'[2]AC TLB'!$A$7:$E$1199,5,1),\"\")","v":""}]
[32,null,"MAIN WHEEL #1","3-1531-3",432239,"3-1531-3","9424",null,null,{"$f":"IFERROR(VLOOKUP(I36,'[2]AC TLB'!$A$7:$E$1199,5,1),\"\")","v":""}]
[33,null,"MAIN WHEEL #4","C20195162",43050,"3-1531-4",500,null,null,{"$f":"IFERROR(VLOOKUP(I37,'[2]AC TLB'!$A$7:$E$1199,5,1),\"\")","v":""}]
[34,null,"MAIN WHEEL #2","C20195162",43078,"3-1531-5",900,null,null,{"$f":"IFERROR(VLOOKUP(I38,'[2]AC TLB'!$A$7:$E$1199,5,1),\"\")","v":""}]
[35,null,null,null,null,null,5200,null,null,{"$f":"IFERROR(VLOOKUP(I39,'[2]AC TLB'!$A$7:$E$1199,5,1),\"\")","v":""}]
[36,null,null,null,null,null,null,null,null,{"$f":"IFERROR(VLOOKUP(I40,'[2]AC TLB'!$A$7:$E$1199,5,1),\"\")","v":""}]
[37,null,null,null,null,null,null,null,null,{"$f":"IFERROR(VLOOKUP(I41,'[2]AC TLB'!$A$7:$E$1199,5,1),\"\")","v":""}]
[38,null,null,null,null,null,null,null,null,{"$f":"IFERROR(VLOOKUP(I42,'[2]AC TLB'!$A$7:$E$1199,5,1),\"\")","v":""}]
[39,null,null,null,null,null,null,null,null,{"$f":"IFERROR(VLOOKUP(I43,'[2]AC TLB'!$A$7:$E$1199,5,1),\"\")","v":""}]
[40,null,null,null,null,null,null,null,null,{"$f":"IFERROR(VLOOKUP(I44,'[2]AC TLB'!$A$7:$E$1199,5,1),\"\")","v":""}]
[41,null,null,null,null,null,null,null,null,{"$f":"IFERROR(VLOOKUP(I45,'[2]AC TLB'!$A$7:$E$1199,5,1),\"\")","v":""}]
[42,null,null,null,null,null,null,null,null,{"$f":"IFERROR(VLOOKUP(I46,'[2]AC TLB'!$A$7:$E$1199,5,1),\"\")","v":""}]
[43,null,null,null,null,null,null,null,null,{"$f":"IFERROR(VLOOKUP(I47,'[2]AC TLB'!$A$7:$E$1199,5,1),\"\")","v":""}]
[44,null,null,null,null,null,null,null,null,{"$f":"IFERROR(VLOOKUP(I48,'[2]AC TLB'!$A$7:$E$1199,5,1),\"\")","v":""}]
[45,null,null,null,null,null,null,null,null,{"$f":"IFERROR(VLOOKUP(I49,'[2]AC TLB'!$A$7:$E$1199,5,1),\"\")","v":""}]
[46,null,null,null,null,null,null,null,null,{"$f":"IFERROR(VLOOKUP(I50,'[2]AC TLB'!$A$7:$E$1199,5,1),\"\")","v":""}]
[47,null,null,null,null,null,null,null,null,{"$f":"IFERROR(VLOOKUP(I51,'[2]AC TLB'!$A$7:$E$1199,5,1),\"\")","v":""}]
[48,null,null,null,null,null,null,null,null,{"$f":"IFERROR(VLOOKUP(I52,'[2]AC TLB'!$A$7:$E$1199,5,1),\"\")","v":""}]
[49,null,null,null,null,null,null,null,null,{"$f":"IFERROR(VLOOKUP(I53,'[2]AC TLB'!$A$7:$E$1199,5,1),\"\")","v":""}]
[50,null,null,null,null,null,null,null,null,{"$f":"IFERROR(VLOOKUP(I54,'[2]AC TLB'!$A$7:$E$1199,5,1),\"\")","v":""}]
[51,null,null,null,null,null,null,null,null,{"$f":"IFERROR(VLOOKUP(I55,'[2]AC TLB'!$A$7:$E$1199,5,1),\"\")","v":""}]
[52,null,null,null,null,null,null,null,null,{"$f":"IFERROR(VLOOKUP(I56,'[2]AC TLB'!$A$7:$E$1199,5,1),\"\")","v":""}]
[53,null,null,null,null,null,null,null,null,{"$f":"IFERROR(VLOOKUP(I57,'[2]AC TLB'!$A$7:$E$1199,5,1),\"\")","v":""}]
[54,null,null,null,null,null,null,null,null,{"$f":"IFERROR(VLOOKUP(I58,'[2]AC TLB'!$A$7:$E$1199,5,1),\"\")","v":""}]
[55,null,null,null,null,null,null,null,null,{"$f":"IFERROR(VLOOKUP(I59,'[2]AC TLB'!$A$7:$E$1199,5,1),\"\")","v":""}]
[56,null,null,null,null,null,null,null,null,{"$f":"IFERROR(VLOOKUP(I60,'[2]AC TLB'!$A$7:$E$1199,5,1),\"\")","v":""}]
[57,null,null,null,null,null,null,null,null,{"$f":"IFERROR(VLOOKUP(I61,'[2]AC TLB'!$A$7:$E$1199,5,1),\"\")","v":""}]
[58,null,null,null,null,null,null,null,null,{"$f":"IFERROR(VLOOKUP(I62,'[2]AC TLB'!$A$7:$E$1199,5,1),\"\")","v":""}]
[59,null,null,null,null,null,null,null,null,{"$f":"IFERROR(VLOOKUP(I63,'[2]AC TLB'!$A$7:$E$1199,5,1),\"\")","v":""}]
[60,null,null,null,null,null,null,null,null,{"$f":"IFERROR(VLOOKUP(I64,'[2]AC TLB'!$A$7:$E$1199,5,1),\"\")","v":""}]
[61,null,null,null,null,null,null,null,null,{"$f":"IFERROR(VLOOKUP(I65,'[2]AC TLB'!$A$7:$E$1199,5,1),\"\")","v":""}]
[62,null,null,null,null,null,null,null,null,{"$f":"IFERROR(VLOOKUP(I66,'[2]AC TLB'!$A$7:$E$1199,5,1),\"\")","v":""}]
[63,null,null,null,null,null,null,null,null,{"$f":"IFERROR(VLOOKUP(I67,'[2]AC TLB'!$A$7:$E$1199,5,1),\"\")","v":""}]
[64,null,null,null,null,null,null,null,null,{"$f":"IFERROR(VLOOKUP(I68,'[2]AC TLB'!$A$7:$E$1199,5,1),\"\")","v":""}]
[65,null,null,null,null,null,null,null,null,{"$f":"IFERROR(VLOOKUP(I69,'[2]AC TLB'!$A$7:$E$1199,5,1),\"\")","v":""}]
[66,null,null,null,null,null,null,null,null,{"$f":"IFERROR(VLOOKUP(I70,'[2]AC TLB'!$A$7:$E$1199,5,1),\"\")","v":""}]
[67,null,null,null,null,null,null,null,null,{"$f":"IFERROR(VLOOKUP(I71,'[2]AC TLB'!$A$7:$E$1199,5,1),\"\")","v":""}]
[68,null,null,null,null,null,null,null,null,{"$f":"IFERROR(VLOOKUP(I72,'[2]AC TLB'!$A$7:$E$1199,5,1),\"\")","v":""}]
[69,null,null,null,null,null,null,null,null,{"$f":"IFERROR(VLOOKUP(I73,'[2]AC TLB'!$A$7:$E$1199,5,1),\"\")","v":""}]
[70,null,null,null,null,null,null,null,null,{"$f":"IFERROR(VLOOKUP(I74,'[2]AC TLB'!$A$7:$E$1199,5,1),\"\")","v":""}]
[71,null,null,null,null,null,null,null,null,{"$f":"IFERROR(VLOOKUP(I75,'[2]AC TLB'!$A$7:$E$1199,5,1),\"\")","v":""}]
[72,null,null,null,null,null,null,null,null,{"$f":"IFERROR(VLOOKUP(I76,'[2]AC TLB'!$A$7:$E$1199,5,1),\"\")","v":""}]
[73,null,null,null,null,null,null,null,null,{"$f":"IFERROR(VLOOKUP(I77,'[2]AC TLB'!$A$7:$E$1199,5,1),\"\")","v":""}]
[74,null,null,null,null,null,null,null,null,{"$f":"IFERROR(VLOOKUP(I78,'[2]AC TLB'!$A$7:$E$1199,5,1),\"\")","v":""}]
[75,null,null,null,null,null,null,null,null,{"$f":"IFERROR(VLOOKUP(I79,'[2]AC TLB'!$A$7:$E$1199,5,1),\"\")","v":""}]
[76,null,null,null,null,null,null,null,null,{"$f":"IFERROR(VLOOKUP(I80,'[2]AC TLB'!$A$7:$E$1199,5,1),\"\")","v":""}]
[77,null,null,null,null,null,null,null,null,{"$f":"IFERROR(VLOOKUP(I81,'[2]AC TLB'!$A$7:$E$1199,5,1),\"\")","v":""}]
[78,null,null,null,null,null,null,null,null,{"$f":"IFERROR(VLOOKUP(I82,'[2]AC TLB'!$A$7:$E$1199,5,1),\"\")","v":""}]
[79,null,null,null,null,null,null,null,null,{"$f":"IFERROR(VLOOKUP(I83,'[2]AC TLB'!$A$7:$E$1199,5,1),\"\")","v":""}]
[80,null,null,null,null,null,null,null,null,{"$f":"IFERROR(VLOOKUP(I84,'[2]AC TLB'!$A$7:$E$1199,5,1),\"\")","v":""}]
[81,null,null,null,null,null,null,null,null,{"$f":"IFERROR(VLOOKUP(I85,'[2]AC TLB'!$A$7:$E$1199,5,1),\"\")","v":""}]
[82,null,null,null,null,null,null,null,null,{"$f":"IFERROR(VLOOKUP(I86,'[2]AC TLB'!$A$7:$E$1199,5,1),\"\")","v":""}]
[83,null,null,null,null,null,null,null,null,{"$f":"IFERROR(VLOOKUP(I87,'[2]AC TLB'!$A$7:$E$1199,5,1),\"\")","v":""}]
[84,null,null,null,null,null,null,null,null,{"$f":"IFERROR(VLOOKUP(I88,'[2]AC TLB'!$A$7:$E$1199,5,1),\"\")","v":""}]
[85,null,null,null,null,null,null,null,null,{"$f":"IFERROR(VLOOKUP(I89,'[2]AC TLB'!$A$7:$E$1199,5,1),\"\")","v":""}]
[86,null,null,null,null,null,null,null,null,{"$f":"IFERROR(VLOOKUP(I90,'[2]AC TLB'!$A$7:$E$1199,5,1),\"\")","v":""}]
[87,null,null,null,null,null,null,null,null,{"$f":"IFERROR(VLOOKUP(I91,'[2]AC TLB'!$A$7:$E$1199,5,1),\"\")","v":""}]
[88,null,null,null,null,null,null,null,null,{"$f":"IFERROR(VLOOKUP(I92,'[2]AC TLB'!$A$7:$E$1199,5,1),\"\")","v":""}]
[89,null,null,null,null,null,null,null,null,{"$f":"IFERROR(VLOOKUP(I93,'[2]AC TLB'!$A$7:$E$1199,5,1),\"\")","v":""}]
[90,null,null,null,null,null,null,null,null,{"$f":"IFERROR(VLOOKUP(I94,'[2]AC TLB'!$A$7:$E$1199,5,1),\"\")","v":""}]
[91,null,null,null,null,null,null,null,null,{"$f":"IFERROR(VLOOKUP(I95,'[2]AC TLB'!$A$7:$E$1199,5,1),\"\")","v":""}]
[92,null,null,null,null,null,null,null,null,{"$f":"IFERROR(VLOOKUP(I96,'[2]AC TLB'!$A$7:$E$1199,5,1),\"\")","v":""}]
[93,null,null,null,null,null,null,null,null,{"$f":"IFERROR(VLOOKUP(I97,'[2]AC TLB'!$A$7:$E$1199,5,1),\"\")","v":""}]
[94,null,null,null,null,null,null,null,null,{"$f":"IFERROR(VLOOKUP(I98,'[2]AC TLB'!$A$7:$E$1199,5,1),\"\")","v":""}]
[95,null,null,null,null,null,null,null,null,{"$f":"IFERROR(VLOOKUP(I99,'[2]AC TLB'!$A$7:$E$1199,5,1),\"\")","v":""}]
[96,null,null,null,null,null,null,null,null,{"$f":"IFERROR(VLOOKUP(I100,'[2]AC TLB'!$A$7:$E$1199,5,1),\"\")","v":""}]
[97,null,null,null,null,null,null,null,null,{"$f":"IFERROR(VLOOKUP(I101,'[2]AC TLB'!$A$7:$E$1199,5,1),\"\")","v":""}]
[98,null,null,null,null,null,null,null,null,{"$f":"IFERROR(VLOOKUP(I102,'[2]AC TLB'!$A$7:$E$1199,5,1),\"\")","v":""}]
[99,null,null,null,null,null,null,null,null,{"$f":"IFERROR(VLOOKUP(I103,'[2]AC TLB'!$A$7:$E$1199,5,1),\"\")","v":""}]
[100,null,null,null,null,null,null,null,null,{"$f":"IFERROR(VLOOKUP(I104,'[2]AC TLB'!$A$7:$E$1199,5,1),\"\")","v":""}]
[101,null,null,null,null,null,null,null,null,{"$f":"IFERROR(VLOOKUP(I105,'[2]AC TLB'!$A$7:$E$1199,5,1),\"\")","v":""}]
[102,null,null,null,null,null,null,null,null,{"$f":"IFERROR(VLOOKUP(I106,'[2]AC TLB'!$A$7:$E$1199,5,1),\"\")","v":""}]
[103,null,null,null,null,null,null,null,null,{"$f":"IFERROR(VLOOKUP(I107,'[2]AC TLB'!$A$7:$E$1199,5,1),\"\")","v":""}]
[104,null,null,null,null,null,null,null,null,{"$f":"IFERROR(VLOOKUP(I108,'[2]AC TLB'!$A$7:$E$1199,5,1),\"\")","v":""}]
[105,null,null,null,null,null,null,null,null,{"$f":"IFERROR(VLOOKUP(I109,'[2]AC TLB'!$A$7:$E$1199,5,1),\"\")","v":""}]
[106,null,null,null,null,null,null,null,null,{"$f":"IFERROR(VLOOKUP(I110,'[2]AC TLB'!$A$7:$E$1199,5,1),\"\")","v":""}]
[107,null,null,null,null,null,null,null,null,{"$f":"IFERROR(VLOOKUP(I111,'[2]AC TLB'!$A$7:$E$1199,5,1),\"\")","v":""}]
[108,null,null,null,null,null,null,null,null,{"$f":"IFERROR(VLOOKUP(I112,'[2]AC TLB'!$A$7:$E$1199,5,1),\"\")","v":""}]
[109,null,null,null,null,null,null,null,null,{"$f":"IFERROR(VLOOKUP(I113,'[2]AC TLB'!$A$7:$E$1199,5,1),\"\")","v":""}]
[110,null,null,null,null,null,null,null,null,{"$f":"IFERROR(VLOOKUP(I114,'[2]AC TLB'!$A$7:$E$1199,5,1),\"\")","v":""}]
[111,null,null,null,null,null,null,null,null,{"$f":"IFERROR(VLOOKUP(I115,'[2]AC TLB'!$A$7:$E$1199,5,1),\"\")","v":""}]
[112,null,null,null,null,null,null,null,null,{"$f":"IFERROR(VLOOKUP(I116,'[2]AC TLB'!$A$7:$E$1199,5,1),\"\")","v":""}]
[113,null,null,null,null,null,null,null,null,{"$f":"IFERROR(VLOOKUP(I117,'[2]AC TLB'!$A$7:$E$1199,5,1),\"\")","v":""}]
[114,null,null,null,null,null,null,null,null,{"$f":"IFERROR(VLOOKUP(I118,'[2]AC TLB'!$A$7:$E$1199,5,1),\"\")","v":""}]
[115,null,null,null,null,null,null,null,null,{"$f":"IFERROR(VLOOKUP(I119,'[2]AC TLB'!$A$7:$E$1199,5,1),\"\")","v":""}]
[116,null,null,null,null,null,null,null,null,{"$f":"IFERROR(VLOOKUP(I120,'[2]AC TLB'!$A$7:$E$1199,5,1),\"\")","v":""}]
[117,null,null,null,null,null,null,null,null,{"$f":"IFERROR(VLOOKUP(I121,'[2]AC TLB'!$A$7:$E$1199,5,1),\"\")","v":""}]
[118,null,null,null,null,null,null,null,null,{"$f":"IFERROR(VLOOKUP(I122,'[2]AC TLB'!$A$7:$E$1199,5,1),\"\")","v":""}]
[119,null,null,null,null,null,null,null,null,{"$f":"IFERROR(VLOOKUP(I123,'[2]AC TLB'!$A$7:$E$1199,5,1),\"\")","v":""}]
[120,null,null,null,null,null,null,null,null,{"$f":"IFERROR(VLOOKUP(I124,'[2]AC TLB'!$A$7:$E$1199,5,1),\"\")","v":""}]
[121,null,null,null,null,null,null,null,null,{"$f":"IFERROR(VLOOKUP(I125,'[2]AC TLB'!$A$7:$E$1199,5,1),\"\")","v":""}]
[122,null,null,null,null,null,null,null,null,{"$f":"IFERROR(VLOOKUP(I126,'[2]AC TLB'!$A$7:$E$1199,5,1),\"\")","v":""}]
[123,null,null,null,null,null,null,null,null,{"$f":"IFERROR(VLOOKUP(I127,'[2]AC TLB'!$A$7:$E$1199,5,1),\"\")","v":""}]
[124,null,null,null,null,null,null,null,null,{"$f":"IFERROR(VLOOKUP(I128,'[2]AC TLB'!$A$7:$E$1199,5,1),\"\")","v":""}]
[125,null,null,null,null,null,null,null,null,{"$f":"IFERROR(VLOOKUP(I129,'[2]AC TLB'!$A$7:$E$1199,5,1),\"\")","v":""}]
[126,null,null,null,null,null,null,null,null,{"$f":"IFERROR(VLOOKUP(I130,'[2]AC TLB'!$A$7:$E$1199,5,1),\"\")","v":""}]
[127,null,null,null,null,null,null,null,null,{"$f":"IFERROR(VLOOKUP(I131,'[2]AC TLB'!$A$7:$E$1199,5,1),\"\")","v":""}]
[128,null,null,null,null,null,null,null,null,{"$f":"IFERROR(VLOOKUP(I132,'[2]AC TLB'!$A$7:$E$1199,5,1),\"\")","v":""}]
[129,null,null,null,null,null,null,null,null,{"$f":"IFERROR(VLOOKUP(I133,'[2]AC TLB'!$A$7:$E$1199,5,1),\"\")","v":""}]
[130,null,null,null,null,null,null,null,null,{"$f":"IFERROR(VLOOKUP(I134,'[2]AC TLB'!$A$7:$E$1199,5,1),\"\")","v":""}]
[131,null,null,null,null,null,null,null,null,{"$f":"IFERROR(VLOOKUP(I135,'[2]AC TLB'!$A$7:$E$1199,5,1),\"\")","v":""}]
[132,null,null,null,null,null,null,null,null,{"$f":"IFERROR(VLOOKUP(I136,'[2]AC TLB'!$A$7:$E$1199,5,1),\"\")","v":""}]
[133,null,null,null,null,null,null,null,null,{"$f":"IFERROR(VLOOKUP(I137,'[2]AC TLB'!$A$7:$E$1199,5,1),\"\")","v":""}]
[134,null,null,null,null,null,null,null,null,{"$f":"IFERROR(VLOOKUP(I138,'[2]AC TLB'!$A$7:$E$1199,5,1),\"\")","v":""}]
[135,null,null,null,null,null,null,null,null,{"$f":"IFERROR(VLOOKUP(I139,'[2]AC TLB'!$A$7:$E$1199,5,1),\"\")","v":""}]
[136,null,null,null,null,null,null,null,null,{"$f":"IFERROR(VLOOKUP(I140,'[2]AC TLB'!$A$7:$E$1199,5,1),\"\")","v":""}]
[137,null,null,null,null,null,null,null,null,{"$f":"IFERROR(VLOOKUP(I141,'[2]AC TLB'!$A$7:$E$1199,5,1),\"\")","v":""}]
[138,null,null,null,null,null,null,null,null,{"$f":"IFERROR(VLOOKUP(I142,'[2]AC TLB'!$A$7:$E$1199,5,1),\"\")","v":""}]
[139,null,null,null,null,null,null,null,null,{"$f":"IFERROR(VLOOKUP(I143,'[2]AC TLB'!$A$7:$E$1199,5,1),\"\")","v":""}]
[140,null,null,null,null,null,null,null,null,{"$f":"IFERROR(VLOOKUP(I144,'[2]AC TLB'!$A$7:$E$1199,5,1),\"\")","v":""}]
[141,null,null,null,null,null,null,null,null,{"$f":"IFERROR(VLOOKUP(I145,'[2]AC TLB'!$A$7:$E$1199,5,1),\"\")","v":""}]
[142,null,null,null,null,null,null,null,null,{"$f":"IFERROR(VLOOKUP(I146,'[2]AC TLB'!$A$7:$E$1199,5,1),\"\")","v":""}]
[143,null,null,null,null,null,null,null,null,{"$f":"IFERROR(VLOOKUP(I147,'[2]AC TLB'!$A$7:$E$1199,5,1),\"\")","v":""}]
[144,null,null,null,null,null,null,null,null,{"$f":"IFERROR(VLOOKUP(I148,'[2]AC TLB'!$A$7:$E$1199,5,1),\"\")","v":""}]
[145,null,null,null,null,null,null,null,null,{"$f":"IFERROR(VLOOKUP(I149,'[2]AC TLB'!$A$7:$E$1199,5,1),\"\")","v":""}]
[146,null,null,null,null,null,null,null,null,{"$f":"IFERROR(VLOOKUP(I150,'[2]AC TLB'!$A$7:$E$1199,5,1),\"\")","v":""}]
[147,null,null,null,null,null,null,null,null,{"$f":"IFERROR(VLOOKUP(I151,'[2]AC TLB'!$A$7:$E$1199,5,1),\"\")","v":""}]
[148,null,null,null,null,null,null,null,null,{"$f":"IFERROR(VLOOKUP(I152,'[2]AC TLB'!$A$7:$E$1199,5,1),\"\")","v":""}]
[149,null,null,null,null,null,null,null,null,{"$f":"IFERROR(VLOOKUP(I153,'[2]AC TLB'!$A$7:$E$1199,5,1),\"\")","v":""}]
[150,null,null,null,null,null,null,null,null,{"$f":"IFERROR(VLOOKUP(I154,'[2]AC TLB'!$A$7:$E$1199,5,1),\"\")","v":""}]
[151,null,null,null,null,null,null,null,null,{"$f":"IFERROR(VLOOKUP(I155,'[2]AC TLB'!$A$7:$E$1199,5,1),\"\")","v":""}]
[152,null,null,null,null,null,null,null,null,{"$f":"IFERROR(VLOOKUP(I156,'[2]AC TLB'!$A$7:$E$1199,5,1),\"\")","v":""}]
[153,null,null,null,null,null,null,null,null,{"$f":"IFERROR(VLOOKUP(I157,'[2]AC TLB'!$A$7:$E$1199,5,1),\"\")","v":""}]
[154,null,null,null,null,null,null,null,null,{"$f":"IFERROR(VLOOKUP(I158,'[2]AC TLB'!$A$7:$E$1199,5,1),\"\")","v":""}]
[155,null,null,null,null,null,null,null,null,{"$f":"IFERROR(VLOOKUP(I159,'[2]AC TLB'!$A$7:$E$1199,5,1),\"\")","v":""}]
[156,null,null,null,null,null,null,null,null,{"$f":"IFERROR(VLOOKUP(I160,'[2]AC TLB'!$A$7:$E$1199,5,1),\"\")","v":""}]
[157,null,null,null,null,null,null,null,null,{"$f":"IFERROR(VLOOKUP(I161,'[2]AC TLB'!$A$7:$E$1199,5,1),\"\")","v":""}]
[158,null,null,null,null,null,null,null,null,{"$f":"IFERROR(VLOOKUP(I162,'[2]AC TLB'!$A$7:$E$1199,5,1),\"\")","v":""}]
[159,null,null,null,null,null,null,null,null,{"$f":"IFERROR(VLOOKUP(I163,'[2]AC TLB'!$A$7:$E$1199,5,1),\"\")","v":""}]
[160,null,null,null,null,null,null,null,null,{"$f":"IFERROR(VLOOKUP(I164,'[2]AC TLB'!$A$7:$E$1199,5,1),\"\")","v":""}]
[161,null,null,null,null,null,null,null,null,{"$f":"IFERROR(VLOOKUP(I165,'[2]AC TLB'!$A$7:$E$1199,5,1),\"\")","v":""}]
[162,null,null,null,null,null,null,null,null,{"$f":"IFERROR(VLOOKUP(I166,'[2]AC TLB'!$A$7:$E$1199,5,1),\"\")","v":""}]
[163,null,null,null,null,null,null,null,null,{"$f":"IFERROR(VLOOKUP(I167,'[2]AC TLB'!$A$7:$E$1199,5,1),\"\")","v":""}]
[164,null,null,null,null,null,null,null,null,{"$f":"IFERROR(VLOOKUP(I168,'[2]AC TLB'!$A$7:$E$1199,5,1),\"\")","v":""}]
[165,null,null,null,null,null,null,null,null,{"$f":"IFERROR(VLOOKUP(I169,'[2]AC TLB'!$A$7:$E$1199,5,1),\"\")","v":""}]
[166,null,null,null,null,null,null,null,null,{"$f":"IFERROR(VLOOKUP(I170,'[2]AC TLB'!$A$7:$E$1199,5,1),\"\")","v":""}]
[167,null,null,null,null,null,null,null,null,{"$f":"IFERROR(VLOOKUP(I171,'[2]AC TLB'!$A$7:$E$1199,5,1),\"\")","v":""}]
[168,null,null,null,null,null,null,null,null,{"$f":"IFERROR(VLOOKUP(I172,'[2]AC TLB'!$A$7:$E$1199,5,1),\"\")","v":""}]
[169,null,null,null,null,null,null,null,null,{"$f":"IFERROR(VLOOKUP(I173,'[2]AC TLB'!$A$7:$E$1199,5,1),\"\")","v":""}]
[170,null,null,null,null,null,null,null,null,{"$f":"IFERROR(VLOOKUP(I174,'[2]AC TLB'!$A$7:$E$1199,5,1),\"\")","v":""}]
[171,null,null,null,null,null,null,null,null,{"$f":"IFERROR(VLOOKUP(I175,'[2]AC TLB'!$A$7:$E$1199,5,1),\"\")","v":""}]
[172,null,null,null,null,null,null,null,null,{"$f":"IFERROR(VLOOKUP(I176,'[2]AC TLB'!$A$7:$E$1199,5,1),\"\")","v":""}]
[173,null,null,null,null,null,null,null,null,{"$f":"IFERROR(VLOOKUP(I177,'[2]AC TLB'!$A$7:$E$1199,5,1),\"\")","v":""}]
[174,null,null,null,null,null,null,null,null,{"$f":"IFERROR(VLOOKUP(I178,'[2]AC TLB'!$A$7:$E$1199,5,1),\"\")","v":""}]
[175,null,null,null,null,null,null,null,null,{"$f":"IFERROR(VLOOKUP(I179,'[2]AC TLB'!$A$7:$E$1199,5,1),\"\")","v":""}]
[176,null,null,null,null,null,null,null,null,{"$f":"IFERROR(VLOOKUP(I180,'[2]AC TLB'!$A$7:$E$1199,5,1),\"\")","v":""}]
[177,null,null,null,null,null,null,null,null,{"$f":"IFERROR(VLOOKUP(I181,'[2]AC TLB'!$A$7:$E$1199,5,1),\"\")","v":""}]
[178,null,null,null,null,null,null,null,null,{"$f":"IFERROR(VLOOKUP(I182,'[2]AC TLB'!$A$7:$E$1199,5,1),\"\")","v":""}]
[179,null,null,null,null,null,null,null,null,{"$f":"IFERROR(VLOOKUP(I183,'[2]AC TLB'!$A$7:$E$1199,5,1),\"\")","v":""}]
[180,null,null,null,null,null,null,null,null,{"$f":"IFERROR(VLOOKUP(I184,'[2]AC TLB'!$A$7:$E$1199,5,1),\"\")","v":""}]
[181,null,null,null,null,null,null,null,null,{"$f":"IFERROR(VLOOKUP(I185,'[2]AC TLB'!$A$7:$E$1199,5,1),\"\")","v":""}]
[182,null,null,null,null,null,null,null,null,{"$f":"IFERROR(VLOOKUP(I186,'[2]AC TLB'!$A$7:$E$1199,5,1),\"\")","v":""}]
[183,null,null,null,null,null,null,null,null,{"$f":"IFERROR(VLOOKUP(I187,'[2]AC TLB'!$A$7:$E$1199,5,1),\"\")","v":""}]
[184,null,null,null,null,null,null,null,null,{"$f":"IFERROR(VLOOKUP(I188,'[2]AC TLB'!$A$7:$E$1199,5,1),\"\")","v":""}]
[185,null,null,null,null,null,null,null,null,{"$f":"IFERROR(VLOOKUP(I189,'[2]AC TLB'!$A$7:$E$1199,5,1),\"\")","v":""}]
[186,null,null,null,null,null,null,null,null,{"$f":"IFERROR(VLOOKUP(I190,'[2]AC TLB'!$A$7:$E$1199,5,1),\"\")","v":""}]
[187,null,null,null,null,null,null,null,null,{"$f":"IFERROR(VLOOKUP(I191,'[2]AC TLB'!$A$7:$E$1199,5,1),\"\")","v":""}]
[188,null,null,null,null,null,null,null,null,{"$f":"IFERROR(VLOOKUP(I192,'[2]AC TLB'!$A$7:$E$1199,5,1),\"\")","v":""}]
[189,null,null,null,null,null,null,null,null,{"$f":"IFERROR(VLOOKUP(I193,'[2]AC TLB'!$A$7:$E$1199,5,1),\"\")","v":""}]
[190,null,null,null,null,null,null,null,null,{"$f":"IFERROR(VLOOKUP(I194,'[2]AC TLB'!$A$7:$E$1199,5,1),\"\")","v":""}]
[191,null,null,null,null,null,null,null,null,{"$f":"IFERROR(VLOOKUP(I195,'[2]AC TLB'!$A$7:$E$1199,5,1),\"\")","v":""}]
[192,null,null,null,null,null,null,null,null,{"$f":"IFERROR(VLOOKUP(I196,'[2]AC TLB'!$A$7:$E$1199,5,1),\"\")","v":""}]
[193,null,null,null,null,null,null,null,null,{"$f":"IFERROR(VLOOKUP(I197,'[2]AC TLB'!$A$7:$E$1199,5,1),\"\")","v":""}]
[194,null,null,null,null,null,null,null,null,{"$f":"IFERROR(VLOOKUP(I198,'[2]AC TLB'!$A$7:$E$1199,5,1),\"\")","v":""}]
[195,null,null,null,null,null,null,null,null,{"$f":"IFERROR(VLOOKUP(I199,'[2]AC TLB'!$A$7:$E$1199,5,1),\"\")","v":""}]
[196,null,null,null,null,null,null,null,null,{"$f":"IFERROR(VLOOKUP(I200,'[2]AC TLB'!$A$7:$E$1199,5,1),\"\")","v":""}]
[197,null,null,null,null,null,null,null,null,{"$f":"IFERROR(VLOOKUP(I201,'[2]AC TLB'!$A$7:$E$1199,5,1),\"\")","v":""}]
[198,null,null,null,null,null,null,null,null,{"$f":"IFERROR(VLOOKUP(I202,'[2]AC TLB'!$A$7:$E$1199,5,1),\"\")","v":""}]
[199,null,null,null,null,null,null,null,null,{"$f":"IFERROR(VLOOKUP(I203,'[2]AC TLB'!$A$7:$E$1199,5,1),\"\")","v":""}]
[200,null,null,null,null,null,null,null,null,{"$f":"IFERROR(VLOOKUP(I204,'[2]AC TLB'!$A$7:$E$1199,5,1),\"\")","v":""}]
[201,null,null,null,null,null,null,null,null,{"$f":"IFERROR(VLOOKUP(I205,'[2]AC TLB'!$A$7:$E$1199,5,1),\"\")","v":""}]
[202,null,null,null,null,null,null,null,null,{"$f":"IFERROR(VLOOKUP(I206,'[2]AC TLB'!$A$7:$E$1199,5,1),\"\")","v":""}]
[203,null,null,null,null,null,null,null,null,{"$f":"IFERROR(VLOOKUP(I207,'[2]AC TLB'!$A$7:$E$1199,5,1),\"\")","v":""}]
[204,null,null,null,null,null,null,null,null,{"$f":"IFERROR(VLOOKUP(I208,'[2]AC TLB'!$A$7:$E$1199,5,1),\"\")","v":""}]
[205,null,null,null,null,null,null,null,null,{"$f":"IFERROR(VLOOKUP(I209,'[2]AC TLB'!$A$7:$E$1199,5,1),\"\")","v":""}]
[206,null,null,null,null,null,null,null,null,{"$f":"IFERROR(VLOOKUP(I210,'[2]AC TLB'!$A$7:$E$1199,5,1),\"\")","v":""}]
[207,null,null,null,null,null,null,null,null,{"$f":"IFERROR(VLOOKUP(I211,'[2]AC TLB'!$A$7:$E$1199,5,1),\"\")","v":""}]
[208,null,null,null,null,null,null,null,null,{"$f":"IFERROR(VLOOKUP(I212,'[2]AC TLB'!$A$7:$E$1199,5,1),\"\")","v":""}]
[209,null,null,null,null,null,null,null,null,{"$f":"IFERROR(VLOOKUP(I213,'[2]AC TLB'!$A$7:$E$1199,5,1),\"\")","v":""}]
[210,null,null,null,null,null,null,null,null,{"$f":"IFERROR(VLOOKUP(I214,'[2]AC TLB'!$A$7:$E$1199,5,1),\"\")","v":""}]
[211,null,null,null,null,null,null,null,null,{"$f":"IFERROR(VLOOKUP(I215,'[2]AC TLB'!$A$7:$E$1199,5,1),\"\")","v":""}]
[212,null,null,null,null,null,null,null,null,{"$f":"IFERROR(VLOOKUP(I216,'[2]AC TLB'!$A$7:$E$1199,5,1),\"\")","v":""}]
[213,null,null,null,null,null,null,null,null,{"$f":"IFERROR(VLOOKUP(I217,'[2]AC TLB'!$A$7:$E$1199,5,1),\"\")","v":""}]
[214,null,null,null,null,null,null,null,null,{"$f":"IFERROR(VLOOKUP(I218,'[2]AC TLB'!$A$7:$E$1199,5,1),\"\")","v":""}]
[215,null,null,null,null,null,null,null,null,{"$f":"IFERROR(VLOOKUP(I219,'[2]AC TLB'!$A$7:$E$1199,5,1),\"\")","v":""}]
[216,null,null,null,null,null,null,null,null,{"$f":"IFERROR(VLOOKUP(I220,'[2]AC TLB'!$A$7:$E$1199,5,1),\"\")","v":""}]
[217,null,null,null,null,null,null,null,null,{"$f":"IFERROR(VLOOKUP(I221,'[2]AC TLB'!$A$7:$E$1199,5,1),\"\")","v":""}]
[218,null,null,null,null,null,null,null,null,{"$f":"IFERROR(VLOOKUP(I222,'[2]AC TLB'!$A$7:$E$1199,5,1),\"\")","v":""}]
[219,null,null,null,null,null,null,null,null,{"$f":"IFERROR(VLOOKUP(I223,'[2]AC TLB'!$A$7:$E$1199,5,1),\"\")","v":""}]
[220,null,null,null,null,null,null,null,null,{"$f":"IFERROR(VLOOKUP(I224,'[2]AC TLB'!$A$7:$E$1199,5,1),\"\")","v":""}]
[221,null,null,null,null,null,null,null,null,{"$f":"IFERROR(VLOOKUP(I225,'[2]AC TLB'!$A$7:$E$1199,5,1),\"\")","v":""}]
[222,null,null,null,null,null,null,null,null,{"$f":"IFERROR(VLOOKUP(I226,'[2]AC TLB'!$A$7:$E$1199,5,1),\"\")","v":""}]
[223,null,null,null,null,null,null,null,null,{"$f":"IFERROR(VLOOKUP(I227,'[2]AC TLB'!$A$7:$E$1199,5,1),\"\")","v":""}]
[224,null,null,null,null,null,null,null,null,{"$f":"IFERROR(VLOOKUP(I228,'[2]AC TLB'!$A$7:$E$1199,5,1),\"\")","v":""}]
[225,null,null,null,null,null,null,null,null,{"$f":"IFERROR(VLOOKUP(I229,'[2]AC TLB'!$A$7:$E$1199,5,1),\"\")","v":""}]
[226,null,null,null,null,null,null,null,null,{"$f":"IFERROR(VLOOKUP(I230,'[2]AC TLB'!$A$7:$E$1199,5,1),\"\")","v":""}]
[227,null,null,null,null,null,null,null,null,{"$f":"IFERROR(VLOOKUP(I231,'[2]AC TLB'!$A$7:$E$1199,5,1),\"\")","v":""}]
[228,null,null,null,null,null,null,null,null,{"$f":"IFERROR(VLOOKUP(I232,'[2]AC TLB'!$A$7:$E$1199,5,1),\"\")","v":""}]
[229,null,null,null,null,null,null,null,null,{"$f":"IFERROR(VLOOKUP(I233,'[2]AC TLB'!$A$7:$E$1199,5,1),\"\")","v":""}]
[230,null,null,null,null,null,null,null,null,{"$f":"IFERROR(VLOOKUP(I234,'[2]AC TLB'!$A$7:$E$1199,5,1),\"\")","v":""}]
[231,null,null,null,null,null,null,null,null,{"$f":"IFERROR(VLOOKUP(I235,'[2]AC TLB'!$A$7:$E$1199,5,1),\"\")","v":""}]
[232,null,null,null,null,null,null,null,null,{"$f":"IFERROR(VLOOKUP(I236,'[2]AC TLB'!$A$7:$E$1199,5,1),\"\")","v":""}]
[233,null,null,null,null,null,null,null,null,{"$f":"IFERROR(VLOOKUP(I237,'[2]AC TLB'!$A$7:$E$1199,5,1),\"\")","v":""}]
[234,null,null,null,null,null,null,null,null,{"$f":"IFERROR(VLOOKUP(I238,'[2]AC TLB'!$A$7:$E$1199,5,1),\"\")","v":""}]
[235,null,null,null,null,null,null,null,null,{"$f":"IFERROR(VLOOKUP(I239,'[2]AC TLB'!$A$7:$E$1199,5,1),\"\")","v":""}]
[236,null,null,null,null,null,null,null,null,{"$f":"IFERROR(VLOOKUP(I240,'[2]AC TLB'!$A$7:$E$1199,5,1),\"\")","v":""}]
[237,null,null,null,null,null,null,null,null,{"$f":"IFERROR(VLOOKUP(I241,'[2]AC TLB'!$A$7:$E$1199,5,1),\"\")","v":""}]
[238,null,null,null,null,null,null,null,null,{"$f":"IFERROR(VLOOKUP(I242,'[2]AC TLB'!$A$7:$E$1199,5,1),\"\")","v":""}]
[239,null,null,null,null,null,null,null,null,{"$f":"IFERROR(VLOOKUP(I243,'[2]AC TLB'!$A$7:$E$1199,5,1),\"\")","v":""}]
[240,null,null,null,null,null,null,null,null,{"$f":"IFERROR(VLOOKUP(I244,'[2]AC TLB'!$A$7:$E$1199,5,1),\"\")","v":""}]
[241,null,null,null,null,null,null,null,null,{"$f":"IFERROR(VLOOKUP(I245,'[2]AC TLB'!$A$7:$E$1199,5,1),\"\")","v":""}]
[242,null,null,null,null,null,null,null,null,{"$f":"IFERROR(VLOOKUP(I246,'[2]AC TLB'!$A$7:$E$1199,5,1),\"\")","v":""}]
[243,null,null,null,null,null,null,null,null,{"$f":"IFERROR(VLOOKUP(I247,'[2]AC TLB'!$A$7:$E$1199,5,1),\"\")","v":""}]
[244,null,null,null,null,null,null,null,null,{"$f":"IFERROR(VLOOKUP(I248,'[2]AC TLB'!$A$7:$E$1199,5,1),\"\")","v":""}]
[245,null,null,null,null,null,null,null,null,{"$f":"IFERROR(VLOOKUP(I249,'[2]AC TLB'!$A$7:$E$1199,5,1),\"\")","v":""}]
[246,null,null,null,null,null,null,null,null,{"$f":"IFERROR(VLOOKUP(I250,'[2]AC TLB'!$A$7:$E$1199,5,1),\"\")","v":""}]
[247,null,null,null,null,null,null,null,null,{"$f":"IFERROR(VLOOKUP(I251,'[2]AC TLB'!$A$7:$E$1199,5,1),\"\")","v":""}]
[248,null,null,null,null,null,null,null,null,{"$f":"IFERROR(VLOOKUP(I252,'[2]AC TLB'!$A$7:$E$1199,5,1),\"\")","v":""}]
[249,null,null,null,null,null,null,null,null,{"$f":"IFERROR(VLOOKUP(I253,'[2]AC TLB'!$A$7:$E$1199,5,1),\"\")","v":""}]
[250,null,null,null,null,null,null,null,null,{"$f":"IFERROR(VLOOKUP(I254,'[2]AC TLB'!$A$7:$E$1199,5,1),\"\")","v":""}]
[251,null,null,null,null,null,null,null,null,{"$f":"IFERROR(VLOOKUP(I255,'[2]AC TLB'!$A$7:$E$1199,5,1),\"\")","v":""}]
[252,null,null,null,null,null,null,null,null,{"$f":"IFERROR(VLOOKUP(I256,'[2]AC TLB'!$A$7:$E$1199,5,1),\"\")","v":""}]
[253,null,null,null,null,null,null,null,null,{"$f":"IFERROR(VLOOKUP(I257,'[2]AC TLB'!$A$7:$E$1199,5,1),\"\")","v":""}]
[254,null,null,null,null,null,null,null,null,{"$f":"IFERROR(VLOOKUP(I258,'[2]AC TLB'!$A$7:$E$1199,5,1),\"\")","v":""}]
[255,null,null,null,null,null,null,null,null,{"$f":"IFERROR(VLOOKUP(I259,'[2]AC TLB'!$A$7:$E$1199,5,1),\"\")","v":""}]
[256,null,null,null,null,null,null,null,null,{"$f":"IFERROR(VLOOKUP(I260,'[2]AC TLB'!$A$7:$E$1199,5,1),\"\")","v":""}]
[257,null,null,null,null,null,null,null,null,{"$f":"IFERROR(VLOOKUP(I261,'[2]AC TLB'!$A$7:$E$1199,5,1),\"\")","v":""}]
[258,null,null,null,null,null,null,null,null,{"$f":"IFERROR(VLOOKUP(I262,'[2]AC TLB'!$A$7:$E$1199,5,1),\"\")","v":""}]
[259,null,null,null,null,null,null,null,null,{"$f":"IFERROR(VLOOKUP(I263,'[2]AC TLB'!$A$7:$E$1199,5,1),\"\")","v":""}]
[260,null,null,null,null,null,null,null,null,{"$f":"IFERROR(VLOOKUP(I264,'[2]AC TLB'!$A$7:$E$1199,5,1),\"\")","v":""}]
[261,null,null,null,null,null,null,null,null,{"$f":"IFERROR(VLOOKUP(I265,'[2]AC TLB'!$A$7:$E$1199,5,1),\"\")","v":""}]
[262,null,null,null,null,null,null,null,null,{"$f":"IFERROR(VLOOKUP(I266,'[2]AC TLB'!$A$7:$E$1199,5,1),\"\")","v":""}]
[263,null,null,null,null,null,null,null,null,{"$f":"IFERROR(VLOOKUP(I267,'[2]AC TLB'!$A$7:$E$1199,5,1),\"\")","v":""}]
[264,null,null,null,null,null,null,null,null,{"$f":"IFERROR(VLOOKUP(I268,'[2]AC TLB'!$A$7:$E$1199,5,1),\"\")","v":""}]
[265,null,null,null,null,null,null,null,null,{"$f":"IFERROR(VLOOKUP(I269,'[2]AC TLB'!$A$7:$E$1199,5,1),\"\")","v":""}]
[266,null,null,null,null,null,null,null,null,{"$f":"IFERROR(VLOOKUP(I270,'[2]AC TLB'!$A$7:$E$1199,5,1),\"\")","v":""}]
[267,null,null,null,null,null,null,null,null,{"$f":"IFERROR(VLOOKUP(I271,'[2]AC TLB'!$A$7:$E$1199,5,1),\"\")","v":""}]
[268,null,null,null,null,null,null,null,null,{"$f":"IFERROR(VLOOKUP(I272,'[2]AC TLB'!$A$7:$E$1199,5,1),\"\")","v":""}]
[269,null,null,null,null,null,null,null,null,{"$f":"IFERROR(VLOOKUP(I273,'[2]AC TLB'!$A$7:$E$1199,5,1),\"\")","v":""}]
[270,null,null,null,null,null,null,null,null,{"$f":"IFERROR(VLOOKUP(I274,'[2]AC TLB'!$A$7:$E$1199,5,1),\"\")","v":""}]
[271,null,null,null,null,null,null,null,null,{"$f":"IFERROR(VLOOKUP(I275,'[2]AC TLB'!$A$7:$E$1199,5,1),\"\")","v":""}]
[272,null,null,null,null,null,null,null,null,{"$f":"IFERROR(VLOOKUP(I276,'[2]AC TLB'!$A$7:$E$1199,5,1),\"\")","v":""}]
[273,null,null,null,null,null,null,null,null,{"$f":"IFERROR(VLOOKUP(I277,'[2]AC TLB'!$A$7:$E$1199,5,1),\"\")","v":""}]
[274,null,null,null,null,null,null,null,null,{"$f":"IFERROR(VLOOKUP(I278,'[2]AC TLB'!$A$7:$E$1199,5,1),\"\")","v":""}]
[275,null,null,null,null,null,null,null,null,{"$f":"IFERROR(VLOOKUP(I279,'[2]AC TLB'!$A$7:$E$1199,5,1),\"\")","v":""}]
[276,null,null,null,null,null,null,null,null,{"$f":"IFERROR(VLOOKUP(I280,'[2]AC TLB'!$A$7:$E$1199,5,1),\"\")","v":""}]
[277,null,null,null,null,null,null,null,null,{"$f":"IFERROR(VLOOKUP(I281,'[2]AC TLB'!$A$7:$E$1199,5,1),\"\")","v":""}]
[278,null,null,null,null,null,null,null,null,{"$f":"IFERROR(VLOOKUP(I282,'[2]AC TLB'!$A$7:$E$1199,5,1),\"\")","v":""}]
[279,null,null,null,null,null,null,null,null,{"$f":"IFERROR(VLOOKUP(I283,'[2]AC TLB'!$A$7:$E$1199,5,1),\"\")","v":""}]
[280,null,null,null,null,null,null,null,null,{"$f":"IFERROR(VLOOKUP(I284,'[2]AC TLB'!$A$7:$E$1199,5,1),\"\")","v":""}]
[281,null,null,null,null,null,null,null,null,{"$f":"IFERROR(VLOOKUP(I285,'[2]AC TLB'!$A$7:$E$1199,5,1),\"\")","v":""}]
[282,null,null,null,null,null,null,null,null,{"$f":"IFERROR(VLOOKUP(I286,'[2]AC TLB'!$A$7:$E$1199,5,1),\"\")","v":""}]
[283,null,null,null,null,null,null,null,null,{"$f":"IFERROR(VLOOKUP(I287,'[2]AC TLB'!$A$7:$E$1199,5,1),\"\")","v":""}]
[284,null,null,null,null,null,null,null,null,{"$f":"IFERROR(VLOOKUP(I288,'[2]AC TLB'!$A$7:$E$1199,5,1),\"\")","v":""}]
[285,null,null,null,null,null,null,null,null,{"$f":"IFERROR(VLOOKUP(I289,'[2]AC TLB'!$A$7:$E$1199,5,1),\"\")","v":""}]
[286,null,null,null,null,null,null,null,null,{"$f":"IFERROR(VLOOKUP(I290,'[2]AC TLB'!$A$7:$E$1199,5,1),\"\")","v":""}]
[287,null,null,null,null,null,null,null,null,{"$f":"IFERROR(VLOOKUP(I291,'[2]AC TLB'!$A$7:$E$1199,5,1),\"\")","v":""}]
[288,null,null,null,null,null,null,null,null,{"$f":"IFERROR(VLOOKUP(I292,'[2]AC TLB'!$A$7:$E$1199,5,1),\"\")","v":""}]
[289,null,null,null,null,null,null,null,null,{"$f":"IFERROR(VLOOKUP(I293,'[2]AC TLB'!$A$7:$E$1199,5,1),\"\")","v":""}]
[290,null,null,null,null,null,null,null,null,{"$f":"IFERROR(VLOOKUP(I294,'[2]AC TLB'!$A$7:$E$1199,5,1),\"\")","v":""}]
[291,null,null,null,null,null,null,null,null,{"$f":"IFERROR(VLOOKUP(I295,'[2]AC TLB'!$A$7:$E$1199,5,1),\"\")","v":""}]
[292,null,null,null,null,null,null,null,null,{"$f":"IFERROR(VLOOKUP(I296,'[2]AC TLB'!$A$7:$E$1199,5,1),\"\")","v":""}]
[293,null,null,null,null,null,null,null,null,{"$f":"IFERROR(VLOOKUP(I297,'[2]AC TLB'!$A$7:$E$1199,5,1),\"\")","v":""}]
[294,null,null,null,null,null,null,null,null,{"$f":"IFERROR(VLOOKUP(I298,'[2]AC TLB'!$A$7:$E$1199,5,1),\"\")","v":""}]
[295,null,null,null,null,null,null,null,null,{"$f":"IFERROR(VLOOKUP(I299,'[2]AC TLB'!$A$7:$E$1199,5,1),\"\")","v":""}]
[296,null,null,null,null,null,null,null,null,{"$f":"IFERROR(VLOOKUP(I300,'[2]AC TLB'!$A$7:$E$1199,5,1),\"\")","v":""}]
[297,null,null,null,null,null,null,null,null,{"$f":"IFERROR(VLOOKUP(I301,'[2]AC TLB'!$A$7:$E$1199,5,1),\"\")","v":""}]
[298,null,null,null,null,null,null,null,null,{"$f":"IFERROR(VLOOKUP(I302,'[2]AC TLB'!$A$7:$E$1199,5,1),\"\")","v":""}]
[299,null,null,null,null,null,null,null,null,{"$f":"IFERROR(VLOOKUP(I303,'[2]AC TLB'!$A$7:$E$1199,5,1),\"\")","v":""}]
[300,null,null,null,null,null,null,null,null,{"$f":"IFERROR(VLOOKUP(I304,'[2]AC TLB'!$A$7:$E$1199,5,1),\"\")","v":""}]
[301,null,null,null,null,null,null,null,null,{"$f":"IFERROR(VLOOKUP(I305,'[2]AC TLB'!$A$7:$E$1199,5,1),\"\")","v":""}]
[302,null,null,null,null,null,null,null,null,{"$f":"IFERROR(VLOOKUP(I306,'[2]AC TLB'!$A$7:$E$1199,5,1),\"\")","v":""}]
[303,null,null,null,null,null,null,null,null,{"$f":"IFERROR(VLOOKUP(I307,'[2]AC TLB'!$A$7:$E$1199,5,1),\"\")","v":""}]
[304,null,null,null,null,null,null,null,null,{"$f":"IFERROR(VLOOKUP(I308,'[2]AC TLB'!$A$7:$E$1199,5,1),\"\")","v":""}]
[305,null,null,null,null,null,null,null,null,{"$f":"IFERROR(VLOOKUP(I309,'[2]AC TLB'!$A$7:$E$1199,5,1),\"\")","v":""}]
[306,null,null,null,null,null,null,null,null,{"$f":"IFERROR(VLOOKUP(I310,'[2]AC TLB'!$A$7:$E$1199,5,1),\"\")","v":""}]
[307,null,null,null,null,null,null,null,null,{"$f":"IFERROR(VLOOKUP(I311,'[2]AC TLB'!$A$7:$E$1199,5,1),\"\")","v":""}]
[308,null,null,null,null,null,null,null,null,{"$f":"IFERROR(VLOOKUP(I312,'[2]AC TLB'!$A$7:$E$1199,5,1),\"\")","v":""}]
[309,null,null,null,null,null,null,null,null,{"$f":"IFERROR(VLOOKUP(I313,'[2]AC TLB'!$A$7:$E$1199,5,1),\"\")","v":""}]
[310,null,null,null,null,null,null,null,null,{"$f":"IFERROR(VLOOKUP(I314,'[2]AC TLB'!$A$7:$E$1199,5,1),\"\")","v":""}]
[311,null,null,null,null,null,null,null,null,{"$f":"IFERROR(VLOOKUP(I315,'[2]AC TLB'!$A$7:$E$1199,5,1),\"\")","v":""}]
[312,null,null,null,null,null,null,null,null,{"$f":"IFERROR(VLOOKUP(I316,'[2]AC TLB'!$A$7:$E$1199,5,1),\"\")","v":""}]
[313,null,null,null,null,null,null,null,null,{"$f":"IFERROR(VLOOKUP(I317,'[2]AC TLB'!$A$7:$E$1199,5,1),\"\")","v":""}]
[314,null,null,null,null,null,null,null,null,{"$f":"IFERROR(VLOOKUP(I318,'[2]AC TLB'!$A$7:$E$1199,5,1),\"\")","v":""}]
[315,null,null,null,null,null,null,null,null,{"$f":"IFERROR(VLOOKUP(I319,'[2]AC TLB'!$A$7:$E$1199,5,1),\"\")","v":""}]
[316,null,null,null,null,null,null,null,null,{"$f":"IFERROR(VLOOKUP(I320,'[2]AC TLB'!$A$7:$E$1199,5,1),\"\")","v":""}]
[317,null,null,null,null,null,null,null,null,{"$f":"IFERROR(VLOOKUP(I321,'[2]AC TLB'!$A$7:$E$1199,5,1),\"\")","v":""}]
[318,null,null,null,null,null,null,null,null,{"$f":"IFERROR(VLOOKUP(I322,'[2]AC TLB'!$A$7:$E$1199,5,1),\"\")","v":""}]
[319,null,null,null,null,null,null,null,null,{"$f":"IFERROR(VLOOKUP(I323,'[2]AC TLB'!$A$7:$E$1199,5,1),\"\")","v":""}]
[320,null,null,null,null,null,null,null,null,{"$f":"IFERROR(VLOOKUP(I324,'[2]AC TLB'!$A$7:$E$1199,5,1),\"\")","v":""}]
[321,null,null,null,null,null,null,null,null,{"$f":"IFERROR(VLOOKUP(I325,'[2]AC TLB'!$A$7:$E$1199,5,1),\"\")","v":""}]
[322,null,null,null,null,null,null,null,null,{"$f":"IFERROR(VLOOKUP(I326,'[2]AC TLB'!$A$7:$E$1199,5,1),\"\")","v":""}]
[323,null,null,null,null,null,null,null,null,{"$f":"IFERROR(VLOOKUP(I327,'[2]AC TLB'!$A$7:$E$1199,5,1),\"\")","v":""}]
[324,null,null,null,null,null,null,null,null,{"$f":"IFERROR(VLOOKUP(I328,'[2]AC TLB'!$A$7:$E$1199,5,1),\"\")","v":""}]
[325,null,null,null,null,null,null,null,null,{"$f":"IFERROR(VLOOKUP(I329,'[2]AC TLB'!$A$7:$E$1199,5,1),\"\")","v":""}]
[326,null,null,null,null,null,null,null,null,{"$f":"IFERROR(VLOOKUP(I330,'[2]AC TLB'!$A$7:$E$1199,5,1),\"\")","v":""}]
[327,null,null,null,null,null,null,null,null,{"$f":"IFERROR(VLOOKUP(I331,'[2]AC TLB'!$A$7:$E$1199,5,1),\"\")","v":""}]
[328,null,null,null,null,null,null,null,null,{"$f":"IFERROR(VLOOKUP(I332,'[2]AC TLB'!$A$7:$E$1199,5,1),\"\")","v":""}]
[329,null,null,null,null,null,null,null,null,{"$f":"IFERROR(VLOOKUP(I333,'[2]AC TLB'!$A$7:$E$1199,5,1),\"\")","v":""}]
[330,null,null,null,null,null,null,null,null,{"$f":"IFERROR(VLOOKUP(I334,'[2]AC TLB'!$A$7:$E$1199,5,1),\"\")","v":""}]
[331,null,null,null,null,null,null,null,null,{"$f":"IFERROR(VLOOKUP(I335,'[2]AC TLB'!$A$7:$E$1199,5,1),\"\")","v":""}]
[332,null,null,null,null,null,null,null,null,{"$f":"IFERROR(VLOOKUP(I336,'[2]AC TLB'!$A$7:$E$1199,5,1),\"\")","v":""}]
[333,null,null,null,null,null,null,null,null,{"$f":"IFERROR(VLOOKUP(I337,'[2]AC TLB'!$A$7:$E$1199,5,1),\"\")","v":""}]
[334,null,null,null,null,null,null,null,null,{"$f":"IFERROR(VLOOKUP(I338,'[2]AC TLB'!$A$7:$E$1199,5,1),\"\")","v":""}]
[335,null,null,null,null,null,null,null,null,{"$f":"IFERROR(VLOOKUP(I339,'[2]AC TLB'!$A$7:$E$1199,5,1),\"\")","v":""}]
[336,null,null,null,null,null,null,null,null,{"$f":"IFERROR(VLOOKUP(I340,'[2]AC TLB'!$A$7:$E$1199,5,1),\"\")","v":""}]
[337,null,null,null,null,null,null,null,null,{"$f":"IFERROR(VLOOKUP(I341,'[2]AC TLB'!$A$7:$E$1199,5,1),\"\")","v":""}]
[338,null,null,null,null,null,null,null,null,{"$f":"IFERROR(VLOOKUP(I342,'[2]AC TLB'!$A$7:$E$1199,5,1),\"\")","v":""}]
[339,null,null,null,null,null,null,null,null,{"$f":"IFERROR(VLOOKUP(I343,'[2]AC TLB'!$A$7:$E$1199,5,1),\"\")","v":""}]
[340,null,null,null,null,null,null,null,null,{"$f":"IFERROR(VLOOKUP(I344,'[2]AC TLB'!$A$7:$E$1199,5,1),\"\")","v":""}]
[341,null,null,null,null,null,null,null,null,{"$f":"IFERROR(VLOOKUP(I345,'[2]AC TLB'!$A$7:$E$1199,5,1),\"\")","v":""}]
[342,null,null,null,null,null,null,null,null,{"$f":"IFERROR(VLOOKUP(I346,'[2]AC TLB'!$A$7:$E$1199,5,1),\"\")","v":""}]
[343,null,null,null,null,null,null,null,null,{"$f":"IFERROR(VLOOKUP(I347,'[2]AC TLB'!$A$7:$E$1199,5,1),\"\")","v":""}]
[344,null,null,null,null,null,null,null,null,{"$f":"IFERROR(VLOOKUP(I348,'[2]AC TLB'!$A$7:$E$1199,5,1),\"\")","v":""}]
[345,null,null,null,null,null,null,null,null,{"$f":"IFERROR(VLOOKUP(I349,'[2]AC TLB'!$A$7:$E$1199,5,1),\"\")","v":""}]
[346,null,null,null,null,null,null,null,null,{"$f":"IFERROR(VLOOKUP(I350,'[2]AC TLB'!$A$7:$E$1199,5,1),\"\")","v":""}]
[347,null,null,null,null,null,null,null,null,{"$f":"IFERROR(VLOOKUP(I351,'[2]AC TLB'!$A$7:$E$1199,5,1),\"\")","v":""}]
[348,null,null,null,null,null,null,null,null,{"$f":"IFERROR(VLOOKUP(I352,'[2]AC TLB'!$A$7:$E$1199,5,1),\"\")","v":""}]
[349,null,null,null,null,null,null,null,null,{"$f":"IFERROR(VLOOKUP(I353,'[2]AC TLB'!$A$7:$E$1199,5,1),\"\")","v":""}]
[350,null,null,null,null,null,null,null,null,{"$f":"IFERROR(VLOOKUP(I354,'[2]AC TLB'!$A$7:$E$1199,5,1),\"\")","v":""}]
[351,null,null,null,null,null,null,null,null,{"$f":"IFERROR(VLOOKUP(I355,'[2]AC TLB'!$A$7:$E$1199,5,1),\"\")","v":""}]
[352,null,null,null,null,null,null,null,null,{"$f":"IFERROR(VLOOKUP(I356,'[2]AC TLB'!$A$7:$E$1199,5,1),\"\")","v":""}]
[353,null,null,null,null,null,null,null,null,{"$f":"IFERROR(VLOOKUP(I357,'[2]AC TLB'!$A$7:$E$1199,5,1),\"\")","v":""}]
[354,null,null,null,null,null,null,null,null,{"$f":"IFERROR(VLOOKUP(I358,'[2]AC TLB'!$A$7:$E$1199,5,1),\"\")","v":""}]
[355,null,null,null,null,null,null,null,null,{"$f":"IFERROR(VLOOKUP(I359,'[2]AC TLB'!$A$7:$E$1199,5,1),\"\")","v":""}]
[356,null,null,null,null,null,null,null,null,{"$f":"IFERROR(VLOOKUP(I360,'[2]AC TLB'!$A$7:$E$1199,5,1),\"\")","v":""}]
[357,null,null,null,null,null,null,null,null,{"$f":"IFERROR(VLOOKUP(I361,'[2]AC TLB'!$A$7:$E$1199,5,1),\"\")","v":""}]
[358,null,null,null,null,null,null,null,null,{"$f":"IFERROR(VLOOKUP(I362,'[2]AC TLB'!$A$7:$E$1199,5,1),\"\")","v":""}]
[359,null,null,null,null,null,null,null,null,{"$f":"IFERROR(VLOOKUP(I363,'[2]AC TLB'!$A$7:$E$1199,5,1),\"\")","v":""}]
[360,null,null,null,null,null,null,null,null,{"$f":"IFERROR(VLOOKUP(I364,'[2]AC TLB'!$A$7:$E$1199,5,1),\"\")","v":""}]
[361,null,null,null,null,null,null,null,null,{"$f":"IFERROR(VLOOKUP(I365,'[2]AC TLB'!$A$7:$E$1199,5,1),\"\")","v":""}]
[362,null,null,null,null,null,null,null,null,{"$f":"IFERROR(VLOOKUP(I366,'[2]AC TLB'!$A$7:$E$1199,5,1),\"\")","v":""}]
[363,null,null,null,null,null,null,null,null,{"$f":"IFERROR(VLOOKUP(I367,'[2]AC TLB'!$A$7:$E$1199,5,1),\"\")","v":""}]
[364,null,null,null,null,null,null,null,null,{"$f":"IFERROR(VLOOKUP(I368,'[2]AC TLB'!$A$7:$E$1199,5,1),\"\")","v":""}]
[365,null,null,null,null,null,null,null,null,{"$f":"IFERROR(VLOOKUP(I369,'[2]AC TLB'!$A$7:$E$1199,5,1),\"\")","v":""}]
[366,null,null,null,null,null,null,null,null,{"$f":"IFERROR(VLOOKUP(I370,'[2]AC TLB'!$A$7:$E$1199,5,1),\"\")","v":""}]
[367,null,null,null,null,null,null,null,null,{"$f":"IFERROR(VLOOKUP(I371,'[2]AC TLB'!$A$7:$E$1199,5,1),\"\")","v":""}]
[368,null,null,null,null,null,null,null,null,{"$f":"IFERROR(VLOOKUP(I372,'[2]AC TLB'!$A$7:$E$1199,5,1),\"\")","v":""}]
[369,null,null,null,null,null,null,null,null,{"$f":"IFERROR(VLOOKUP(I373,'[2]AC TLB'!$A$7:$E$1199,5,1),\"\")","v":""}]
[370,null,null,null,null,null,null,null,null,{"$f":"IFERROR(VLOOKUP(I374,'[2]AC TLB'!$A$7:$E$1199,5,1),\"\")","v":""}]
[371,null,null,null,null,null,null,null,null,{"$f":"IFERROR(VLOOKUP(I375,'[2]AC TLB'!$A$7:$E$1199,5,1),\"\")","v":""}]
[372,null,null,null,null,null,null,null,null,{"$f":"IFERROR(VLOOKUP(I376,'[2]AC TLB'!$A$7:$E$1199,5,1),\"\")","v":""}]
[373,null,null,null,null,null,null,null,null,{"$f":"IFERROR(VLOOKUP(I377,'[2]AC TLB'!$A$7:$E$1199,5,1),\"\")","v":""}]
[374,null,null,null,null,null,null,null,null,{"$f":"IFERROR(VLOOKUP(I378,'[2]AC TLB'!$A$7:$E$1199,5,1),\"\")","v":""}]
[375,null,null,null,null,null,null,null,null,{"$f":"IFERROR(VLOOKUP(I379,'[2]AC TLB'!$A$7:$E$1199,5,1),\"\")","v":""}]
[376,null,null,null,null,null,null,null,null,{"$f":"IFERROR(VLOOKUP(I380,'[2]AC TLB'!$A$7:$E$1199,5,1),\"\")","v":""}]
[377,null,null,null,null,null,null,null,null,{"$f":"IFERROR(VLOOKUP(I381,'[2]AC TLB'!$A$7:$E$1199,5,1),\"\")","v":""}]
[378,null,null,null,null,null,null,null,null,{"$f":"IFERROR(VLOOKUP(I382,'[2]AC TLB'!$A$7:$E$1199,5,1),\"\")","v":""}]
[379,null,null,null,null,null,null,null,null,{"$f":"IFERROR(VLOOKUP(I383,'[2]AC TLB'!$A$7:$E$1199,5,1),\"\")","v":""}]
[380,null,null,null,null,null,null,null,null,{"$f":"IFERROR(VLOOKUP(I384,'[2]AC TLB'!$A$7:$E$1199,5,1),\"\")","v":""}]
[381,null,null,null,null,null,null,null,null,{"$f":"IFERROR(VLOOKUP(I385,'[2]AC TLB'!$A$7:$E$1199,5,1),\"\")","v":""}]
[382,null,null,null,null,null,null,null,null,{"$f":"IFERROR(VLOOKUP(I386,'[2]AC TLB'!$A$7:$E$1199,5,1),\"\")","v":""}]
[383,null,null,null,null,null,null,null,null,{"$f":"IFERROR(VLOOKUP(I387,'[2]AC TLB'!$A$7:$E$1199,5,1),\"\")","v":""}]
[384,null,null,null,null,null,null,null,null,{"$f":"IFERROR(VLOOKUP(I388,'[2]AC TLB'!$A$7:$E$1199,5,1),\"\")","v":""}]
[385,null,null,null,null,null,null,null,null,{"$f":"IFERROR(VLOOKUP(I389,'[2]AC TLB'!$A$7:$E$1199,5,1),\"\")","v":""}]
[386,null,null,null,null,null,null,null,null,{"$f":"IFERROR(VLOOKUP(I390,'[2]AC TLB'!$A$7:$E$1199,5,1),\"\")","v":""}]
[387,null,null,null,null,null,null,null,null,{"$f":"IFERROR(VLOOKUP(I391,'[2]AC TLB'!$A$7:$E$1199,5,1),\"\")","v":""}]
[388,null,null,null,null,null,null,null,null,{"$f":"IFERROR(VLOOKUP(I392,'[2]AC TLB'!$A$7:$E$1199,5,1),\"\")","v":""}]
[389,null,null,null,null,null,null,null,null,{"$f":"IFERROR(VLOOKUP(I393,'[2]AC TLB'!$A$7:$E$1199,5,1),\"\")","v":""}]
[390,null,null,null,null,null,null,null,null,{"$f":"IFERROR(VLOOKUP(I394,'[2]AC TLB'!$A$7:$E$1199,5,1),\"\")","v":""}]
[391,null,null,null,null,null,null,null,null,{"$f":"IFERROR(VLOOKUP(I395,'[2]AC TLB'!$A$7:$E$1199,5,1),\"\")","v":""}]
[392,null,null,null,null,null,null,null,null,{"$f":"IFERROR(VLOOKUP(I396,'[2]AC TLB'!$A$7:$E$1199,5,1),\"\")","v":""}]
[393,null,null,null,null,null,null,null,null,{"$f":"IFERROR(VLOOKUP(I397,'[2]AC TLB'!$A$7:$E$1199,5,1),\"\")","v":""}]
[394,null,null,null,null,null,null,null,null,{"$f":"IFERROR(VLOOKUP(I398,'[2]AC TLB'!$A$7:$E$1199,5,1),\"\")","v":""}]
[395,null,null,null,null,null,null,null,null,{"$f":"IFERROR(VLOOKUP(I399,'[2]AC TLB'!$A$7:$E$1199,5,1),\"\")","v":""}]
[396,null,null,null,null,null,null,null,null,{"$f":"IFERROR(VLOOKUP(I400,'[2]AC TLB'!$A$7:$E$1199,5,1),\"\")","v":""}]
[397,null,null,null,null,null,null,null,null,{"$f":"IFERROR(VLOOKUP(I401,'[2]AC TLB'!$A$7:$E$1199,5,1),\"\")","v":""}]
[398,null,null,null,null,null,null,null,null,{"$f":"IFERROR(VLOOKUP(I402,'[2]AC TLB'!$A$7:$E$1199,5,1),\"\")","v":""}]
[399,null,null,null,null,null,null,null,null,{"$f":"IFERROR(VLOOKUP(I403,'[2]AC TLB'!$A$7:$E$1199,5,1),\"\")","v":""}]
[400,null,null,null,null,null,null,null,null,{"$f":"IFERROR(VLOOKUP(I404,'[2]AC TLB'!$A$7:$E$1199,5,1),\"\")","v":""}]
[401,null,null,null,null,null,null,null,null,{"$f":"IFERROR(VLOOKUP(I405,'[2]AC TLB'!$A$7:$E$1199,5,1),\"\")","v":""}]
[402,null,null,null,null,null,null,null,null,{"$f":"IFERROR(VLOOKUP(I406,'[2]AC TLB'!$A$7:$E$1199,5,1),\"\")","v":""}]
[403,null,null,null,null,null,null,null,null,{"$f":"IFERROR(VLOOKUP(I407,'[2]AC TLB'!$A$7:$E$1199,5,1),\"\")","v":""}]
[404,null,null,null,null,null,null,null,null,{"$f":"IFERROR(VLOOKUP(I408,'[2]AC TLB'!$A$7:$E$1199,5,1),\"\")","v":""}]
[405,null,null,null,null,null,null,null,null,{"$f":"IFERROR(VLOOKUP(I409,'[2]AC TLB'!$A$7:$E$1199,5,1),\"\")","v":""}]
[406,null,null,null,null,null,null,null,null,{"$f":"IFERROR(VLOOKUP(I410,'[2]AC TLB'!$A$7:$E$1199,5,1),\"\")","v":""}]
[407,null,null,null,null,null,null,null,null,{"$f":"IFERROR(VLOOKUP(I411,'[2]AC TLB'!$A$7:$E$1199,5,1),\"\")","v":""}]
[408,null,null,null,null,null,null,null,null,{"$f":"IFERROR(VLOOKUP(I412,'[2]AC TLB'!$A$7:$E$1199,5,1),\"\")","v":""}]
[409,null,null,null,null,null,null,null,null,{"$f":"IFERROR(VLOOKUP(I413,'[2]AC TLB'!$A$7:$E$1199,5,1),\"\")","v":""}]
[410,null,null,null,null,null,null,null,null,{"$f":"IFERROR(VLOOKUP(I414,'[2]AC TLB'!$A$7:$E$1199,5,1),\"\")","v":""}]
[411,null,null,null,null,null,null,null,null,{"$f":"IFERROR(VLOOKUP(I415,'[2]AC TLB'!$A$7:$E$1199,5,1),\"\")","v":""}]
[412,null,null,null,null,null,null,null,null,{"$f":"IFERROR(VLOOKUP(I416,'[2]AC TLB'!$A$7:$E$1199,5,1),\"\")","v":""}]
[413,null,null,null,null,null,null,null,null,{"$f":"IFERROR(VLOOKUP(I417,'[2]AC TLB'!$A$7:$E$1199,5,1),\"\")","v":""}]
[414,null,null,null,null,null,null,null,null,{"$f":"IFERROR(VLOOKUP(I418,'[2]AC TLB'!$A$7:$E$1199,5,1),\"\")","v":""}]
[415,null,null,null,null,null,null,null,null,{"$f":"IFERROR(VLOOKUP(I419,'[2]AC TLB'!$A$7:$E$1199,5,1),\"\")","v":""}]
[416,null,null,null,null,null,null,null,null,{"$f":"IFERROR(VLOOKUP(I420,'[2]AC TLB'!$A$7:$E$1199,5,1),\"\")","v":""}]
[417,null,null,null,null,null,null,null,null,{"$f":"IFERROR(VLOOKUP(I421,'[2]AC TLB'!$A$7:$E$1199,5,1),\"\")","v":""}]
[418,null,null,null,null,null,null,null,null,{"$f":"IFERROR(VLOOKUP(I422,'[2]AC TLB'!$A$7:$E$1199,5,1),\"\")","v":""}]
[419,null,null,null,null,null,null,null,null,{"$f":"IFERROR(VLOOKUP(I423,'[2]AC TLB'!$A$7:$E$1199,5,1),\"\")","v":""}]
[420,null,null,null,null,null,null,null,null,{"$f":"IFERROR(VLOOKUP(I424,'[2]AC TLB'!$A$7:$E$1199,5,1),\"\")","v":""}]
[421,null,null,null,null,null,null,null,null,{"$f":"IFERROR(VLOOKUP(I425,'[2]AC TLB'!$A$7:$E$1199,5,1),\"\")","v":""}]
[422,null,null,null,null,null,null,null,null,{"$f":"IFERROR(VLOOKUP(I426,'[2]AC TLB'!$A$7:$E$1199,5,1),\"\")","v":""}]
[423,null,null,null,null,null,null,null,null,{"$f":"IFERROR(VLOOKUP(I427,'[2]AC TLB'!$A$7:$E$1199,5,1),\"\")","v":""}]
[424,null,null,null,null,null,null,null,null,{"$f":"IFERROR(VLOOKUP(I428,'[2]AC TLB'!$A$7:$E$1199,5,1),\"\")","v":""}]
[425,null,null,null,null,null,null,null,null,{"$f":"IFERROR(VLOOKUP(I429,'[2]AC TLB'!$A$7:$E$1199,5,1),\"\")","v":""}]
[426,null,null,null,null,null,null,null,null,{"$f":"IFERROR(VLOOKUP(I430,'[2]AC TLB'!$A$7:$E$1199,5,1),\"\")","v":""}]
[427,null,null,null,null,null,null,null,null,{"$f":"IFERROR(VLOOKUP(I431,'[2]AC TLB'!$A$7:$E$1199,5,1),\"\")","v":""}]
[428,null,null,null,null,null,null,null,null,{"$f":"IFERROR(VLOOKUP(I432,'[2]AC TLB'!$A$7:$E$1199,5,1),\"\")","v":""}]
[429,null,null,null,null,null,null,null,null,{"$f":"IFERROR(VLOOKUP(I433,'[2]AC TLB'!$A$7:$E$1199,5,1),\"\")","v":""}]
[430,null,null,null,null,null,null,null,null,{"$f":"IFERROR(VLOOKUP(I434,'[2]AC TLB'!$A$7:$E$1199,5,1),\"\")","v":""}]
[431,null,null,null,null,null,null,null,null,{"$f":"IFERROR(VLOOKUP(I435,'[2]AC TLB'!$A$7:$E$1199,5,1),\"\")","v":""}]
[432,null,null,null,null,null,null,null,null,{"$f":"IFERROR(VLOOKUP(I436,'[2]AC TLB'!$A$7:$E$1199,5,1),\"\")","v":""}]
[433,null,null,null,null,null,null,null,null,{"$f":"IFERROR(VLOOKUP(I437,'[2]AC TLB'!$A$7:$E$1199,5,1),\"\")","v":""}]
[434,null,null,null,null,null,null,null,null,{"$f":"IFERROR(VLOOKUP(I438,'[2]AC TLB'!$A$7:$E$1199,5,1),\"\")","v":""}]
[435,null,null,null,null,null,null,null,null,{"$f":"IFERROR(VLOOKUP(I439,'[2]AC TLB'!$A$7:$E$1199,5,1),\"\")","v":""}]
[436,null,null,null,null,null,null,null,null,{"$f":"IFERROR(VLOOKUP(I440,'[2]AC TLB'!$A$7:$E$1199,5,1),\"\")","v":""}]
[437,null,null,null,null,null,null,null,null,{"$f":"IFERROR(VLOOKUP(I441,'[2]AC TLB'!$A$7:$E$1199,5,1),\"\")","v":""}]
[438,null,null,null,null,null,null,null,null,{"$f":"IFERROR(VLOOKUP(I442,'[2]AC TLB'!$A$7:$E$1199,5,1),\"\")","v":""}]
[439,null,null,null,null,null,null,null,null,{"$f":"IFERROR(VLOOKUP(I443,'[2]AC TLB'!$A$7:$E$1199,5,1),\"\")","v":""}]
[440,null,null,null,null,null,null,null,null,{"$f":"IFERROR(VLOOKUP(I444,'[2]AC TLB'!$A$7:$E$1199,5,1),\"\")","v":""}]
[441,null,null,null,null,null,null,null,null,{"$f":"IFERROR(VLOOKUP(I445,'[2]AC TLB'!$A$7:$E$1199,5,1),\"\")","v":""}]
[442,null,null,null,null,null,null,null,null,{"$f":"IFERROR(VLOOKUP(I446,'[2]AC TLB'!$A$7:$E$1199,5,1),\"\")","v":""}]
[443,null,null,null,null,null,null,null,null,{"$f":"IFERROR(VLOOKUP(I447,'[2]AC TLB'!$A$7:$E$1199,5,1),\"\")","v":""}]
[444,null,null,null,null,null,null,null,null,{"$f":"IFERROR(VLOOKUP(I448,'[2]AC TLB'!$A$7:$E$1199,5,1),\"\")","v":""}]
[445,null,null,null,null,null,null,null,null,{"$f":"IFERROR(VLOOKUP(I449,'[2]AC TLB'!$A$7:$E$1199,5,1),\"\")","v":""}]
[446,null,null,null,null,null,null,null,null,{"$f":"IFERROR(VLOOKUP(I450,'[2]AC TLB'!$A$7:$E$1199,5,1),\"\")","v":""}]
[447,null,null,null,null,null,null,null,null,{"$f":"IFERROR(VLOOKUP(I451,'[2]AC TLB'!$A$7:$E$1199,5,1),\"\")","v":""}]
[448,null,null,null,null,null,null,null,null,{"$f":"IFERROR(VLOOKUP(I452,'[2]AC TLB'!$A$7:$E$1199,5,1),\"\")","v":""}]
[449,null,null,null,null,null,null,null,null,{"$f":"IFERROR(VLOOKUP(I453,'[2]AC TLB'!$A$7:$E$1199,5,1),\"\")","v":""}]
[450,null,null,null,null,null,null,null,null,{"$f":"IFERROR(VLOOKUP(I454,'[2]AC TLB'!$A$7:$E$1199,5,1),\"\")","v":""}]
[451,null,null,null,null,null,null,null,null,{"$f":"IFERROR(VLOOKUP(I455,'[2]AC TLB'!$A$7:$E$1199,5,1),\"\")","v":""}]
[452,null,null,null,null,null,null,null,null,{"$f":"IFERROR(VLOOKUP(I456,'[2]AC TLB'!$A$7:$E$1199,5,1),\"\")","v":""}]
[453,null,null,null,null,null,null,null,null,{"$f":"IFERROR(VLOOKUP(I457,'[2]AC TLB'!$A$7:$E$1199,5,1),\"\")","v":""}]
[454,null,null,null,null,null,null,null,null,{"$f":"IFERROR(VLOOKUP(I458,'[2]AC TLB'!$A$7:$E$1199,5,1),\"\")","v":""}]
[455,null,null,null,null,null,null,null,null,{"$f":"IFERROR(VLOOKUP(I459,'[2]AC TLB'!$A$7:$E$1199,5,1),\"\")","v":""}]
[456,null,null,null,null,null,null,null,null,{"$f":"IFERROR(VLOOKUP(I460,'[2]AC TLB'!$A$7:$E$1199,5,1),\"\")","v":""}]
[457,null,null,null,null,null,null,null,null,{"$f":"IFERROR(VLOOKUP(I461,'[2]AC TLB'!$A$7:$E$1199,5,1),\"\")","v":""}]
[458,null,null,null,null,null,null,null,null,{"$f":"IFERROR(VLOOKUP(I462,'[2]AC TLB'!$A$7:$E$1199,5,1),\"\")","v":""}]
[459,null,null,null,null,null,null,null,null,{"$f":"IFERROR(VLOOKUP(I463,'[2]AC TLB'!$A$7:$E$1199,5,1),\"\")","v":""}]
[460,null,null,null,null,null,null,null,null,{"$f":"IFERROR(VLOOKUP(I464,'[2]AC TLB'!$A$7:$E$1199,5,1),\"\")","v":""}]
[461,null,null,null,null,null,null,null,null,{"$f":"IFERROR(VLOOKUP(I465,'[2]AC TLB'!$A$7:$E$1199,5,1),\"\")","v":""}]
[462,null,null,null,null,null,null,null,null,{"$f":"IFERROR(VLOOKUP(I466,'[2]AC TLB'!$A$7:$E$1199,5,1),\"\")","v":""}]
[463,null,null,null,null,null,null,null,null,{"$f":"IFERROR(VLOOKUP(I467,'[2]AC TLB'!$A$7:$E$1199,5,1),\"\")","v":""}]
[464,null,null,null,null,null,null,null,null,{"$f":"IFERROR(VLOOKUP(I468,'[2]AC TLB'!$A$7:$E$1199,5,1),\"\")","v":""}]
[465,null,null,null,null,null,null,null,null,{"$f":"IFERROR(VLOOKUP(I469,'[2]AC TLB'!$A$7:$E$1199,5,1),\"\")","v":""}]
[466,null,null,null,null,null,null,null,null,{"$f":"IFERROR(VLOOKUP(I470,'[2]AC TLB'!$A$7:$E$1199,5,1),\"\")","v":""}]
[467,null,null,null,null,null,null,null,null,{"$f":"IFERROR(VLOOKUP(I471,'[2]AC TLB'!$A$7:$E$1199,5,1),\"\")","v":""}]
[468,null,null,null,null,null,null,null,null,{"$f":"IFERROR(VLOOKUP(I472,'[2]AC TLB'!$A$7:$E$1199,5,1),\"\")","v":""}]
[469,null,null,null,null,null,null,null,null,{"$f":"IFERROR(VLOOKUP(I473,'[2]AC TLB'!$A$7:$E$1199,5,1),\"\")","v":""}]
[470,null,null,null,null,null,null,null,null,{"$f":"IFERROR(VLOOKUP(I474,'[2]AC TLB'!$A$7:$E$1199,5,1),\"\")","v":""}]
[471,null,null,null,null,null,null,null,null,{"$f":"IFERROR(VLOOKUP(I475,'[2]AC TLB'!$A$7:$E$1199,5,1),\"\")","v":""}]
[472,null,null,null,null,null,null,null,null,{"$f":"IFERROR(VLOOKUP(I476,'[2]AC TLB'!$A$7:$E$1199,5,1),\"\")","v":""}]
[473,null,null,null,null,null,null,null,null,{"$f":"IFERROR(VLOOKUP(I477,'[2]AC TLB'!$A$7:$E$1199,5,1),\"\")","v":""}]
[474,null,null,null,null,null,null,null,null,{"$f":"IFERROR(VLOOKUP(I478,'[2]AC TLB'!$A$7:$E$1199,5,1),\"\")","v":""}]
[475,null,null,null,null,null,null,null,null,{"$f":"IFERROR(VLOOKUP(I479,'[2]AC TLB'!$A$7:$E$1199,5,1),\"\")","v":""}]
[476,null,null,null,null,null,null,null,null,{"$f":"IFERROR(VLOOKUP(I480,'[2]AC TLB'!$A$7:$E$1199,5,1),\"\")","v":""}]
[477,null,null,null,null,null,null,null,null,{"$f":"IFERROR(VLOOKUP(I481,'[2]AC TLB'!$A$7:$E$1199,5,1),\"\")","v":""}]
[478,null,null,null,null,null,null,null,null,{"$f":"IFERROR(VLOOKUP(I482,'[2]AC TLB'!$A$7:$E$1199,5,1),\"\")","v":""}]
[479,null,null,null,null,null,null,null,null,{"$f":"IFERROR(VLOOKUP(I483,'[2]AC TLB'!$A$7:$E$1199,5,1),\"\")","v":""}]
[480,null,null,null,null,null,null,null,null,{"$f":"IFERROR(VLOOKUP(I484,'[2]AC TLB'!$A$7:$E$1199,5,1),\"\")","v":""}]
[481,null,null,null,null,null,null,null,null,{"$f":"IFERROR(VLOOKUP(I485,'[2]AC TLB'!$A$7:$E$1199,5,1),\"\")","v":""}]
[482,null,null,null,null,null,null,null,null,{"$f":"IFERROR(VLOOKUP(I486,'[2]AC TLB'!$A$7:$E$1199,5,1),\"\")","v":""}]
[483,null,null,null,null,null,null,null,null,{"$f":"IFERROR(VLOOKUP(I487,'[2]AC TLB'!$A$7:$E$1199,5,1),\"\")","v":""}]
[484,null,null,null,null,null,null,null,null,{"$f":"IFERROR(VLOOKUP(I488,'[2]AC TLB'!$A$7:$E$1199,5,1),\"\")","v":""}]
[485,null,null,null,null,null,null,null,null,{"$f":"IFERROR(VLOOKUP(I489,'[2]AC TLB'!$A$7:$E$1199,5,1),\"\")","v":""}]
[486,null,null,null,null,null,null,null,null,{"$f":"IFERROR(VLOOKUP(I490,'[2]AC TLB'!$A$7:$E$1199,5,1),\"\")","v":""}]
[487,null,null,null,null,null,null,null,null,{"$f":"IFERROR(VLOOKUP(I491,'[2]AC TLB'!$A$7:$E$1199,5,1),\"\")","v":""}]
[488,null,null,null,null,null,null,null,null,{"$f":"IFERROR(VLOOKUP(I492,'[2]AC TLB'!$A$7:$E$1199,5,1),\"\")","v":""}]
[489,null,null,null,null,null,null,null,null,{"$f":"IFERROR(VLOOKUP(I493,'[2]AC TLB'!$A$7:$E$1199,5,1),\"\")","v":""}]
[490,null,null,null,null,null,null,null,null,{"$f":"IFERROR(VLOOKUP(I494,'[2]AC TLB'!$A$7:$E$1199,5,1),\"\")","v":""}]
[491,null,null,null,null,null,null,null,null,{"$f":"IFERROR(VLOOKUP(I495,'[2]AC TLB'!$A$7:$E$1199,5,1),\"\")","v":""}]
[492,null,null,null,null,null,null,null,null,{"$f":"IFERROR(VLOOKUP(I496,'[2]AC TLB'!$A$7:$E$1199,5,1),\"\")","v":""}]
[493,null,null,null,null,null,null,null,null,{"$f":"IFERROR(VLOOKUP(I497,'[2]AC TLB'!$A$7:$E$1199,5,1),\"\")","v":""}]
[494,null,null,null,null,null,null,null,null,{"$f":"IFERROR(VLOOKUP(I498,'[2]AC TLB'!$A$7:$E$1199,5,1),\"\")","v":""}]
[495,null,null,null,null,null,null,null,null,{"$f":"IFERROR(VLOOKUP(I499,'[2]AC TLB'!$A$7:$E$1199,5,1),\"\")","v":""}]
[496,null,null,null,null,null,null,null,null,{"$f":"IFERROR(VLOOKUP(I500,'[2]AC TLB'!$A$7:$E$1199,5,1),\"\")","v":""}]
[497,null,null,null,null,null,null,null,null,{"$f":"IFERROR(VLOOKUP(I501,'[2]AC TLB'!$A$7:$E$1199,5,1),\"\")","v":""}]
[498]
[499]
[500]
[501]
[502]
[503]
[504]
[505]
[506]
[507]
[508]
[509]
[510]
[511]
[512]
[513]
[514]
[515]
[516]
[517]
[518]
[519]
[520]
[521]
[522]
[523]
[524]
[525]
[526]
[527]
[528]
[529]
[530]
[531]
[532]
[533]
[534]
[535]
[536]
[537]
[538]
[539]
[540]
[541]
[542]
[543]
[544]
[545]
[546]
[547]
[548]
[549]
[550]
[551]
[552]
[553]
[554]
[555]
[556]
[557]
[558]
[559]
[560]
[561]
[562]
[563]
[564]
[565]
[566]
[567]
[568]
[569]
[570]
[571]
[572]
[573]
[574]
[575]
[576]
[577]
[578]
[579]
[580]
[581]
[582]
[583]
[584]
[585]
[586]
[587]
[588]
[589]
[590]
[591]
[592]
[593]
[594]
[595]
[596]
[597]
[598]
[599]
[600]
[601]
[602]
[603]
[604]
[605]
[606]
[607]
[608]
[609]
[610]
[611]
[612]
[613]
[614]
[615]
[616]
[617]
[618]
[619]
[620]
[621]
[622]
[623]
[624]
[625]
[626]
[627]
[628]
[629]
[630]
[631]
[632]
[633]
[634]
[635]
[636]
[637]
[638]
[639]
[640]
[641]
[642]
[643]
[644]
[645]
[646]
[647]
[648]
[649]
[650]
[651]
[652]
[653]
[654]
[655]
[656]
[657]
[658]
[659]
[660]
[661]
[662]
[663]
[664]
[665]
[666]
[667]
[668]
[669]
[670]
[671]
[672]
[673]
[674]
[675]
[676]
[677]
[678]
[679]
[680]
[681]
[682]
[683]
[684]
[685]
[686]
[687]
[688]
[689]
[690]
[691]
[692]
[693]
[694]
[695]
[696]
[697]
[698]
[699]
[700]
[701]
[702]
[703]
[704]
[705]
[706]
[707]
[708]
[709]
[710]
[711]
[712]