{"text_format":"1","workbook":"xlsx","n_sheets":2,"sheets":["Feuil1","Feuil2"],"not_rendered":{"charts":0,"images":1,"macros":1,"external_links":0,"defined_names":1,"comments":1,"pivot_tables":0},"unopened":[],"bounds":{"document_bytes":16777216,"sheet_cells":100000,"rows_first":2000,"rows_last":500,"rows_between":2000,"halvings":0,"cell_chars":16384,"cell_head_chars":4096},"cells_cut":0,"cells_raw":0,"read":"whole","date_system":"1900"}

{"sheet":"Feuil1","index":0,"n_rows":93,"n_cols":25,"rows_kept":93,"cut":false,"hidden":false,"merged":[[67,1,67,4],[68,1,68,4],[48,1,48,4],[29,1,29,4],[30,1,30,4],[19,1,20,4],[21,1,21,4],[22,1,22,4],[23,1,23,4],[24,1,24,4],[25,1,25,4],[26,1,26,4],[89,25,94,25],[94,4,94,18],[80,0,80,24],[85,1,86,3],[85,0,86,0],[87,0,87,3],[88,0,94,3],[87,19,87,24],[88,19,88,24],[89,19,94,24],[87,4,87,18],[93,4,93,18],[83,4,83,24],[84,4,84,24],[85,4,85,24],[86,4,86,24],[90,4,90,18],[91,4,91,18],[92,4,92,18],[83,1,83,3],[84,1,84,3],[89,4,89,18],[29,19,29,20],[30,5,30,6],[71,16,72,21],[71,10,74,12],[82,4,82,24],[29,5,29,6],[29,11,29,12],[29,13,29,14],[88,4,88,18],[30,19,30,20],[73,16,74,18],[73,19,74,21],[71,3,71,8],[67,16,67,18],[81,1,81,3],[82,1,82,3],[29,15,29,16],[29,17,29,18],[30,7,30,8],[30,9,30,10],[30,11,30,12],[81,4,81,24],[67,13,67,15],[29,7,29,8],[29,9,29,10],[29,21,29,22],[29,23,29,24],[30,13,30,14],[30,15,30,16],[30,17,30,18],[60,22,60,24],[59,22,59,24],[48,22,48,24],[30,21,30,22],[30,23,30,24],[48,19,48,21],[49,19,49,21],[50,19,50,21],[51,19,51,21],[52,19,52,21],[53,19,53,21],[57,19,57,21],[48,16,48,18],[49,16,49,18],[50,16,50,18],[51,16,51,18],[52,16,52,18],[53,16,53,18],[77,22,78,24],[75,10,76,12],[75,13,76,15],[75,16,76,18],[75,19,76,21],[75,22,76,24],[77,10,78,12],[77,13,78,15],[77,16,78,18],[77,19,78,21],[68,16,68,18],[66,13,66,15],[68,13,68,15],[67,9,67,12],[68,9,68,12],[71,22,74,24],[71,13,74,15],[66,19,66,21],[67,19,67,21],[68,19,68,21],[67,22,67,24],[68,22,68,24],[66,9,66,12],[77,0,78,2],[72,3,72,8],[73,3,73,8],[74,3,74,8],[75,3,75,8],[76,3,76,8],[77,3,77,8],[78,3,78,8],[49,22,49,24],[50,22,50,24],[51,22,51,24],[52,22,52,24],[53,22,53,24],[62,22,62,24],[63,16,63,18],[64,16,64,18],[54,22,54,24],[55,22,55,24],[56,22,56,24],[57,22,57,24],[58,22,58,24],[61,19,61,21],[60,16,60,18],[66,22,66,24],[64,19,64,21],[65,19,65,21],[61,22,61,24],[63,22,63,24],[64,22,64,24],[65,22,65,24],[66,16,66,18],[54,16,54,18],[55,16,55,18],[56,16,56,18],[57,16,57,18],[58,16,58,18],[59,16,59,18],[65,16,65,18],[61,16,61,18],[62,16,62,18],[54,19,54,21],[60,19,60,21],[59,19,59,21],[58,19,58,21],[62,19,62,21],[63,19,63,21],[55,19,55,21],[56,19,56,21],[63,13,63,15],[64,13,64,15],[65,9,65,12],[61,9,61,12],[62,9,62,12],[63,9,63,12],[64,9,64,12],[65,13,65,15],[61,13,61,15],[62,13,62,15],[60,13,60,15],[55,13,55,15],[56,13,56,15],[57,13,57,15],[58,13,58,15],[59,13,59,15],[48,7,48,8],[49,7,49,8],[50,7,50,8],[48,13,48,15],[49,13,49,15],[50,13,50,15],[51,13,51,15],[52,13,52,15],[53,13,53,15],[48,9,48,12],[49,9,49,12],[50,9,50,12],[51,9,51,12],[52,9,52,12],[53,9,53,12],[54,9,54,12],[55,9,55,12],[61,7,61,8],[62,7,62,8],[63,7,63,8],[64,7,64,8],[62,5,62,6],[56,9,56,12],[57,9,57,12],[58,9,58,12],[59,9,59,12],[60,9,60,12],[63,5,63,6],[64,5,64,6],[60,7,60,8],[57,7,57,8],[58,7,58,8],[59,7,59,8],[55,5,55,6],[56,5,56,6],[57,5,57,6],[58,5,58,6],[59,5,59,6],[61,5,61,6],[60,5,60,6],[55,1,55,4],[56,1,56,4],[57,1,57,4],[58,1,58,4],[59,1,59,4],[60,1,60,4],[61,1,61,4],[79,1,79,2],[70,0,70,24],[71,0,76,2],[65,5,65,6],[67,5,67,6],[68,5,68,6],[66,7,66,8],[67,7,67,8],[68,7,68,8],[65,7,65,8],[66,5,66,6],[62,1,62,4],[63,1,63,4],[64,1,64,4],[65,1,65,4],[66,1,66,4],[47,0,47,24],[51,7,51,8],[52,7,52,8],[53,7,53,8],[54,7,54,8],[55,7,55,8],[56,7,56,8],[48,5,48,6],[49,5,49,6],[41,17,41,20],[42,17,42,20],[39,13,39,16],[40,13,40,16],[41,13,41,16],[42,13,42,16],[50,5,50,6],[51,5,51,6],[52,5,52,6],[53,5,53,6],[54,5,54,6],[54,13,54,15],[49,1,49,4],[50,1,50,4],[51,1,51,4],[52,1,52,4],[53,1,53,4],[54,1,54,4],[34,17,34,24],[35,17,35,24],[36,17,36,24],[36,1,36,8],[33,1,33,8],[36,13,36,16],[37,13,37,16],[39,0,43,0],[39,9,39,12],[40,9,40,12],[41,9,41,12],[42,9,42,12],[39,1,39,4],[40,1,40,4],[41,1,41,4],[42,1,42,4],[43,1,43,4],[37,1,37,8],[39,21,39,24],[40,21,40,24],[41,21,41,24],[42,21,42,24],[39,17,39,20],[40,17,40,20],[37,17,37,24],[34,9,34,12],[35,9,35,12],[36,9,36,12],[37,9,37,12],[34,13,34,16],[35,13,35,16],[28,17,28,18],[25,11,25,12],[25,13,25,14],[27,21,27,22],[27,23,27,24],[26,17,26,18],[26,19,26,20],[27,9,27,10],[27,11,27,12],[27,13,27,14],[27,15,27,16],[32,0,32,24],[33,9,33,12],[33,13,33,16],[33,17,33,24],[34,1,34,8],[35,1,35,8],[27,17,27,18],[25,15,25,16],[28,15,28,16],[24,13,24,14],[24,15,24,16],[19,0,20,0],[16,12,16,15],[16,16,16,20],[18,0,18,24],[19,5,20,6],[20,19,20,20],[28,19,28,20],[28,21,28,22],[28,23,28,24],[19,7,19,14],[19,15,19,20],[19,23,20,24],[28,7,28,8],[28,9,28,10],[28,11,28,12],[28,13,28,14],[27,19,27,20],[27,1,27,4],[28,1,28,4],[26,11,26,12],[26,13,26,14],[26,15,26,16],[22,23,22,24],[23,19,23,20],[23,21,23,22],[23,23,23,24],[26,21,26,22],[26,23,26,24],[24,19,24,20],[25,21,25,22],[25,23,25,24],[24,21,24,22],[22,17,22,18],[22,19,22,20],[22,21,22,22],[23,11,23,12],[23,13,23,14],[23,15,23,16],[23,17,23,18],[22,11,22,12],[22,13,22,14],[24,17,24,18],[25,17,25,18],[22,15,22,16],[24,23,24,24],[25,19,25,20],[24,11,24,12],[21,23,21,24],[20,7,20,8],[20,9,20,10],[20,11,20,12],[20,13,20,14],[20,15,20,16],[20,17,20,18],[19,21,20,22],[21,9,21,10],[21,11,21,12],[21,13,21,14],[21,15,21,16],[21,17,21,18],[21,19,21,20],[21,21,21,22],[23,7,23,8],[23,9,23,10],[25,7,25,8],[25,9,25,10],[27,5,27,6],[28,5,28,6],[21,5,21,6],[22,5,22,6],[23,5,23,6],[24,5,24,6],[26,5,26,6],[27,7,27,8],[16,0,16,1],[16,5,16,7],[16,2,16,3],[16,8,16,9],[25,5,25,6],[22,7,22,8],[22,9,22,10],[21,7,21,8],[24,7,24,8],[24,9,24,10],[26,7,26,8],[26,9,26,10],[8,1,8,3],[4,19,4,20],[5,3,5,15],[0,0,0,24],[1,0,1,24],[2,0,2,6],[2,16,2,17],[8,4,8,6],[8,7,8,9],[8,10,8,12],[3,0,3,6],[2,18,2,24],[7,0,7,12],[8,19,8,21],[8,16,8,18],[8,22,8,24],[7,13,7,24],[8,13,8,15],[4,17,4,18]]}
["الجمهورية الجزائرية الديمقراطية الشعبية"]
["وزارة التربية الوطنية"]
["مديرية التربية لولاية الاغواط",null,null,null,null,null,null,null,null,null,null,null,null,null,null,null,"التاريخ",null,{"$f":"TODAY()","v":"2022-10-18"}]
["متوسطة: سماعيني معمر تاجرونة "]
[null,null,null,null,null,null,null,null,null,null,null,null,null,null,null,null,null,"الرقم"]
[null,null,null,"التقرير اليومي لمستشار التربية"]
[]
["التلاميذ المسجلون",null,null,null,null,null,null,null,null,null,null,null,null,"التلاميذ الغائبون"]
["نظام","داخلي",null,null,"نصف داخلي",null,null,"خارجي",null,null,"المجموع",null,null,"داخلي",null,null,"نصف داخلي",null,null,"خارجي",null,null,"المجموع"]
["الجنس","ذ","إ","مج","ذ","إ","مج","ذ","إ","مج","ذ","إ","مج","ذ","إ","مج","ذ","إ","مج","ذ","إ","مج","ذ","إ","مج"]
["4م",null,null,{"$f":"SUM(B11:C11)","v":0},21,25,{"$f":"SUM(E11:F11)","v":46},5,3,{"$f":"SUM(E11+F11+H11+I11)","v":54},{"$f":"B11+E11+H11","v":26},28,{"$f":"SUM(K11:L11)","v":54},null,null,{"$f":"SUM(N11:O11)","v":0},null,null,{"$f":"SUM(Q11:R11)","v":0},null,null,{"$f":"SUM(T11:U11)","v":0},{"$f":"N11+T11+Q11","v":0},0,{"$f":"SUM(W11:X11)","v":0}]
["3م",null,null,{"$f":"SUM(B12:C12)","v":0},23,37,{"$f":"SUM(E12:F12)","v":60},1,2,{"$f":"SUM(E12+F12+H12+I12)","v":63},24,39,{"$f":"SUM(K12:L12)","v":63},null,null,{"$f":"SUM(N12:O12)","v":0},null,null,{"$f":"SUM(Q12:R12)","v":0},null,null,{"$f":"SUM(T12:U12)","v":0},0,0,{"$f":"SUM(W12:X12)","v":0}]
["2م",null,null,{"$f":"SUM(B13:C13)","v":0},35,38,{"$f":"SUM(E13:F13)","v":73},7,1,{"$f":"SUM(E13+F13+H13+I13)","v":81},42,39,{"$f":"SUM(K13:L13)","v":81},null,null,{"$f":"SUM(N13:O13)","v":0},null,null,{"$f":"SUM(Q13:R13)","v":0},null,null,{"$f":"SUM(T13:U13)","v":0},0,0,{"$f":"SUM(W13:X13)","v":0}]
["1م",null,null,{"$f":"SUM(B14:C14)","v":0},29,42,{"$f":"SUM(E14:F14)","v":71},20,3,{"$f":"SUM(E14+F14+H14+I14)","v":94},49,45,{"$f":"SUM(K14:L14)","v":94},null,null,{"$f":"SUM(N14:O14)","v":0},null,null,{"$f":"SUM(Q14:R14)","v":0},null,null,{"$f":"SUM(T14:U14)","v":0},0,0,{"$f":"SUM(W14:X14)","v":0}]
["مج",{"$f":"SUM(B11:B14)","v":0},{"$f":"SUM(C11:C14)","v":0},{"$f":"SUM(B15:C15)","v":0},{"$f":"SUM(E11:E14)","v":108},{"$f":"SUM(F11:F14)","v":142},{"$f":"SUM(E15:F15)","v":250},{"$f":"SUM(H11:H14)","v":33},{"$f":"SUM(I11:I14)","v":9},{"$f":"SUM(H15:I15)","v":42},{"$f":"SUM(K11:K14)","v":141},{"$f":"SUM(L11:L14)","v":151},{"$f":"SUM(M11:M14)","v":292},{"$f":"SUM(N11:N14)","v":0},{"$f":"SUM(O11:O14)","v":0},{"$f":"SUM(N15:O15)","v":0},{"$f":"SUM(Q11:Q14)","v":0},{"$f":"SUM(R11:R14)","v":0},{"$f":"SUM(Q15:R15)","v":0},{"$f":"SUM(T11:T14)","v":0},{"$f":"SUM(U11:U14)","v":0},{"$f":"SUM(T15:U15)","v":0},{"$f":"SUM(W11:W14)","v":0},{"$f":"SUM(X11:X14)","v":0},{"$f":"SUM(Y11:Y14)","v":0}]
[]
[null,null,null,null,null,null,null,null,null,null,null,null,"نسبة الغياب",null,null,null,{"$f":"Y15*100/M15","v":0}]
[]
["غيابات و تأخرات الأساتذة"]
["الرقم","اللقب و الاسم ",null,null,null,"المادة",null,"الفترة الصباحية",null,null,null,null,null,null,null,"الفترة المسائية",null,null,null,null,null,"الساعات",null,"السبب"]
[null,null,null,null,null,null,null,"09*08",null,"10*09",null,"11*10",null,"12*11",null,"15*14",null,"16*15",null,"17*16"]
[{"$f":"IF(B22>0,1,\" \")","v":" "},null,null,null,null,{"$f":"IF(B22=\"\",\"\",VLOOKUP(B22,Feuil2!D4:F24,2,0))","v":""}]
[{"$f":"IF(B23>0,A22+1,\" \")","v":" "},null,null,null,null,{"$f":"IF(B23=\"\",\"\",VLOOKUP(B23,Feuil2!D5:F24,2,0))","v":""}]
[{"$f":"IF(B24>0,A23+1,\" \")","v":" "},null,null,null,null,{"$f":"IF(B24=\"\",\"\",VLOOKUP(B24,Feuil2!D6:F25,2,0))","v":""}]
[" ",null,null,null,null,{"$f":"IF(B25=\"\",\"\",VLOOKUP(B25,Feuil2!D7:F26,2,0))","v":""}]
[" ",null,null,null,null,{"$f":"IF(B26=\"\",\"\",VLOOKUP(B26,Feuil2!D8:F27,2,0))","v":""}]
[" ",null,null,null,null,{"$f":"IF(B27=\"\",\"\",VLOOKUP(B27,Feuil2!D9:F28,2,0))","v":""}]
[" ",null,null,null,null,{"$f":"IF(B28=\"\",\"\",VLOOKUP(B28,Feuil2!D10:F29,2,0))","v":""}]
[" ",null,null,null,null,{"$f":"IF(B29=\"\",\"\",VLOOKUP(B29,Feuil2!D11:F30,2,0))","v":""}]
[" ",null,null,null,null,{"$f":"IF(B30=\"\",\"\",VLOOKUP(B30,Feuil2!D12:F31,2,0))","v":""}]
[" ",null,null,null,null,{"$f":"IF(B31=\"\",\"\",VLOOKUP(B31,Feuil2!D13:F32,2,0))","v":""}]
[]
["غيابات وتأخرات المشرفين التربويين"]
["الرقم","اللقب و الاسم ",null,null,null,null,null,null,null,"التوقيت",null,null,null,"سبب الغياب",null,null,null,"الملاحظات"]
[{"$f":"IF(B35>0,1,\" \")","v":" "}]
[{"$f":"IF(B36>0,A35+1,\" \")","v":" "}]
[{"$f":"IF(B37>0,A36+1,\" \")","v":" "}]
[{"$f":"IF(B38>0,A37+1,\" \")","v":" "}]
[]
[null,null,null,null,null,"ذ","إ","مج",null,"مجموع الغيابات",null,null,null,"الحاضرون",null,null,null,"الغائبون",null,null,null,"نسبة الغياب"]
[null,"الدخول في اول اكتوبر",null,null,null,{"$f":"K15","v":141},{"$f":"L15","v":151},{"$f":"F41+G41","v":292},null,"الأساتذة",null,null,null,null,null,null,null,null,null,null,null,{"$f":"R41*100/N41","v":{"$error":"#DIV/0!"}}]
[null,"الخروج",null,null,null,null,null,{"$f":"F42+G42","v":0},null,"المساعدون",null,null,null,null,null,null,null,null,null,null,null,{"$f":"R42*100/N42","v":{"$error":"#DIV/0!"}}]
[null,"الدخول ",null,null,null,null,null,{"$f":"F43+G43","v":0},null,"التلاميذ",null,null,null,null,null,null,null,null,null,null,null,{"$f":"R43*100/N43","v":{"$error":"#DIV/0!"}}]
[null,"التعداد الحالي",null,null,null,{"$f":"K15","v":141},{"$f":"L15","v":151},{"$f":"M15","v":292}]
[]
[]
[]
["التلاميذ الغائبون"]
["الرقم","اللقب و الاسم ",null,null,null,"القسم",null,"الصفة",null,"تاريخ الغياب",null,null,null,"اشعار1",null,null,"اشعار2",null,null,"اعذار",null,null,"سبب الغياب"]
[{"$f":"IF(B50>0,1,\" \")","v":" "}]
[{"$f":"IF(B51>0,A50+1,\" \")","v":" "}]
[{"$f":"IF(B52>0,A51+1,\" \")","v":" "}]
[" "]
[" "]
[" "]
[" "]
[" "]
[" "]
[" "]
[" "]
[" "]
[" "]
[" "]
[" "]
[" "]
[" "]
[" "]
[" "]
[" "]
[]
["المطعم  ** الوجبة ** التاطير **  تعداد التلاميذ"]
["المرافق",null,null,"فتح الشهية",null,null,null,null,null,null,"المطعم",null,null,"الفطور",null,null,"الغذاء",null,null,null,null,null,"العشاء"]
[null,null,null,"…......................................"]
[null,null,null,"الوجبة الرئيسية",null,null,null,null,null,null,null,null,null,null,null,null,"داخلي",null,null,"ن داخلي"]
[null,null,null,"…......................................"]
[null,null,null,"التحلية",null,null,null,null,null,null,"الحضور"]
[null,null,null,"…......................................"]
["التاطير",null,null,null,null,null,null,null,null,null,"الغياب"]
[]
[]
["ملاحظات و اقتراحات مستشار التربية"]
[1,"النظافة",null,null,"….........................................................................................................................."]
[2,"الاتلافات",null,null,"….........................................................................................................................."]
[3,"الزيارات",null,null,"….........................................................................................................................."]
[4,"العيادة",null,null,"............... اسم المريض ................القسم ............المرافق ............    س الذهاب ............س الاياب"]
[5,"ملاحظات",null,null,"…........................................................................................................................"]
[null,null,null,null,"…........................................................................................................................"]
["مستشار التربية",null,null,null,"ملاحظات مدير المؤسسة",null,null,null,null,null,null,null,null,null,null,null,null,null,null,"المدير"]
["الامضاء",null,null,null,-1,null,null,null,null,null,null,null,null,null,null,null,null,null,null,"التاريخ:"]
[null,null,null,null,-2,null,null,null,null,null,null,null,null,null,null,null,null,null,null,"الامضاء"]
[null,null,null,null,-3]
[null,null,null,null,-4]
[null,null,null,null,-5]

{"sheet":"Feuil2","index":1,"n_rows":55,"n_cols":16,"rows_kept":55,"cut":false,"hidden":false,"merged":[]}
[]
[]
[]
[null,null,null,"العابد مباركة ","عربية ","1م1",null,null,null,null,null,null,"مبرر ",null,null,{"$f":"IF(Q4=\"\",\"\",SUBTOTAL(3,$Q$4:Q4))","v":""}]
[null,null,null,"سهلي بوعلام ","عربية ","1م2",null,null,null,"دهكل أحمد","خارجي",null,"غير مبرر",null,null,{"$f":"IF(Q5=\"\",\"\",SUBTOTAL(3,$Q$4:Q5))","v":""}]
[null,null,null,"بدراني خديجة ","عربية ","1م3",null,null,null,"طيفوري محمد","نصف داخلي",null,"حضور الولي",null,null,{"$f":"IF(Q6=\"\",\"\",SUBTOTAL(3,$Q$4:Q6))","v":""}]
[null,null,null,"تهامي أم كلثوم","عربية ","2م1",null,null,null,"قمقام دربالي ",null,null,"استدعاء الولي",null,null,{"$f":"IF(Q7=\"\",\"\",SUBTOTAL(3,$Q$4:Q7))","v":""}]
[null,null,null,"سماعيني بن يوسف","رياضيات ","2م2",null,null,null,"صديقي الطاهر",null,null,"الذهاب للعيادة ",null,null,{"$f":"IF(Q8=\"\",\"\",SUBTOTAL(3,$Q$4:Q8))","v":""}]
[null,null,null,"حساني عبد القادر ","رياضيات ","2م3",null,null,null,"أولاد حمادي عبد الرحمان",null,null,"وفاة قريب",null,null,{"$f":"IF(Q9=\"\",\"\",SUBTOTAL(3,$Q$4:Q9))","v":""}]
[null,null,null,"حساني فاطمة ","رياضيات ","3م1",null,null,null,"خيش فتيحة",null,null,"زفاف",null,null,{"$f":"IF(Q10=\"\",\"\",SUBTOTAL(3,$Q$4:Q10))","v":""}]
[null,null,null,"داودي ميلود","فيزياء","3م2",null,null,null,null,null,null,null,null,null,{"$f":"IF(Q11=\"\",\"\",SUBTOTAL(3,$Q$4:Q11))","v":""}]
[null,null,null,"طيبي عبد القادر ","فيزياء","4م1",null,null,null,null,null,null,null,null,null,{"$f":"IF(Q12=\"\",\"\",SUBTOTAL(3,$Q$4:Q12))","v":""}]
[null,null,null,"حطاب رشيدة ","علوم طبيعية ","4م2",null,null,null,null,null,null,null,null,null,{"$f":"IF(Q13=\"\",\"\",SUBTOTAL(3,$Q$4:Q13))","v":""}]
[null,null,null,"مجدوب طلحة ","علوم طبيعية ",null,null,null,null,null,null,null,null,null,null,{"$f":"IF(Q14=\"\",\"\",SUBTOTAL(3,$Q$4:Q14))","v":""}]
[null,null,null,"مغزي محمد ","لغة فرنسية",null,null,null,null,null,null,null,null,null,null,{"$f":"IF(Q15=\"\",\"\",SUBTOTAL(3,$Q$4:Q15))","v":""}]
[null,null,null,"كواهي يعقوب ","لغة فرنسية"]
[null,null,null,"امحمدي بوشوشة ","لغة فرنسية"]
[null,null,null,"زريفي إبراهيم","لغة إنجليزية "]
[null,null,null,"محمدي مريم ","لغة إنجليزية "]
[null,null,null,"مشارة محمد ","إجتماعيات "]
[null,null,null,"بدراني شريف","إجتماعيات "]
[null,null,null,"جليد الميلود","تربية فنية "]
[null,null,null,"قرمان البشير ","تربية بدنية "]
[null,null,null,"بوبكري رندة ","عربية "]
[]
[]
[null,null,null,"رقم","اللقب","الاسم","تاريخ الازدياد","مكان الازدياد","السنة","القسم","نظام التمدرس"]
[null,null,null,1,"مخطاري","بشرى","2008-03-10","الأغواط","رابعة",2,"نصف داخلي"]
[null,null,null,2,"مخلوفي","عبد الاله","2006-12-10","الاغواط","رابعة",2,"نصف داخلي"]
[null,null,null,3,"أمحمدي","محمد الأمين","2007-12-13","الأغواط","رابعة",2,"نصف داخلي"]
[null,null,null,4,"سهلي","أسماء","2008-06-29","تاجرونة","رابعة",2,"نصف داخلي"]
[null,null,null,5,"ذيب","صلاح الدين","2005-03-03","الأغواط","رابعة",2,"خارجي"]
[null,null,null,6,"بدراني","محمد ياسين","2006-09-04","الأغواط","رابعة",2,"نصف داخلي"]
[null,null,null,7,"شنافي","ام الخير","2008-05-22","تاجرونة","رابعة",2,"نصف داخلي"]
[null,null,null,8,"سماعيني","رحاب نور الياقين","2008-08-10","الاغواط","رابعة",2,"نصف داخلي"]
[null,null,null,9,"سعداوي","زكرياء","2005-12-26","الأغواط","رابعة",2,"نصف داخلي"]
[null,null,null,10,"سماعيني","علي","2005-12-02","الأغواط","رابعة",2,"نصف داخلي"]
[null,null,null,11,"سعداوي","شيماء","2007-12-19","الأغواط","رابعة",2,"نصف داخلي"]
[null,null,null,12,"سهلي","نوية","2007-10-31","الأغواط","رابعة",2,"نصف داخلي"]
[null,null,null,13,"سهلي","رقية","2008-02-06","الاغواط","رابعة",2,"نصف داخلي"]
[null,null,null,14,"بدراني","هديل فاطمة الزهراء","2008-01-05","الاغواط","رابعة",2,"نصف داخلي"]
[null,null,null,15,"سهلي","آمنة","2008-09-28","الاغواط","رابعة",2,"نصف داخلي"]
[null,null,null,16,"محمدي","ايمان نور اليقين","2008-04-30","الأغواط","رابعة",2,"نصف داخلي"]
[null,null,null,17,"حساني","انيسة","2008-03-02","الاغواط","رابعة",2,"نصف داخلي"]
[null,null,null,18,"مخطاري","فتيحة","2004-12-03","تاجرونة","رابعة",2,"خارجي"]
[null,null,null,19,"اولاد حمادي","نعيمة","2008-06-19","تاجرونة","رابعة",2,"نصف داخلي"]
[null,null,null,20,"ثعلابي","حبيب سيف الدين","2008-05-28","تاجرونة","رابعة",2,"نصف داخلي"]
[null,null,null,21,"سعداوي","طاهر","2008-05-18","تاجرونة","رابعة",2,"نصف داخلي"]
[null,null,null,22,"سماعيني","محمد الامين","2008-05-24","الاغواط","رابعة",2,"نصف داخلي"]
[null,null,null,23,"بعيط","لخضر","2008-04-12","الاغواط","رابعة",2,"نصف داخلي"]
[null,null,null,24,"شنافي","محمد","2008-03-15","الأغواط","رابعة",2,"نصف داخلي"]
[null,null,null,25,"امحمدي","كريم","2008-04-04","تاجرونة","رابعة",2,"نصف داخلي"]
[null,null,null,26,"بعيط","عزالدين","2007-01-30","الاغواط","رابعة",2,"نصف داخلي"]
[null,null,null,27,"نوي","محمد","2007-09-04","الأغواط","رابعة",2,"خارجي"]
[null,null,null,28,"حساني","كوثر","2005-02-04","تاجرونة","رابعة",2,"خارجي"]