{"text_format":"1","workbook":"xlsx","n_sheets":8,"sheets":["Sheet1","Customer","Data","Icvome","Attendees","Sales","Expens","Sheet4"],"not_rendered":{"charts":0,"images":9,"macros":1,"external_links":0,"defined_names":1,"comments":0,"pivot_tables":0},"unopened":[],"bounds":{"document_bytes":16777216,"sheet_cells":100000,"rows_first":2000,"rows_last":500,"rows_between":2000,"halvings":0,"cell_chars":16384,"cell_head_chars":4096},"cells_cut":0,"cells_raw":0,"read":"whole","date_system":"1900"}

{"sheet":"Sheet1","index":0,"n_rows":23,"n_cols":24,"rows_kept":23,"cut":false,"hidden":false,"merged":[[3,13,3,19],[0,8,2,17],[15,23,15,24]]}
[null,null,null,null,{"$f":"LOOKUP(9.99E+307,Table1[كود],Table1[كود])+1","v":105},null,"الكود الجديد",null,{"$f":"NOW()","v":"2022-10-24T23:02:34.360"}]
[]
[]
[null,null,null,null,104,null,"بحث بكود المشترك",null,null,null,null,null,null,"معلومات أضافية"]
[]
[null,null,null,null,"أسم المشترك",null,null,null,"نوع الاشتراك",null,null,null,null,"الوزن",null,null,null,"الحالة الصحية"]
[]
[null,null,null,null,"رقم التلفون",null,null,null,"قيمة الاشتراك",null,{"$f":"IF(K6=\"\",\"\",VLOOKUP(K6,Data!A:C,3,0))","v":""},null,null,"الطول",null,null,null,"الحالة الأجتماعية"]
[]
[null,null,null,null,"أسم المدرب",null,null,null,"بداية الاشتراك",null,null,null,null,"العمر",null,null,null,"النظام الغذائي"]
[]
[null,null,null,null,null,null,null,null,"المدفوع"]
[]
[]
[null,null,null,null,null,null,"بحث بكود المشترك",null,null,null,null,null,null,null,null,null,null,null,null,null,null,"بحث بكود المشترك",101]
[null,null,null,null,"أسم المشترك",null,{"$f":"IF(I15=\"\",\"\",VLOOKUP(I15,Customer!B:R,2,0))","v":""},null,null,null,null,null,null,null,null,null,null,null,null,"أسم المشترك",null,{"$f":"IF(X15=\"\",\"\",VLOOKUP(X15,Customer!B:R,2,0))","v":""},null,{"$f":"TODAY()","v":"2022-10-24"}]
[null,null,null,null,"أخر تاريخ للأشتراك",null,{"$f":"IF(I15=\"\",\"\",VLOOKUP(I15,Customer!B:R,16,0))","v":""},null,null,null,null,null,null,null,null,null,null,null,null,"المبلغ المتبقي",null,{"$f":"IF(X15=\"\",\"\",VLOOKUP(X15,Customer!B:T,19,0))","v":""}]
[null,null,null,null,"تاريخ الحضور",null,{"$f":"TODAY()","v":"2022-10-24"},null,null,null,null,null,null,null,null,null,null,null,null,"المدفوع"]
[]
[]
[null,null,null,null,null,null,{"$f":"TODAY()","v":"2022-10-24"},null,null,null,null,null,null,null,null,null,null,null,null,null,null,{"$f":"TODAY()","v":"2022-10-24"}]
[]
[null,null,null,null,"المبلغ",null,"البيان",null,null,null,null,null,null,null,null,null,null,null,null,"المبلغ",null,"البيان"]

{"sheet":"Customer","index":1,"n_rows":6,"n_cols":26,"rows_kept":6,"cut":false,"hidden":false,"merged":[]}
["م","كود","أسم المشترك","الموبيل","نوع الاشتراك","قيمة الاشتراك","بداية الاشتراك","المدفوع","أسم المدرب","الوزن","الطول","العمر","الخالة الصحية ","الحالة الاجتماعية","النظام الغذائي","مدة لاشتراك","أخر موعد للاشتراك","المبلغ المتبقي","الدفعات","الباقي ","الايام المتبقية","أيام الحضور","حالة الاشتراك",null,104,{"$f":"MATCH(Y1,B:B,0)","v":6}]
[{"$f":"IF(Table1[[#This Row],[أسم المشترك]]=0,\"\",ROW(A1)-ROW($A$1))","v":0},100,"ـ","ـ","ـ","ـ","ـ","ـ","ـ","ـ","ـ","ـ","ـ","ـ","ـ",{"$f":"IF(Table1[[#This Row],[نوع الاشتراك]]=0,0,VLOOKUP(Table1[[#This Row],[نوع الاشتراك]],Data!A:C,2,0))","v":{"$error":"#N/A"}},{"$f":"Table1[[#This Row],[بداية الاشتراك]]+Table1[[#This Row],[مدة لاشتراك]]","v":{"$error":"#VALUE!"}},{"$f":"Table1[[#This Row],[قيمة الاشتراك]]-Table1[[#This Row],[المدفوع]]","v":{"$error":"#VALUE!"}},{"$f":"SUMIF(Icvome!C:C,Table1[[#This Row],[أسم المشترك]],Icvome!E:E)","v":0},{"$f":"Table1[[#This Row],[المبلغ المتبقي]]-Table1[[#This Row],[الدفعات]]","v":{"$error":"#VALUE!"}},{"$f":"DAYS360(TODAY(),Table1[[#This Row],[أخر موعد للاشتراك]])","v":{"$error":"#VALUE!"}},{"$f":"COUNTIF(Attendees!B:B,Table1[[#This Row],[كود]])","v":0},{"$f":"IF(Table1[[#This Row],[الايام المتبقية]]>0,\"مستمر\",\"منتهي\")","v":{"$error":"#VALUE!"}}]
[{"$f":"IF(Table1[[#This Row],[أسم المشترك]]=0,\"\",ROW(A2)-ROW($A$1))","v":1},101,"احمد محمد عثمان ",542142895,"شهري",400,"2022-10-24",200,"محمود",90,170,30,"جيدة","متزوج","لا يوجد",{"$f":"IF(Table1[[#This Row],[نوع الاشتراك]]=0,0,VLOOKUP(Table1[[#This Row],[نوع الاشتراك]],Data!A:C,2,0))","v":30},{"$f":"Table1[[#This Row],[بداية الاشتراك]]+Table1[[#This Row],[مدة لاشتراك]]","v":"2022-11-23"},{"$f":"Table1[[#This Row],[قيمة الاشتراك]]-Table1[[#This Row],[المدفوع]]","v":200},{"$f":"SUMIF(Icvome!C:C,Table1[[#This Row],[أسم المشترك]],Icvome!E:E)","v":0},{"$f":"Table1[[#This Row],[المبلغ المتبقي]]-Table1[[#This Row],[الدفعات]]","v":200},{"$f":"DAYS360(TODAY(),Table1[[#This Row],[أخر موعد للاشتراك]])","v":29},{"$f":"COUNTIF(Attendees!B:B,Table1[[#This Row],[كود]])","v":0},{"$f":"IF(Table1[[#This Row],[الايام المتبقية]]>0,\"مستمر\",\"منتهي\")","v":"مستمر"}]
[{"$f":"IF(Table1[[#This Row],[أسم المشترك]]=0,\"\",ROW(A3)-ROW($A$1))","v":2},102,"حمزة احمد",1018156072,"شهري",400,"2022-10-24",200,"محمود",100,165,25,"جيدة","أعزب","لا يوجد",{"$f":"IF(Table1[[#This Row],[نوع الاشتراك]]=0,0,VLOOKUP(Table1[[#This Row],[نوع الاشتراك]],Data!A:C,2,0))","v":30},{"$f":"Table1[[#This Row],[بداية الاشتراك]]+Table1[[#This Row],[مدة لاشتراك]]","v":"2022-11-23"},{"$f":"Table1[[#This Row],[قيمة الاشتراك]]-Table1[[#This Row],[المدفوع]]","v":200},{"$f":"SUMIF(Icvome!C:C,Table1[[#This Row],[أسم المشترك]],Icvome!E:E)","v":200},{"$f":"Table1[[#This Row],[المبلغ المتبقي]]-Table1[[#This Row],[الدفعات]]","v":0},{"$f":"DAYS360(TODAY(),Table1[[#This Row],[أخر موعد للاشتراك]])","v":29},{"$f":"COUNTIF(Attendees!B:B,Table1[[#This Row],[كود]])","v":2},{"$f":"IF(Table1[[#This Row],[الايام المتبقية]]>0,\"مستمر\",\"منتهي\")","v":"مستمر"}]
[{"$f":"IF(Table1[[#This Row],[أسم المشترك]]=0,\"\",ROW(A4)-ROW($A$1))","v":3},103,"علي ",15015015,"يومي",20,"2022-10-21",20,"أحمد",100,null,null,null,null,null,{"$f":"IF(Table1[[#This Row],[نوع الاشتراك]]=0,0,VLOOKUP(Table1[[#This Row],[نوع الاشتراك]],Data!A:C,2,0))","v":1},{"$f":"Table1[[#This Row],[بداية الاشتراك]]+Table1[[#This Row],[مدة لاشتراك]]","v":"2022-10-22"},{"$f":"Table1[[#This Row],[قيمة الاشتراك]]-Table1[[#This Row],[المدفوع]]","v":0},{"$f":"SUMIF(Icvome!C:C,Table1[[#This Row],[أسم المشترك]],Icvome!E:E)","v":0},{"$f":"Table1[[#This Row],[المبلغ المتبقي]]-Table1[[#This Row],[الدفعات]]","v":0},{"$f":"DAYS360(TODAY(),Table1[[#This Row],[أخر موعد للاشتراك]])","v":-2},{"$f":"COUNTIF(Attendees!B:B,Table1[[#This Row],[كود]])","v":0},{"$f":"IF(Table1[[#This Row],[الايام المتبقية]]>0,\"مستمر\",\"منتهي\")","v":"منتهي"}]
[{"$f":"IF(Table1[[#This Row],[أسم المشترك]]=0,\"\",ROW(A5)-ROW($A$1))","v":4},104,"فياض",10000,"ربع سنوي",1000,"2022-10-24",300,"محسن",80,170,35,"جيدة","متزوج","لا يوجد",{"$f":"IF(Table1[[#This Row],[نوع الاشتراك]]=0,0,VLOOKUP(Table1[[#This Row],[نوع الاشتراك]],Data!A:C,2,0))","v":90},{"$f":"Table1[[#This Row],[بداية الاشتراك]]+Table1[[#This Row],[مدة لاشتراك]]","v":"2023-01-22"},{"$f":"Table1[[#This Row],[قيمة الاشتراك]]-Table1[[#This Row],[المدفوع]]","v":700},{"$f":"SUMIF(Icvome!C:C,Table1[[#This Row],[أسم المشترك]],Icvome!E:E)","v":200},{"$f":"Table1[[#This Row],[المبلغ المتبقي]]-Table1[[#This Row],[الدفعات]]","v":500},{"$f":"DAYS360(TODAY(),Table1[[#This Row],[أخر موعد للاشتراك]])","v":88},{"$f":"COUNTIF(Attendees!B:B,Table1[[#This Row],[كود]])","v":1},{"$f":"IF(Table1[[#This Row],[الايام المتبقية]]>0,\"مستمر\",\"منتهي\")","v":"مستمر"}]

{"sheet":"Data","index":2,"n_rows":17,"n_cols":11,"rows_kept":17,"cut":false,"hidden":false,"merged":[]}
[]
[]
[]
[]
[]
[]
[]
[]
[]
[]
["نوع الاشتراك","مدة الاشتراك","قيمة الاشتراك",null,"الحالة الصحية",null,"الحالة الاجتماعية",null,"أيام الحضور",null,"حالة الاشتراك"]
["يومي",1,20,null,"مريض",null,"أعزب",null,null,null,"مستمر "]
["أسبوعي",7,120,null,"مرض قلب",null,"متزوج",null,null,null,"منتهي"]
["شهري",30,400,null,"جيدة"]
["ربع سنوي",90,1000,null,"رياضي"]
["نص سنوي",180,1800]
["سنوي",365,3000]

{"sheet":"Icvome","index":3,"n_rows":6,"n_cols":5,"rows_kept":6,"cut":false,"hidden":false,"merged":[]}
["م","كود","أسم المشترك","تاريخ التحصيل","المبلغ المحصل"]
[{"$f":"IF(Table2[أسم المشترك]=0,\"\",ROW(A1)-ROW($A$1))","v":0},"ـ","ـ","ـ","ـ"]
[{"$f":"IF(Table2[أسم المشترك]=0,\"\",ROW(A2)-ROW($A$1))","v":1},102,"حمزة احمد","2022-10-24",100]
[{"$f":"IF(Table2[أسم المشترك]=0,\"\",ROW(A3)-ROW($A$1))","v":2},102,"حمزة احمد","2022-10-24",50]
[{"$f":"IF(Table2[أسم المشترك]=0,\"\",ROW(A4)-ROW($A$1))","v":3},102,"حمزة احمد","2022-10-25",50]
[{"$f":"IF(Table2[أسم المشترك]=0,\"\",ROW(A5)-ROW($A$1))","v":4},104,"فياض","2022-10-25",200]

{"sheet":"Attendees","index":4,"n_rows":5,"n_cols":5,"rows_kept":5,"cut":false,"hidden":false,"merged":[]}
["م","كود","أسم المشترك","تاريخ الحضور","أخر موعد للأشتراك"]
[{"$f":"IF(Table3[أسم المشترك]=0,\"\",ROW(A1)-ROW($A$1))","v":""}]
[{"$f":"IF(Table3[أسم المشترك]=0,\"\",ROW(A2)-ROW($A$1))","v":1},102,"حمزة احمد","2022-11-23","2022-10-24"]
[{"$f":"IF(Table3[أسم المشترك]=0,\"\",ROW(A3)-ROW($A$1))","v":2},102,"حمزة احمد","2022-11-23","2022-10-25"]
[{"$f":"IF(Table3[أسم المشترك]=0,\"\",ROW(A4)-ROW($A$1))","v":3},104,"فياض","2023-01-22","2022-10-24"]

{"sheet":"Sales","index":5,"n_rows":4,"n_cols":4,"rows_kept":4,"cut":false,"hidden":false,"merged":[]}
["م","التاريخ","البيان","المبلغ"]
[{"$f":"IF(Table4[[#Headers],[م]]=0,\"\",ROW(A1)-ROW($A$1))","v":0},"ـ","ـ","ـ"]
[{"$f":"IF(Table4[[#Headers],[م]]=0,\"\",ROW(A2)-ROW($A$1))","v":1},"2022-10-24","بروتين",1500]
[{"$f":"IF(Table4[[#Headers],[م]]=0,\"\",ROW(A3)-ROW($A$1))","v":2},"2022-10-24","مكمل غذائي",200]

{"sheet":"Expens","index":6,"n_rows":4,"n_cols":4,"rows_kept":4,"cut":false,"hidden":false,"merged":[]}
["م","التاريخ","البيان","المبلغ"]
[{"$f":"IF(Table46[[#Headers],[م]]=0,\"\",ROW(A1)-ROW($A$1))","v":0},"ـ","ـ","ـ"]
[{"$f":"IF(Table46[[#Headers],[م]]=0,\"\",ROW(A2)-ROW($A$1))","v":1},"2022-10-24","معلبات",100]
[{"$f":"IF(Table46[[#Headers],[م]]=0,\"\",ROW(A3)-ROW($A$1))","v":2},"2022-10-24","اغراض",250]

{"sheet":"Sheet4","index":7,"n_rows":366,"n_cols":10,"rows_kept":366,"cut":false,"hidden":false,"merged":[]}
["م","التاريخ","ايرادات","مصروفات","الرصيد",null,null,null,"تاريخ أفتتاح","2022-10-23"]
[1,{"$f":"IF(J1=\"\",\"\",J1+1)","v":"2022-10-24"},{"$f":"SUMIF(Icvome!D:D,B2,Icvome!E:E)+SUMIF(Sales!B:B,B2,Sales!D:D)","v":1850},{"$f":"SUMIF(Expens!B:B,B2,Expens!D:D)","v":350},{"$f":"$J$2+Table7[[#This Row],[ايرادات]]-Table7[[#This Row],[مصروفات]]","v":2500},null,null,null,"رصيد الافتتاح",1000]
[2,{"$f":"IF(B2=\"\",\"\",B2+1)","v":"2022-10-25"},{"$f":"SUMIF(Icvome!D:D,B3,Icvome!E:E)+SUMIF(Sales!B:B,B3,Sales!D:D)","v":250},{"$f":"SUMIF(Expens!B:B,B3,Expens!D:D)","v":0},{"$f":"E2+Table7[[#This Row],[ايرادات]]-Table7[[#This Row],[مصروفات]]","v":2750}]
[3,{"$f":"IF(B3=\"\",\"\",B3+1)","v":"2022-10-26"},{"$f":"SUMIF(Icvome!D:D,B4,Icvome!E:E)+SUMIF(Sales!B:B,B4,Sales!D:D)","v":0},{"$f":"SUMIF(Expens!B:B,B4,Expens!D:D)","v":0},{"$f":"E3+Table7[[#This Row],[ايرادات]]-Table7[[#This Row],[مصروفات]]","v":2750}]
[4,"2022-10-27",{"$f":"SUMIF(Icvome!D:D,B5,Icvome!E:E)+SUMIF(Sales!B:B,B5,Sales!D:D)","v":0},{"$f":"SUMIF(Expens!B:B,B5,Expens!D:D)","v":0},{"$f":"E4+Table7[[#This Row],[ايرادات]]-Table7[[#This Row],[مصروفات]]","v":2750}]
[5,"2022-10-28",{"$f":"SUMIF(Icvome!D:D,B6,Icvome!E:E)+SUMIF(Sales!B:B,B6,Sales!D:D)","v":0},{"$f":"SUMIF(Expens!B:B,B6,Expens!D:D)","v":0},{"$f":"E5+Table7[[#This Row],[ايرادات]]-Table7[[#This Row],[مصروفات]]","v":2750},null,null,null,"صافي الربح",{"$f":"LOOKUP(5555555,E:E,E:E)","v":2750}]
[6,"2022-10-29",{"$f":"SUMIF(Icvome!D:D,B7,Icvome!E:E)+SUMIF(Sales!B:B,B7,Sales!D:D)","v":0},{"$f":"SUMIF(Expens!B:B,B7,Expens!D:D)","v":0},{"$f":"E6+Table7[[#This Row],[ايرادات]]-Table7[[#This Row],[مصروفات]]","v":2750}]
[7,"2022-10-30",{"$f":"SUMIF(Icvome!D:D,B8,Icvome!E:E)+SUMIF(Sales!B:B,B8,Sales!D:D)","v":0},{"$f":"SUMIF(Expens!B:B,B8,Expens!D:D)","v":0},{"$f":"E7+Table7[[#This Row],[ايرادات]]-Table7[[#This Row],[مصروفات]]","v":2750}]
[8,"2022-10-31",{"$f":"SUMIF(Icvome!D:D,B9,Icvome!E:E)+SUMIF(Sales!B:B,B9,Sales!D:D)","v":0},{"$f":"SUMIF(Expens!B:B,B9,Expens!D:D)","v":0},{"$f":"E8+Table7[[#This Row],[ايرادات]]-Table7[[#This Row],[مصروفات]]","v":2750}]
[9,"2022-11-01",{"$f":"SUMIF(Icvome!D:D,B10,Icvome!E:E)+SUMIF(Sales!B:B,B10,Sales!D:D)","v":0},{"$f":"SUMIF(Expens!B:B,B10,Expens!D:D)","v":0},{"$f":"E9+Table7[[#This Row],[ايرادات]]-Table7[[#This Row],[مصروفات]]","v":2750}]
[10,"2022-11-02",{"$f":"SUMIF(Icvome!D:D,B11,Icvome!E:E)+SUMIF(Sales!B:B,B11,Sales!D:D)","v":0},{"$f":"SUMIF(Expens!B:B,B11,Expens!D:D)","v":0},{"$f":"E10+Table7[[#This Row],[ايرادات]]-Table7[[#This Row],[مصروفات]]","v":2750}]
[11,"2022-11-03",{"$f":"SUMIF(Icvome!D:D,B12,Icvome!E:E)+SUMIF(Sales!B:B,B12,Sales!D:D)","v":0},{"$f":"SUMIF(Expens!B:B,B12,Expens!D:D)","v":0},{"$f":"E11+Table7[[#This Row],[ايرادات]]-Table7[[#This Row],[مصروفات]]","v":2750}]
[12,"2022-11-04",{"$f":"SUMIF(Icvome!D:D,B13,Icvome!E:E)+SUMIF(Sales!B:B,B13,Sales!D:D)","v":0},{"$f":"SUMIF(Expens!B:B,B13,Expens!D:D)","v":0},{"$f":"E12+Table7[[#This Row],[ايرادات]]-Table7[[#This Row],[مصروفات]]","v":2750}]
[13,"2022-11-05",{"$f":"SUMIF(Icvome!D:D,B14,Icvome!E:E)+SUMIF(Sales!B:B,B14,Sales!D:D)","v":0},{"$f":"SUMIF(Expens!B:B,B14,Expens!D:D)","v":0},{"$f":"E13+Table7[[#This Row],[ايرادات]]-Table7[[#This Row],[مصروفات]]","v":2750}]
[14,"2022-11-06",{"$f":"SUMIF(Icvome!D:D,B15,Icvome!E:E)+SUMIF(Sales!B:B,B15,Sales!D:D)","v":0},{"$f":"SUMIF(Expens!B:B,B15,Expens!D:D)","v":0},{"$f":"E14+Table7[[#This Row],[ايرادات]]-Table7[[#This Row],[مصروفات]]","v":2750}]
[15,"2022-11-07",{"$f":"SUMIF(Icvome!D:D,B16,Icvome!E:E)+SUMIF(Sales!B:B,B16,Sales!D:D)","v":0},{"$f":"SUMIF(Expens!B:B,B16,Expens!D:D)","v":0},{"$f":"E15+Table7[[#This Row],[ايرادات]]-Table7[[#This Row],[مصروفات]]","v":2750}]
[16,"2022-11-08",{"$f":"SUMIF(Icvome!D:D,B17,Icvome!E:E)+SUMIF(Sales!B:B,B17,Sales!D:D)","v":0},{"$f":"SUMIF(Expens!B:B,B17,Expens!D:D)","v":0},{"$f":"E16+Table7[[#This Row],[ايرادات]]-Table7[[#This Row],[مصروفات]]","v":2750}]
[17,"2022-11-09",{"$f":"SUMIF(Icvome!D:D,B18,Icvome!E:E)+SUMIF(Sales!B:B,B18,Sales!D:D)","v":0},{"$f":"SUMIF(Expens!B:B,B18,Expens!D:D)","v":0},{"$f":"E17+Table7[[#This Row],[ايرادات]]-Table7[[#This Row],[مصروفات]]","v":2750}]
[18,"2022-11-10",{"$f":"SUMIF(Icvome!D:D,B19,Icvome!E:E)+SUMIF(Sales!B:B,B19,Sales!D:D)","v":0},{"$f":"SUMIF(Expens!B:B,B19,Expens!D:D)","v":0},{"$f":"E18+Table7[[#This Row],[ايرادات]]-Table7[[#This Row],[مصروفات]]","v":2750}]
[19,"2022-11-11",{"$f":"SUMIF(Icvome!D:D,B20,Icvome!E:E)+SUMIF(Sales!B:B,B20,Sales!D:D)","v":0},{"$f":"SUMIF(Expens!B:B,B20,Expens!D:D)","v":0},{"$f":"E19+Table7[[#This Row],[ايرادات]]-Table7[[#This Row],[مصروفات]]","v":2750}]
[20,"2022-11-12",{"$f":"SUMIF(Icvome!D:D,B21,Icvome!E:E)+SUMIF(Sales!B:B,B21,Sales!D:D)","v":0},{"$f":"SUMIF(Expens!B:B,B21,Expens!D:D)","v":0},{"$f":"E20+Table7[[#This Row],[ايرادات]]-Table7[[#This Row],[مصروفات]]","v":2750}]
[21,"2022-11-13",{"$f":"SUMIF(Icvome!D:D,B22,Icvome!E:E)+SUMIF(Sales!B:B,B22,Sales!D:D)","v":0},{"$f":"SUMIF(Expens!B:B,B22,Expens!D:D)","v":0},{"$f":"E21+Table7[[#This Row],[ايرادات]]-Table7[[#This Row],[مصروفات]]","v":2750}]
[22,"2022-11-14",{"$f":"SUMIF(Icvome!D:D,B23,Icvome!E:E)+SUMIF(Sales!B:B,B23,Sales!D:D)","v":0},{"$f":"SUMIF(Expens!B:B,B23,Expens!D:D)","v":0},{"$f":"E22+Table7[[#This Row],[ايرادات]]-Table7[[#This Row],[مصروفات]]","v":2750}]
[23,"2022-11-15",{"$f":"SUMIF(Icvome!D:D,B24,Icvome!E:E)+SUMIF(Sales!B:B,B24,Sales!D:D)","v":0},{"$f":"SUMIF(Expens!B:B,B24,Expens!D:D)","v":0},{"$f":"E23+Table7[[#This Row],[ايرادات]]-Table7[[#This Row],[مصروفات]]","v":2750}]
[24,"2022-11-16",{"$f":"SUMIF(Icvome!D:D,B25,Icvome!E:E)+SUMIF(Sales!B:B,B25,Sales!D:D)","v":0},{"$f":"SUMIF(Expens!B:B,B25,Expens!D:D)","v":0},{"$f":"E24+Table7[[#This Row],[ايرادات]]-Table7[[#This Row],[مصروفات]]","v":2750}]
[25,"2022-11-17",{"$f":"SUMIF(Icvome!D:D,B26,Icvome!E:E)+SUMIF(Sales!B:B,B26,Sales!D:D)","v":0},{"$f":"SUMIF(Expens!B:B,B26,Expens!D:D)","v":0},{"$f":"E25+Table7[[#This Row],[ايرادات]]-Table7[[#This Row],[مصروفات]]","v":2750}]
[26,"2022-11-18",{"$f":"SUMIF(Icvome!D:D,B27,Icvome!E:E)+SUMIF(Sales!B:B,B27,Sales!D:D)","v":0},{"$f":"SUMIF(Expens!B:B,B27,Expens!D:D)","v":0},{"$f":"E26+Table7[[#This Row],[ايرادات]]-Table7[[#This Row],[مصروفات]]","v":2750}]
[27,"2022-11-19",{"$f":"SUMIF(Icvome!D:D,B28,Icvome!E:E)+SUMIF(Sales!B:B,B28,Sales!D:D)","v":0},{"$f":"SUMIF(Expens!B:B,B28,Expens!D:D)","v":0},{"$f":"E27+Table7[[#This Row],[ايرادات]]-Table7[[#This Row],[مصروفات]]","v":2750}]
[28,"2022-11-20",{"$f":"SUMIF(Icvome!D:D,B29,Icvome!E:E)+SUMIF(Sales!B:B,B29,Sales!D:D)","v":0},{"$f":"SUMIF(Expens!B:B,B29,Expens!D:D)","v":0},{"$f":"E28+Table7[[#This Row],[ايرادات]]-Table7[[#This Row],[مصروفات]]","v":2750}]
[29,"2022-11-21",{"$f":"SUMIF(Icvome!D:D,B30,Icvome!E:E)+SUMIF(Sales!B:B,B30,Sales!D:D)","v":0},{"$f":"SUMIF(Expens!B:B,B30,Expens!D:D)","v":0},{"$f":"E29+Table7[[#This Row],[ايرادات]]-Table7[[#This Row],[مصروفات]]","v":2750}]
[30,"2022-11-22",{"$f":"SUMIF(Icvome!D:D,B31,Icvome!E:E)+SUMIF(Sales!B:B,B31,Sales!D:D)","v":0},{"$f":"SUMIF(Expens!B:B,B31,Expens!D:D)","v":0},{"$f":"E30+Table7[[#This Row],[ايرادات]]-Table7[[#This Row],[مصروفات]]","v":2750}]
[31,"2022-11-23",{"$f":"SUMIF(Icvome!D:D,B32,Icvome!E:E)+SUMIF(Sales!B:B,B32,Sales!D:D)","v":0},{"$f":"SUMIF(Expens!B:B,B32,Expens!D:D)","v":0},{"$f":"E31+Table7[[#This Row],[ايرادات]]-Table7[[#This Row],[مصروفات]]","v":2750}]
[32,"2022-11-24",{"$f":"SUMIF(Icvome!D:D,B33,Icvome!E:E)+SUMIF(Sales!B:B,B33,Sales!D:D)","v":0},{"$f":"SUMIF(Expens!B:B,B33,Expens!D:D)","v":0},{"$f":"E32+Table7[[#This Row],[ايرادات]]-Table7[[#This Row],[مصروفات]]","v":2750}]
[33,"2022-11-25",{"$f":"SUMIF(Icvome!D:D,B34,Icvome!E:E)+SUMIF(Sales!B:B,B34,Sales!D:D)","v":0},{"$f":"SUMIF(Expens!B:B,B34,Expens!D:D)","v":0},{"$f":"E33+Table7[[#This Row],[ايرادات]]-Table7[[#This Row],[مصروفات]]","v":2750}]
[34,"2022-11-26",{"$f":"SUMIF(Icvome!D:D,B35,Icvome!E:E)+SUMIF(Sales!B:B,B35,Sales!D:D)","v":0},{"$f":"SUMIF(Expens!B:B,B35,Expens!D:D)","v":0},{"$f":"E34+Table7[[#This Row],[ايرادات]]-Table7[[#This Row],[مصروفات]]","v":2750}]
[35,"2022-11-27",{"$f":"SUMIF(Icvome!D:D,B36,Icvome!E:E)+SUMIF(Sales!B:B,B36,Sales!D:D)","v":0},{"$f":"SUMIF(Expens!B:B,B36,Expens!D:D)","v":0},{"$f":"E35+Table7[[#This Row],[ايرادات]]-Table7[[#This Row],[مصروفات]]","v":2750}]
[36,"2022-11-28",{"$f":"SUMIF(Icvome!D:D,B37,Icvome!E:E)+SUMIF(Sales!B:B,B37,Sales!D:D)","v":0},{"$f":"SUMIF(Expens!B:B,B37,Expens!D:D)","v":0},{"$f":"E36+Table7[[#This Row],[ايرادات]]-Table7[[#This Row],[مصروفات]]","v":2750}]
[37,"2022-11-29",{"$f":"SUMIF(Icvome!D:D,B38,Icvome!E:E)+SUMIF(Sales!B:B,B38,Sales!D:D)","v":0},{"$f":"SUMIF(Expens!B:B,B38,Expens!D:D)","v":0},{"$f":"E37+Table7[[#This Row],[ايرادات]]-Table7[[#This Row],[مصروفات]]","v":2750}]
[38,"2022-11-30",{"$f":"SUMIF(Icvome!D:D,B39,Icvome!E:E)+SUMIF(Sales!B:B,B39,Sales!D:D)","v":0},{"$f":"SUMIF(Expens!B:B,B39,Expens!D:D)","v":0},{"$f":"E38+Table7[[#This Row],[ايرادات]]-Table7[[#This Row],[مصروفات]]","v":2750}]
[39,"2022-12-01",{"$f":"SUMIF(Icvome!D:D,B40,Icvome!E:E)+SUMIF(Sales!B:B,B40,Sales!D:D)","v":0},{"$f":"SUMIF(Expens!B:B,B40,Expens!D:D)","v":0},{"$f":"E39+Table7[[#This Row],[ايرادات]]-Table7[[#This Row],[مصروفات]]","v":2750}]
[40,"2022-12-02",{"$f":"SUMIF(Icvome!D:D,B41,Icvome!E:E)+SUMIF(Sales!B:B,B41,Sales!D:D)","v":0},{"$f":"SUMIF(Expens!B:B,B41,Expens!D:D)","v":0},{"$f":"E40+Table7[[#This Row],[ايرادات]]-Table7[[#This Row],[مصروفات]]","v":2750}]
[41,"2022-12-03",{"$f":"SUMIF(Icvome!D:D,B42,Icvome!E:E)+SUMIF(Sales!B:B,B42,Sales!D:D)","v":0},{"$f":"SUMIF(Expens!B:B,B42,Expens!D:D)","v":0},{"$f":"E41+Table7[[#This Row],[ايرادات]]-Table7[[#This Row],[مصروفات]]","v":2750}]
[42,"2022-12-04",{"$f":"SUMIF(Icvome!D:D,B43,Icvome!E:E)+SUMIF(Sales!B:B,B43,Sales!D:D)","v":0},{"$f":"SUMIF(Expens!B:B,B43,Expens!D:D)","v":0},{"$f":"E42+Table7[[#This Row],[ايرادات]]-Table7[[#This Row],[مصروفات]]","v":2750}]
[43,"2022-12-05",{"$f":"SUMIF(Icvome!D:D,B44,Icvome!E:E)+SUMIF(Sales!B:B,B44,Sales!D:D)","v":0},{"$f":"SUMIF(Expens!B:B,B44,Expens!D:D)","v":0},{"$f":"E43+Table7[[#This Row],[ايرادات]]-Table7[[#This Row],[مصروفات]]","v":2750}]
[44,"2022-12-06",{"$f":"SUMIF(Icvome!D:D,B45,Icvome!E:E)+SUMIF(Sales!B:B,B45,Sales!D:D)","v":0},{"$f":"SUMIF(Expens!B:B,B45,Expens!D:D)","v":0},{"$f":"E44+Table7[[#This Row],[ايرادات]]-Table7[[#This Row],[مصروفات]]","v":2750}]
[45,"2022-12-07",{"$f":"SUMIF(Icvome!D:D,B46,Icvome!E:E)+SUMIF(Sales!B:B,B46,Sales!D:D)","v":0},{"$f":"SUMIF(Expens!B:B,B46,Expens!D:D)","v":0},{"$f":"E45+Table7[[#This Row],[ايرادات]]-Table7[[#This Row],[مصروفات]]","v":2750}]
[46,"2022-12-08",{"$f":"SUMIF(Icvome!D:D,B47,Icvome!E:E)+SUMIF(Sales!B:B,B47,Sales!D:D)","v":0},{"$f":"SUMIF(Expens!B:B,B47,Expens!D:D)","v":0},{"$f":"E46+Table7[[#This Row],[ايرادات]]-Table7[[#This Row],[مصروفات]]","v":2750}]
[47,"2022-12-09",{"$f":"SUMIF(Icvome!D:D,B48,Icvome!E:E)+SUMIF(Sales!B:B,B48,Sales!D:D)","v":0},{"$f":"SUMIF(Expens!B:B,B48,Expens!D:D)","v":0},{"$f":"E47+Table7[[#This Row],[ايرادات]]-Table7[[#This Row],[مصروفات]]","v":2750}]
[48,"2022-12-10",{"$f":"SUMIF(Icvome!D:D,B49,Icvome!E:E)+SUMIF(Sales!B:B,B49,Sales!D:D)","v":0},{"$f":"SUMIF(Expens!B:B,B49,Expens!D:D)","v":0},{"$f":"E48+Table7[[#This Row],[ايرادات]]-Table7[[#This Row],[مصروفات]]","v":2750}]
[49,"2022-12-11",{"$f":"SUMIF(Icvome!D:D,B50,Icvome!E:E)+SUMIF(Sales!B:B,B50,Sales!D:D)","v":0},{"$f":"SUMIF(Expens!B:B,B50,Expens!D:D)","v":0},{"$f":"E49+Table7[[#This Row],[ايرادات]]-Table7[[#This Row],[مصروفات]]","v":2750}]
[50,"2022-12-12",{"$f":"SUMIF(Icvome!D:D,B51,Icvome!E:E)+SUMIF(Sales!B:B,B51,Sales!D:D)","v":0},{"$f":"SUMIF(Expens!B:B,B51,Expens!D:D)","v":0},{"$f":"E50+Table7[[#This Row],[ايرادات]]-Table7[[#This Row],[مصروفات]]","v":2750}]
[51,"2022-12-13",{"$f":"SUMIF(Icvome!D:D,B52,Icvome!E:E)+SUMIF(Sales!B:B,B52,Sales!D:D)","v":0},{"$f":"SUMIF(Expens!B:B,B52,Expens!D:D)","v":0},{"$f":"E51+Table7[[#This Row],[ايرادات]]-Table7[[#This Row],[مصروفات]]","v":2750}]
[52,"2022-12-14",{"$f":"SUMIF(Icvome!D:D,B53,Icvome!E:E)+SUMIF(Sales!B:B,B53,Sales!D:D)","v":0},{"$f":"SUMIF(Expens!B:B,B53,Expens!D:D)","v":0},{"$f":"E52+Table7[[#This Row],[ايرادات]]-Table7[[#This Row],[مصروفات]]","v":2750}]
[53,"2022-12-15",{"$f":"SUMIF(Icvome!D:D,B54,Icvome!E:E)+SUMIF(Sales!B:B,B54,Sales!D:D)","v":0},{"$f":"SUMIF(Expens!B:B,B54,Expens!D:D)","v":0},{"$f":"E53+Table7[[#This Row],[ايرادات]]-Table7[[#This Row],[مصروفات]]","v":2750}]
[54,"2022-12-16",{"$f":"SUMIF(Icvome!D:D,B55,Icvome!E:E)+SUMIF(Sales!B:B,B55,Sales!D:D)","v":0},{"$f":"SUMIF(Expens!B:B,B55,Expens!D:D)","v":0},{"$f":"E54+Table7[[#This Row],[ايرادات]]-Table7[[#This Row],[مصروفات]]","v":2750}]
[55,"2022-12-17",{"$f":"SUMIF(Icvome!D:D,B56,Icvome!E:E)+SUMIF(Sales!B:B,B56,Sales!D:D)","v":0},{"$f":"SUMIF(Expens!B:B,B56,Expens!D:D)","v":0},{"$f":"E55+Table7[[#This Row],[ايرادات]]-Table7[[#This Row],[مصروفات]]","v":2750}]
[56,"2022-12-18",{"$f":"SUMIF(Icvome!D:D,B57,Icvome!E:E)+SUMIF(Sales!B:B,B57,Sales!D:D)","v":0},{"$f":"SUMIF(Expens!B:B,B57,Expens!D:D)","v":0},{"$f":"E56+Table7[[#This Row],[ايرادات]]-Table7[[#This Row],[مصروفات]]","v":2750}]
[57,"2022-12-19",{"$f":"SUMIF(Icvome!D:D,B58,Icvome!E:E)+SUMIF(Sales!B:B,B58,Sales!D:D)","v":0},{"$f":"SUMIF(Expens!B:B,B58,Expens!D:D)","v":0},{"$f":"E57+Table7[[#This Row],[ايرادات]]-Table7[[#This Row],[مصروفات]]","v":2750}]
[58,"2022-12-20",{"$f":"SUMIF(Icvome!D:D,B59,Icvome!E:E)+SUMIF(Sales!B:B,B59,Sales!D:D)","v":0},{"$f":"SUMIF(Expens!B:B,B59,Expens!D:D)","v":0},{"$f":"E58+Table7[[#This Row],[ايرادات]]-Table7[[#This Row],[مصروفات]]","v":2750}]
[59,"2022-12-21",{"$f":"SUMIF(Icvome!D:D,B60,Icvome!E:E)+SUMIF(Sales!B:B,B60,Sales!D:D)","v":0},{"$f":"SUMIF(Expens!B:B,B60,Expens!D:D)","v":0},{"$f":"E59+Table7[[#This Row],[ايرادات]]-Table7[[#This Row],[مصروفات]]","v":2750}]
{"$rows_left_out":306}