{"text_format":"1","workbook":"xlsx","n_sheets":3,"sheets":["handover.Form","DRIVER","All_Data"],"not_rendered":{"charts":0,"images":9,"macros":1,"external_links":2,"defined_names":7,"comments":1,"pivot_tables":0},"unopened":[],"bounds":{"document_bytes":16777216,"sheet_cells":100000,"rows_first":2000,"rows_last":500,"rows_between":2000,"halvings":0,"cell_chars":16384,"cell_head_chars":4096},"cells_cut":0,"cells_raw":0,"read":"whole","date_system":"1900"}

{"sheet":"handover.Form","index":0,"n_rows":54,"n_cols":20,"rows_kept":54,"cut":false,"hidden":false,"merged":[[50,2,50,4],[50,6,50,7],[50,9,50,10],[51,2,51,4],[51,6,51,7],[52,0,52,11],[42,7,42,8],[42,9,42,10],[44,1,45,10],[49,2,49,4],[49,6,49,7],[49,9,49,10],[7,2,7,3],[7,5,7,6],[7,8,7,9],[7,11,7,12],[8,2,8,3],[8,5,8,6],[8,8,8,9],[8,11,8,12]]}
[]
[]
[]
[]
[null,null,null,null,null,null,null,null,null,null,null,null,"التاريخ",{"$f":"TODAY()","v":"2022-11-07"}]
[null,"الكود","T10",null,null,null,null,null,null,null,null,null,"الموقع","الإدارة",null,null,"مشاريع بيشة",null,null,"المطلوب عند كتابة الكودفي الخلية C6 تظهر بيانات المركبة من الشيت المسمى ALL_DATA"]
[null,null,null,null,null,null,null,null,null,null,null,null,null,null,null,null,"خلاطة خرسانة بيشة",null,null,"وعند كتابة الكود في الخلية C48 يتم احضار البيانات من الشيت المسمى DRIVER"]
[null,"رقم اللوحة",{"$f":"IF(C6=\"\",\"\",_xlfn.XLOOKUP(C6,[1]All_Data!B5:B151,[1]All_Data!K5:K151,\"البيانات غير موجودة\",0,1))","v":"البيانات غير موجودة"},null,"اللون ",{"$f":"IF(C6=\"\",\"\",_xlfn.XLOOKUP(C6,[1]All_Data!B5:B151,[1]All_Data!J5:J151,\"البيانات غير موجودة\",0,1))","v":"البيانات غير موجودة"},null,"رقم الهيكل ",{"$f":"IF(C6=\"\",\"\",_xlfn.XLOOKUP(C6,[1]All_Data!B5:B151,[1]All_Data!L5:L151,\"البيانات غير موجودة\",0,1))","v":"البيانات غير موجودة"},null,"المالك",{"$f":"IF(C6=\"\",\"\",_xlfn.XLOOKUP(C6,[1]All_Data!B5:B151,[1]All_Data!M5:M151,\"البيانات غير موجودة\",0,1))","v":"البيانات غير موجودة"},null,null,null,null,"خلاطة خرسانة الصبيخة",null,null,"وبعد إضافة بيانات المستلم للمركبة يتم افراغ المحتواى الملون باللون الأصفر "]
[null,"وصف الاصل",{"$f":"IF(C6=\"\",\"\",_xlfn.XLOOKUP(C6,[1]All_Data!B5:B151,[1]All_Data!H5:H151,\"البيانات غير موجودة\",0,1))","v":"البيانات غير موجودة"},null,"الرقم التسلسلي ",{"$f":"IF(C6=\"\",\"\",_xlfn.XLOOKUP(C6,[1]All_Data!B5:B151,[1]All_Data!D5:D151,\"البيانات غير موجودة\",0,1))","v":"البيانات غير موجودة"},null,"الموديل ",{"$f":"IF(C6=\"\",\"\",_xlfn.XLOOKUP(C6,[1]All_Data!B5:B151,[1]All_Data!I5:I151,\"البيانات غير موجودة\",0,1))","v":"البيانات غير موجودة"},null,"الترخيص",{"$f":"IF(C6=\"\",\"\",_xlfn.XLOOKUP(C6,[1]All_Data!B5:B151,[1]All_Data!N5:N151,\"البيانات غير موجودة\",0,1))","v":"البيانات غير موجودة"},null,null,null,null,"خلاطة اسفلت بيشة"]
[null,null,null,null,null,null,null,null,null,null,null,null,null,null,null,null,"خلاطة اسفلت الصبيخة"]
[null,null,null,null,null,null,null,null,null,null,null,null,null,null,null,null,"كسارة بيشة"]
[null,null,null,null,null,null,null,null,null,null,null,null,null,null,null,null,"كسارة الصبيخة"]
[null,null,null,null,null,null,null,null,null,null,null,null,null,null,null,null,"عقد 806"]
[null,null,null,null,null,null,null,null,null,null,null,null,null,null,null,null,"عقد 810"]
[null,null,null,null,null,null,null,null,null,null,null,null,null,null,null,null,"وقائي 8006"]
[null,null,null,null,null,null,null,null,null,null,null,null,null,null,null,null,"الإدارة"]
[]
[]
[]
[]
[]
[]
[]
[]
[]
[]
[]
[]
[]
[]
[]
[]
[]
[null,null,null,null,null,null,null,null,null,null,null,null,null,null,null,null,null,"حالة الماكينة"]
[]
[]
[]
[]
[]
[]
{"$rows_left_out":15}
{"sheet":"DRIVER","index":1,"n_rows":4,"n_cols":15,"rows_kept":4,"cut":false,"hidden":false,"merged":[]}
["كود الموظف ","م","رقم اقامة الموظف","اسم الموظف","الجنسية ","حالة الموظف","موقع العمل ","الحالة","رقم الجوال","مهنة الاقامة","المهنة الفعلية ","رخصة القيادة","تاريخ انتهاء الإقامة"]
[4,1,2222222222,"لياقت علي باجوا عنايت الله","باكستان","على الكفالة","نقليات - التريلات","على راس العمل ","0500000000","سائق شاحنة","سائق تريلا","نقل ثقيل","2022-08-29"]
[]
[null,null,null,null,null,null,null,null,null,null,null,null,null,null,"استلامات السيارات والتفاويض.xlsm"]

{"sheet":"All_Data","index":2,"n_rows":154,"n_cols":43,"rows_kept":154,"cut":false,"hidden":false,"merged":[[1,0,1,4]]}
[]
["بيانات السيارات",null,null,null,null,null,null,null,{"$f":"TODAY()","v":"2022-11-07"},null,null,null,null,null,null,null,null,null,null,null,null,null,null,null,null,null,null,null,null,null,null,null,null,null,null,null,null,null,null,null,null,"الرقم التسلسلي","Rows"]
[null,null,null,null,null,null,null,null,null,null,null,null,null,null,null,null,null,null,null,null,null,null,null,null,null,null,null,null,null,null,null,null,null,null,null,null,null,null,null,null,null,2488345584,{"$f":"MATCH(AP3,#REF!,0)","v":{"$error":"#REF!"}}]
["م","كود المعدة","الرقم التسلسلي","الموقع","وصف الاصل","الموديل","اللون","رقم اللوحة","رقم الهيكل","المالك","الترخيص","ملاحظات",null,null,null,null,null,null,null,null,null,null,null,null,null,null,"الفحص ميلادي","المتبقي على الفحص","الاستمارة ميلادي","المتبقي على الاستمارة","التأمين ميلادي","المتبقي على التأمين","الرخصة ميلادي","المتبقي على رخصة القيادة","التفويض ميلادي","المتبقي على التفويض"]
[{"$f":"SUBTOTAL(3,$B$5:B5)","v":1},"TT1",17412710,"صيانة 810","وايت مياه - اكتروس",2007,"رصاصي","ب ر ا  8927","WDB9302031L153554",7009429445,"نقل خاص",null,null,null,null,null,null,null,null,null,null,null,null,null,null,null,null,{"$f":"I2-AC5","v":{"$error":"#NAME?"}},{"$f":"ConvertDate(#REF!)","v":{"$error":"#NAME?"}},null,{"$f":"ConvertDate(#REF!)","v":{"$error":"#NAME?"}},null,null,null,{"$f":"ConvertDate(#REF!)","v":{"$error":"#NAME?"}}]
[{"$f":"SUBTOTAL(3,$B$5:B6)","v":1},null,null,null,null,null,null,null,null,null,null,null,null,null,null,null,null,null,null,null,null,null,null,null,null,null,null,{"$f":"I3-AC6","v":{"$error":"#NAME?"}},{"$f":"ConvertDate(#REF!)","v":{"$error":"#NAME?"}},null,{"$f":"ConvertDate(#REF!)","v":{"$error":"#NAME?"}},null,null,null,{"$f":"ConvertDate(#REF!)","v":{"$error":"#NAME?"}}]
[{"$f":"SUBTOTAL(3,$B$5:B7)","v":1},null,null,null,null,null,null,null,null,null,null,null,null,null,null,null,null,null,null,null,null,null,null,null,null,null,null,{"$f":"I4-AC7","v":{"$error":"#VALUE!"}},{"$f":"ConvertDate(#REF!)","v":{"$error":"#NAME?"}},null,{"$f":"ConvertDate(#REF!)","v":{"$error":"#NAME?"}},null,null,null,{"$f":"ConvertDate(#REF!)","v":{"$error":"#NAME?"}}]
[{"$f":"SUBTOTAL(3,$B$5:B8)","v":1},null,null,null,null,null,null,null,null,null,null,null,null,null,null,null,null,null,null,null,null,null,null,null,null,null,null,{"$f":"I5-AC8","v":{"$error":"#VALUE!"}},{"$f":"ConvertDate(#REF!)","v":{"$error":"#NAME?"}},null,{"$f":"ConvertDate(#REF!)","v":{"$error":"#NAME?"}},null,null,null,{"$f":"ConvertDate(#REF!)","v":{"$error":"#NAME?"}}]
[{"$f":"SUBTOTAL(3,$B$5:B9)","v":1},null,null,null,null,null,null,null,null,null,null,null,null,null,null,null,null,null,null,null,null,null,null,null,null,null,null,{"$f":"I6-AC9","v":{"$error":"#NAME?"}},{"$f":"ConvertDate(#REF!)","v":{"$error":"#NAME?"}},null,{"$f":"ConvertDate(#REF!)","v":{"$error":"#NAME?"}},null,null,null,{"$f":"ConvertDate(#REF!)","v":{"$error":"#NAME?"}}]
[{"$f":"SUBTOTAL(3,$B$5:B10)","v":1},null,null,null,null,null,null,null,null,null,null,null,null,null,null,null,null,null,null,null,null,null,null,null,null,null,null,{"$f":"I7-AC10","v":{"$error":"#NAME?"}},{"$f":"ConvertDate(#REF!)","v":{"$error":"#NAME?"}},null,{"$f":"ConvertDate(#REF!)","v":{"$error":"#NAME?"}},null,null,null,{"$f":"ConvertDate(#REF!)","v":{"$error":"#NAME?"}}]
[{"$f":"SUBTOTAL(3,$B$5:B11)","v":1},null,null,null,null,null,null,null,null,null,null,null,null,null,null,null,null,null,null,null,null,null,null,null,null,null,null,{"$f":"I8-AC11","v":{"$error":"#NAME?"}},{"$f":"ConvertDate(#REF!)","v":{"$error":"#NAME?"}},null,{"$f":"ConvertDate(#REF!)","v":{"$error":"#NAME?"}},null,null,null,{"$f":"ConvertDate(#REF!)","v":{"$error":"#NAME?"}}]
[{"$f":"SUBTOTAL(3,$B$5:B12)","v":1},null,null,null,null,null,null,null,null,null,null,null,null,null,null,null,null,null,null,null,null,null,null,null,null,null,null,{"$f":"I9-AC12","v":{"$error":"#NAME?"}},{"$f":"ConvertDate(#REF!)","v":{"$error":"#NAME?"}},null,{"$f":"ConvertDate(#REF!)","v":{"$error":"#NAME?"}},null,null,null,{"$f":"ConvertDate(#REF!)","v":{"$error":"#NAME?"}}]
[{"$f":"SUBTOTAL(3,$B$5:B13)","v":1},null,null,null,null,null,null,null,null,null,null,null,null,null,null,null,null,null,null,null,null,null,null,null,null,null,null,{"$f":"I10-AC13","v":{"$error":"#NAME?"}},{"$f":"ConvertDate(#REF!)","v":{"$error":"#NAME?"}},null,{"$f":"ConvertDate(#REF!)","v":{"$error":"#NAME?"}},null,null,null,{"$f":"ConvertDate(#REF!)","v":{"$error":"#NAME?"}}]
[{"$f":"SUBTOTAL(3,$B$5:B14)","v":1},null,null,null,null,null,null,null,null,null,null,null,null,null,null,null,null,null,null,null,null,null,null,null,null,null,null,{"$f":"I11-AC14","v":{"$error":"#NAME?"}},{"$f":"ConvertDate(#REF!)","v":{"$error":"#NAME?"}},null,{"$f":"ConvertDate(#REF!)","v":{"$error":"#NAME?"}},null,null,null,{"$f":"ConvertDate(#REF!)","v":{"$error":"#NAME?"}}]
[{"$f":"SUBTOTAL(3,$B$5:B15)","v":1},null,null,null,null,null,null,null,null,null,null,null,null,null,null,null,null,null,null,null,null,null,null,null,null,null,null,{"$f":"I12-AC15","v":{"$error":"#NAME?"}},{"$f":"ConvertDate(#REF!)","v":{"$error":"#NAME?"}},null,{"$f":"ConvertDate(#REF!)","v":{"$error":"#NAME?"}},null,null,null,{"$f":"ConvertDate(#REF!)","v":{"$error":"#NAME?"}}]
[{"$f":"SUBTOTAL(3,$B$5:B16)","v":1},null,null,null,null,null,null,null,null,null,null,null,null,null,null,null,null,null,null,null,null,null,null,null,null,null,null,{"$f":"I13-AC16","v":{"$error":"#NAME?"}},{"$f":"ConvertDate(#REF!)","v":{"$error":"#NAME?"}},null,{"$f":"ConvertDate(#REF!)","v":{"$error":"#NAME?"}},null,null,null,{"$f":"ConvertDate(#REF!)","v":{"$error":"#NAME?"}}]
[{"$f":"SUBTOTAL(3,$B$5:B17)","v":1},null,null,null,null,null,null,null,null,null,null,null,null,null,null,null,null,null,null,null,null,null,null,null,null,null,null,{"$f":"I14-AC17","v":{"$error":"#NAME?"}},{"$f":"ConvertDate(#REF!)","v":{"$error":"#NAME?"}},null,{"$f":"ConvertDate(#REF!)","v":{"$error":"#NAME?"}},null,null,null,{"$f":"ConvertDate(#REF!)","v":{"$error":"#NAME?"}}]
[{"$f":"SUBTOTAL(3,$B$5:B18)","v":1},null,null,null,null,null,null,null,null,null,null,null,null,null,null,null,null,null,null,null,null,null,null,null,null,null,null,{"$f":"I15-AC18","v":{"$error":"#NAME?"}},{"$f":"ConvertDate(#REF!)","v":{"$error":"#NAME?"}},null,{"$f":"ConvertDate(#REF!)","v":{"$error":"#NAME?"}},null,null,null,{"$f":"ConvertDate(#REF!)","v":{"$error":"#NAME?"}}]
[{"$f":"SUBTOTAL(3,$B$5:B19)","v":1},null,null,null,null,null,null,null,null,null,null,null,null,null,null,null,null,null,null,null,null,null,null,null,null,null,null,{"$f":"I16-AC19","v":{"$error":"#NAME?"}},{"$f":"ConvertDate(#REF!)","v":{"$error":"#NAME?"}},null,{"$f":"ConvertDate(#REF!)","v":{"$error":"#NAME?"}},null,null,null,{"$f":"ConvertDate(#REF!)","v":{"$error":"#NAME?"}}]
[{"$f":"SUBTOTAL(3,$B$5:B20)","v":1},null,null,null,null,null,null,null,null,null,null,null,null,null,null,null,null,null,null,null,null,null,null,null,null,null,null,{"$f":"I17-AC20","v":{"$error":"#NAME?"}},{"$f":"ConvertDate(#REF!)","v":{"$error":"#NAME?"}},null,{"$f":"ConvertDate(#REF!)","v":{"$error":"#NAME?"}},null,null,null,{"$f":"ConvertDate(#REF!)","v":{"$error":"#NAME?"}}]
[{"$f":"SUBTOTAL(3,$B$5:B21)","v":1},null,null,null,null,null,null,null,null,null,null,null,null,null,null,null,null,null,null,null,null,null,null,null,null,null,null,{"$f":"I18-AC21","v":{"$error":"#NAME?"}},{"$f":"ConvertDate(#REF!)","v":{"$error":"#NAME?"}},null,{"$f":"ConvertDate(#REF!)","v":{"$error":"#NAME?"}},null,null,null,{"$f":"ConvertDate(#REF!)","v":{"$error":"#NAME?"}}]
[{"$f":"SUBTOTAL(3,$B$5:B22)","v":1},null,null,null,null,null,null,null,null,null,null,null,null,null,null,null,null,null,null,null,null,null,null,null,null,null,null,{"$f":"I19-AC22","v":{"$error":"#NAME?"}},{"$f":"ConvertDate(#REF!)","v":{"$error":"#NAME?"}},null,{"$f":"ConvertDate(#REF!)","v":{"$error":"#NAME?"}},null,null,null,{"$f":"ConvertDate(#REF!)","v":{"$error":"#NAME?"}}]
[{"$f":"SUBTOTAL(3,$B$5:B23)","v":1},null,null,null,null,null,null,null,null,null,null,null,null,null,null,null,null,null,null,null,null,null,null,null,null,null,null,{"$f":"I20-AC23","v":{"$error":"#NAME?"}},{"$f":"ConvertDate(#REF!)","v":{"$error":"#NAME?"}},null,{"$f":"ConvertDate(#REF!)","v":{"$error":"#NAME?"}},null,null,null,{"$f":"ConvertDate(#REF!)","v":{"$error":"#NAME?"}}]
[{"$f":"SUBTOTAL(3,$B$5:B24)","v":1},null,null,null,null,null,null,null,null,null,null,null,null,null,null,null,null,null,null,null,null,null,null,null,null,null,null,{"$f":"I21-AC24","v":{"$error":"#NAME?"}},{"$f":"ConvertDate(#REF!)","v":{"$error":"#NAME?"}},null,{"$f":"ConvertDate(#REF!)","v":{"$error":"#NAME?"}},null,null,null,{"$f":"ConvertDate(#REF!)","v":{"$error":"#NAME?"}}]
[{"$f":"SUBTOTAL(3,$B$5:B25)","v":1},null,null,null,null,null,null,null,null,null,null,null,null,null,null,null,null,null,null,null,null,null,null,null,null,null,null,{"$f":"I22-AC25","v":{"$error":"#NAME?"}},{"$f":"ConvertDate(#REF!)","v":{"$error":"#NAME?"}},null,{"$f":"ConvertDate(#REF!)","v":{"$error":"#NAME?"}},null,null,null,{"$f":"ConvertDate(#REF!)","v":{"$error":"#NAME?"}}]
[{"$f":"SUBTOTAL(3,$B$5:B26)","v":1},null,null,null,null,null,null,null,null,null,null,null,null,null,null,null,null,null,null,null,null,null,null,null,null,null,null,{"$f":"I23-AC26","v":{"$error":"#NAME?"}},{"$f":"ConvertDate(#REF!)","v":{"$error":"#NAME?"}},null,{"$f":"ConvertDate(#REF!)","v":{"$error":"#NAME?"}},null,null,null,{"$f":"ConvertDate(#REF!)","v":{"$error":"#NAME?"}}]
[{"$f":"SUBTOTAL(3,$B$5:B27)","v":1},null,null,null,null,null,null,null,null,null,null,null,null,null,null,null,null,null,null,null,null,null,null,null,null,null,null,{"$f":"I24-AC27","v":{"$error":"#NAME?"}},{"$f":"ConvertDate(#REF!)","v":{"$error":"#NAME?"}},null,{"$f":"ConvertDate(#REF!)","v":{"$error":"#NAME?"}},null,null,null,{"$f":"ConvertDate(#REF!)","v":{"$error":"#NAME?"}}]
[{"$f":"SUBTOTAL(3,$B$5:B28)","v":1},null,null,null,null,null,null,null,null,null,null,null,null,null,null,null,null,null,null,null,null,null,null,null,null,null,null,{"$f":"I25-AC28","v":{"$error":"#NAME?"}},{"$f":"ConvertDate(#REF!)","v":{"$error":"#NAME?"}},null,{"$f":"ConvertDate(#REF!)","v":{"$error":"#NAME?"}},null,null,null,{"$f":"ConvertDate(#REF!)","v":{"$error":"#NAME?"}}]
[{"$f":"SUBTOTAL(3,$B$5:B29)","v":1},null,null,null,null,null,null,null,null,null,null,null,null,null,null,null,null,null,null,null,null,null,null,null,null,null,null,{"$f":"I26-AC29","v":{"$error":"#NAME?"}},{"$f":"ConvertDate(#REF!)","v":{"$error":"#NAME?"}},null,{"$f":"ConvertDate(#REF!)","v":{"$error":"#NAME?"}},null,null,null,{"$f":"ConvertDate(#REF!)","v":{"$error":"#NAME?"}}]
[{"$f":"SUBTOTAL(3,$B$5:B30)","v":1},null,null,null,null,null,null,null,null,null,null,null,null,null,null,null,null,null,null,null,null,null,null,null,null,null,null,{"$f":"I27-AC30","v":{"$error":"#NAME?"}},{"$f":"ConvertDate(#REF!)","v":{"$error":"#NAME?"}},null,{"$f":"ConvertDate(#REF!)","v":{"$error":"#NAME?"}},null,null,null,{"$f":"ConvertDate(#REF!)","v":{"$error":"#NAME?"}}]
[{"$f":"SUBTOTAL(3,$B$5:B31)","v":1},null,null,null,null,null,null,null,null,null,null,null,null,null,null,null,null,null,null,null,null,null,null,null,null,null,null,{"$f":"I28-AC31","v":{"$error":"#NAME?"}},{"$f":"ConvertDate(#REF!)","v":{"$error":"#NAME?"}},null,{"$f":"ConvertDate(#REF!)","v":{"$error":"#NAME?"}},null,null,null,{"$f":"ConvertDate(#REF!)","v":{"$error":"#NAME?"}}]
[{"$f":"SUBTOTAL(3,$B$5:B32)","v":1},null,null,null,null,null,null,null,null,null,null,null,null,null,null,null,null,null,null,null,null,null,null,null,null,null,null,{"$f":"I29-AC32","v":{"$error":"#NAME?"}},{"$f":"ConvertDate(#REF!)","v":{"$error":"#NAME?"}},null,{"$f":"ConvertDate(#REF!)","v":{"$error":"#NAME?"}},null,null,null,{"$f":"ConvertDate(#REF!)","v":{"$error":"#NAME?"}}]
[{"$f":"SUBTOTAL(3,$B$5:B33)","v":1},null,null,null,null,null,null,null,null,null,null,null,null,null,null,null,null,null,null,null,null,null,null,null,null,null,null,{"$f":"I30-AC33","v":{"$error":"#NAME?"}},{"$f":"ConvertDate(#REF!)","v":{"$error":"#NAME?"}},null,{"$f":"ConvertDate(#REF!)","v":{"$error":"#NAME?"}},null,null,null,{"$f":"ConvertDate(#REF!)","v":{"$error":"#NAME?"}}]
[{"$f":"SUBTOTAL(3,$B$5:B34)","v":1},null,null,null,null,null,null,null,null,null,null,null,null,null,null,null,null,null,null,null,null,null,null,null,null,null,null,{"$f":"I31-AC34","v":{"$error":"#NAME?"}},{"$f":"ConvertDate(#REF!)","v":{"$error":"#NAME?"}},null,{"$f":"ConvertDate(#REF!)","v":{"$error":"#NAME?"}},null,null,null,{"$f":"ConvertDate(#REF!)","v":{"$error":"#NAME?"}}]
[{"$f":"SUBTOTAL(3,$B$5:B35)","v":1},null,null,null,null,null,null,null,null,null,null,null,null,null,null,null,null,null,null,null,null,null,null,null,null,null,null,{"$f":"I32-AC35","v":{"$error":"#NAME?"}},{"$f":"ConvertDate(#REF!)","v":{"$error":"#NAME?"}},null,{"$f":"ConvertDate(#REF!)","v":{"$error":"#NAME?"}},null,null,null,{"$f":"ConvertDate(#REF!)","v":{"$error":"#NAME?"}}]
[{"$f":"SUBTOTAL(3,$B$5:B36)","v":1},null,null,null,null,null,null,null,null,null,null,null,null,null,null,null,null,null,null,null,null,null,null,null,null,null,null,{"$f":"I33-AC36","v":{"$error":"#NAME?"}},{"$f":"ConvertDate(#REF!)","v":{"$error":"#NAME?"}},null,{"$f":"ConvertDate(#REF!)","v":{"$error":"#NAME?"}},null,null,null,{"$f":"ConvertDate(#REF!)","v":{"$error":"#NAME?"}}]
[{"$f":"SUBTOTAL(3,$B$5:B37)","v":1},null,null,null,null,null,null,null,null,null,null,null,null,null,null,null,null,null,null,null,null,null,null,null,null,null,null,{"$f":"I34-AC37","v":{"$error":"#NAME?"}},{"$f":"ConvertDate(#REF!)","v":{"$error":"#NAME?"}},null,{"$f":"ConvertDate(#REF!)","v":{"$error":"#NAME?"}},null,null,null,{"$f":"ConvertDate(#REF!)","v":{"$error":"#NAME?"}}]
[{"$f":"SUBTOTAL(3,$B$5:B38)","v":1},null,null,null,null,null,null,null,null,null,null,null,null,null,null,null,null,null,null,null,null,null,null,null,null,null,null,{"$f":"I35-AC38","v":{"$error":"#NAME?"}},{"$f":"ConvertDate(#REF!)","v":{"$error":"#NAME?"}},null,{"$f":"ConvertDate(#REF!)","v":{"$error":"#NAME?"}},null,null,null,{"$f":"ConvertDate(#REF!)","v":{"$error":"#NAME?"}}]
[{"$f":"SUBTOTAL(3,$B$5:B39)","v":1},null,null,null,null,null,null,null,null,null,null,null,null,null,null,null,null,null,null,null,null,null,null,null,null,null,null,{"$f":"I36-AC39","v":{"$error":"#NAME?"}},{"$f":"ConvertDate(#REF!)","v":{"$error":"#NAME?"}},null,{"$f":"ConvertDate(#REF!)","v":{"$error":"#NAME?"}},null,null,null,{"$f":"ConvertDate(#REF!)","v":{"$error":"#NAME?"}}]
[{"$f":"SUBTOTAL(3,$B$5:B40)","v":1},null,null,null,null,null,null,null,null,null,null,null,null,null,null,null,null,null,null,null,null,null,null,null,null,null,null,{"$f":"I37-AC40","v":{"$error":"#NAME?"}},{"$f":"ConvertDate(#REF!)","v":{"$error":"#NAME?"}},null,{"$f":"ConvertDate(#REF!)","v":{"$error":"#NAME?"}},null,null,null,{"$f":"ConvertDate(#REF!)","v":{"$error":"#NAME?"}}]
{"$rows_left_out":114}